struts-dev mailing list archives

Site index · List index
Message view « Date » · « Thread »
Top « Date » · « Thread »
From Apache Jenkins Server <jenk...@builds.apache.org>
Subject Build failed in Jenkins: Struts-master-JDK7 #39
Date Sun, 22 Oct 2017 08:34:07 GMT
See <https://builds.apache.org/job/Struts-master-JDK7/39/display/redirect?page=changes>

Changes:

[Lukasz Lenart] Uses new docs location when preparing packages

------------------------------------------
[...truncated 4.10 MB...]
     [exec] 2017-10-22 08:33:28 URL:http://struts.apache.org/tag-developers/form-tags.html
[23707/23707] -> "<https://builds.apache.org/job/Struts-master-JDK7/ws/assembly/target/docs/tag-developers/form-tags.html">
[1]
     [exec] 2017-10-22 08:33:28 URL:http://struts.apache.org/tag-developers/template-loading.html
[12810/12810] -> "<https://builds.apache.org/job/Struts-master-JDK7/ws/assembly/target/docs/tag-developers/template-loading.html">
[1]
     [exec] 2017-10-22 08:33:28 URL:http://struts.apache.org/tag-developers/selecting-template-directory.html
[8920/8920] -> "<https://builds.apache.org/job/Struts-master-JDK7/ws/assembly/target/docs/tag-developers/selecting-template-directory.html">
[1]
     [exec] 2017-10-22 08:33:28 URL:http://struts.apache.org/tag-developers/selecting-themes.html
[9377/9377] -> "<https://builds.apache.org/job/Struts-master-JDK7/ws/assembly/target/docs/tag-developers/selecting-themes.html">
[1]
     [exec] 2017-10-22 08:33:28 URL:http://struts.apache.org/tag-developers/extending-themes.html
[14299/14299] -> "<https://builds.apache.org/job/Struts-master-JDK7/ws/assembly/target/docs/tag-developers/extending-themes.html">
[1]
     [exec] 2017-10-22 08:33:28 URL:http://struts.apache.org/tag-developers/simple-theme.html
[10604/10604] -> "<https://builds.apache.org/job/Struts-master-JDK7/ws/assembly/target/docs/tag-developers/simple-theme.html">
[1]
     [exec] 2017-10-22 08:33:28 URL:http://struts.apache.org/tag-developers/xhtml-theme.html
[33779/33779] -> "<https://builds.apache.org/job/Struts-master-JDK7/ws/assembly/target/docs/tag-developers/xhtml-theme.html">
[1]
     [exec] 2017-10-22 08:33:28 URL:http://struts.apache.org/tag-developers/css-xhtml-theme.html
[23235/23235] -> "<https://builds.apache.org/job/Struts-master-JDK7/ws/assembly/target/docs/tag-developers/css-xhtml-theme.html">
[1]
     [exec] 2017-10-22 08:33:28 URL:http://struts.apache.org/tag-developers/ajax-theme.html
[12101/12101] -> "<https://builds.apache.org/job/Struts-master-JDK7/ws/assembly/target/docs/tag-developers/ajax-theme.html">
[1]
     [exec] 2017-10-22 08:33:28 URL:http://struts.apache.org/tag-developers/if-tag.html [10100/10100]
-> "<https://builds.apache.org/job/Struts-master-JDK7/ws/assembly/target/docs/tag-developers/if-tag.html">
[1]
     [exec] 2017-10-22 08:33:29 URL:http://struts.apache.org/tag-developers/a-tag.html [32630/32630]
-> "<https://builds.apache.org/job/Struts-master-JDK7/ws/assembly/target/docs/tag-developers/a-tag.html">
[1]
     [exec] 2017-10-22 08:33:29 URL:http://struts.apache.org/tag-developers/elseif-tag.html
[10083/10083] -> "<https://builds.apache.org/job/Struts-master-JDK7/ws/assembly/target/docs/tag-developers/elseif-tag.html">
[1]
     [exec] 2017-10-22 08:33:29 URL:http://struts.apache.org/tag-developers/action-tag.html
[16539/16539] -> "<https://builds.apache.org/job/Struts-master-JDK7/ws/assembly/target/docs/tag-developers/action-tag.html">
[1]
     [exec] 2017-10-22 08:33:29 URL:http://struts.apache.org/tag-developers/else-tag.html
[9710/9710] -> "<https://builds.apache.org/job/Struts-master-JDK7/ws/assembly/target/docs/tag-developers/else-tag.html">
[1]
     [exec] 2017-10-22 08:33:29 URL:http://struts.apache.org/tag-developers/bean-tag.html
[11924/11924] -> "<https://builds.apache.org/job/Struts-master-JDK7/ws/assembly/target/docs/tag-developers/bean-tag.html">
[1]
     [exec] 2017-10-22 08:33:29 URL:http://struts.apache.org/tag-developers/append-tag.html
[14581/14581] -> "<https://builds.apache.org/job/Struts-master-JDK7/ws/assembly/target/docs/tag-developers/append-tag.html">
[1]
     [exec] 2017-10-22 08:33:29 URL:http://struts.apache.org/tag-developers/date-tag.html
[13493/13493] -> "<https://builds.apache.org/job/Struts-master-JDK7/ws/assembly/target/docs/tag-developers/date-tag.html">
[1]
     [exec] 2017-10-22 08:33:29 URL:http://struts.apache.org/tag-developers/generator-tag.html
[13936/13936] -> "<https://builds.apache.org/job/Struts-master-JDK7/ws/assembly/target/docs/tag-developers/generator-tag.html">
[1]
     [exec] 2017-10-22 08:33:29 URL:http://struts.apache.org/tag-developers/debug-tag.html
[7977/7977] -> "<https://builds.apache.org/job/Struts-master-JDK7/ws/assembly/target/docs/tag-developers/debug-tag.html">
[1]
     [exec] 2017-10-22 08:33:29 URL:http://struts.apache.org/tag-developers/iterator-tag.html
[20457/20457] -> "<https://builds.apache.org/job/Struts-master-JDK7/ws/assembly/target/docs/tag-developers/iterator-tag.html">
[1]
     [exec] 2017-10-22 08:33:29 URL:http://struts.apache.org/tag-developers/i18n-tag.html
[9800/9800] -> "<https://builds.apache.org/job/Struts-master-JDK7/ws/assembly/target/docs/tag-developers/i18n-tag.html">
[1]
     [exec] 2017-10-22 08:33:29 URL:http://struts.apache.org/tag-developers/merge-tag.html
[14891/14891] -> "<https://builds.apache.org/job/Struts-master-JDK7/ws/assembly/target/docs/tag-developers/merge-tag.html">
[1]
     [exec] 2017-10-22 08:33:30 URL:http://struts.apache.org/tag-developers/include-tag.html
[10364/10364] -> "<https://builds.apache.org/job/Struts-master-JDK7/ws/assembly/target/docs/tag-developers/include-tag.html">
[1]
     [exec] 2017-10-22 08:33:30 URL:http://struts.apache.org/tag-developers/sort-tag.html
[11334/11334] -> "<https://builds.apache.org/job/Struts-master-JDK7/ws/assembly/target/docs/tag-developers/sort-tag.html">
[1]
     [exec] 2017-10-22 08:33:30 URL:http://struts.apache.org/tag-developers/param-tag.html
[13374/13374] -> "<https://builds.apache.org/job/Struts-master-JDK7/ws/assembly/target/docs/tag-developers/param-tag.html">
[1]
     [exec] 2017-10-22 08:33:30 URL:http://struts.apache.org/tag-developers/subset-tag.html
[17689/17689] -> "<https://builds.apache.org/job/Struts-master-JDK7/ws/assembly/target/docs/tag-developers/subset-tag.html">
[1]
     [exec] 2017-10-22 08:33:30 URL:http://struts.apache.org/tag-developers/property-tag.html
[11935/11935] -> "<https://builds.apache.org/job/Struts-master-JDK7/ws/assembly/target/docs/tag-developers/property-tag.html">
[1]
     [exec] 2017-10-22 08:33:30 URL:http://struts.apache.org/tag-developers/push-tag.html
[13039/13039] -> "<https://builds.apache.org/job/Struts-master-JDK7/ws/assembly/target/docs/tag-developers/push-tag.html">
[1]
     [exec] 2017-10-22 08:33:30 URL:http://struts.apache.org/tag-developers/set-tag.html [11934/11934]
-> "<https://builds.apache.org/job/Struts-master-JDK7/ws/assembly/target/docs/tag-developers/set-tag.html">
[1]
     [exec] 2017-10-22 08:33:30 URL:http://struts.apache.org/tag-developers/text-tag.html
[13214/13214] -> "<https://builds.apache.org/job/Struts-master-JDK7/ws/assembly/target/docs/tag-developers/text-tag.html">
[1]
     [exec] 2017-10-22 08:33:30 URL:http://struts.apache.org/tag-developers/url-tag.html [16086/16086]
-> "<https://builds.apache.org/job/Struts-master-JDK7/ws/assembly/target/docs/tag-developers/url-tag.html">
[1]
     [exec] 2017-10-22 08:33:30 URL:http://struts.apache.org/tag-developers/checkbox-tag.html
[25263/25263] -> "<https://builds.apache.org/job/Struts-master-JDK7/ws/assembly/target/docs/tag-developers/checkbox-tag.html">
[1]
     [exec] 2017-10-22 08:33:30 URL:http://struts.apache.org/tag-developers/actionerror-tag.html
[24591/24591] -> "<https://builds.apache.org/job/Struts-master-JDK7/ws/assembly/target/docs/tag-developers/actionerror-tag.html">
[1]
     [exec] 2017-10-22 08:33:30 URL:http://struts.apache.org/tag-developers/checkboxlist-tag.html
[27519/27519] -> "<https://builds.apache.org/job/Struts-master-JDK7/ws/assembly/target/docs/tag-developers/checkboxlist-tag.html">
[1]
     [exec] 2017-10-22 08:33:31 URL:http://struts.apache.org/tag-developers/actionmessage-tag.html
[24590/24590] -> "<https://builds.apache.org/job/Struts-master-JDK7/ws/assembly/target/docs/tag-developers/actionmessage-tag.html">
[1]
     [exec] 2017-10-22 08:33:31 URL:http://struts.apache.org/tag-developers/combobox-tag.html
[29411/29411] -> "<https://builds.apache.org/job/Struts-master-JDK7/ws/assembly/target/docs/tag-developers/combobox-tag.html">
[1]
     [exec] 2017-10-22 08:33:31 URL:http://struts.apache.org/tag-developers/component-tag.html
[28051/28051] -> "<https://builds.apache.org/job/Struts-master-JDK7/ws/assembly/target/docs/tag-developers/component-tag.html">
[1]
     [exec] 2017-10-22 08:33:31 URL:http://struts.apache.org/tag-developers/datetextfield-tag.html
[24693/24693] -> "<https://builds.apache.org/job/Struts-master-JDK7/ws/assembly/target/docs/tag-developers/datetextfield-tag.html">
[1]
     [exec] 2017-10-22 08:33:31 URL:http://struts.apache.org/tag-developers/div-tag.html [24477/24477]
-> "<https://builds.apache.org/job/Struts-master-JDK7/ws/assembly/target/docs/tag-developers/div-tag.html">
[1]
     [exec] 2017-10-22 08:33:31 URL:http://struts.apache.org/tag-developers/doubleselect-tag.html
[41719/41719] -> "<https://builds.apache.org/job/Struts-master-JDK7/ws/assembly/target/docs/tag-developers/doubleselect-tag.html">
[1]
     [exec] 2017-10-22 08:33:31 URL:http://struts.apache.org/tag-developers/fielderror-tag.html
[26066/26066] -> "<https://builds.apache.org/job/Struts-master-JDK7/ws/assembly/target/docs/tag-developers/fielderror-tag.html">
[1]
     [exec] 2017-10-22 08:33:31 URL:http://struts.apache.org/tag-developers/head-tag.html
[24280/24280] -> "<https://builds.apache.org/job/Struts-master-JDK7/ws/assembly/target/docs/tag-developers/head-tag.html">
[1]
     [exec] 2017-10-22 08:33:31 URL:http://struts.apache.org/tag-developers/file-tag.html
[25097/25097] -> "<https://builds.apache.org/job/Struts-master-JDK7/ws/assembly/target/docs/tag-developers/file-tag.html">
[1]
     [exec] 2017-10-22 08:33:31 URL:http://struts.apache.org/tag-developers/form-tag.html
[30292/30292] -> "<https://builds.apache.org/job/Struts-master-JDK7/ws/assembly/target/docs/tag-developers/form-tag.html">
[1]
     [exec] 2017-10-22 08:33:31 URL:http://struts.apache.org/tag-developers/hidden-tag.html
[25325/25325] -> "<https://builds.apache.org/job/Struts-master-JDK7/ws/assembly/target/docs/tag-developers/hidden-tag.html">
[1]
     [exec] 2017-10-22 08:33:32 URL:http://struts.apache.org/tag-developers/inputtransferselect-tag.html
[32533/32533] -> "<https://builds.apache.org/job/Struts-master-JDK7/ws/assembly/target/docs/tag-developers/inputtransferselect-tag.html">
[1]
     [exec] 2017-10-22 08:33:32 URL:http://struts.apache.org/tag-developers/label-tag.html
[24930/24930] -> "<https://builds.apache.org/job/Struts-master-JDK7/ws/assembly/target/docs/tag-developers/label-tag.html">
[1]
     [exec] 2017-10-22 08:33:32 URL:http://struts.apache.org/tag-developers/optiontransferselect-tag.html
[51201/51201] -> "<https://builds.apache.org/job/Struts-master-JDK7/ws/assembly/target/docs/tag-developers/optiontransferselect-tag.html">
[1]
     [exec] 2017-10-22 08:33:32 URL:http://struts.apache.org/tag-developers/optgroup-tag.html
[11618/11618] -> "<https://builds.apache.org/job/Struts-master-JDK7/ws/assembly/target/docs/tag-developers/optgroup-tag.html">
[1]
     [exec] 2017-10-22 08:33:32 URL:http://struts.apache.org/tag-developers/password-tag.html
[26597/26597] -> "<https://builds.apache.org/job/Struts-master-JDK7/ws/assembly/target/docs/tag-developers/password-tag.html">
[1]
     [exec] 2017-10-22 08:33:32 URL:http://struts.apache.org/tag-developers/radio-tag.html
[28401/28401] -> "<https://builds.apache.org/job/Struts-master-JDK7/ws/assembly/target/docs/tag-developers/radio-tag.html">
[1]
     [exec] 2017-10-22 08:33:32 URL:http://struts.apache.org/tag-developers/reset-tag.html
[26859/26859] -> "<https://builds.apache.org/job/Struts-master-JDK7/ws/assembly/target/docs/tag-developers/reset-tag.html">
[1]
     [exec] 2017-10-22 08:33:32 URL:http://struts.apache.org/tag-developers/select-tag.html
[31001/31001] -> "<https://builds.apache.org/job/Struts-master-JDK7/ws/assembly/target/docs/tag-developers/select-tag.html">
[1]
     [exec] 2017-10-22 08:33:32 URL:http://struts.apache.org/tag-developers/submit-tag.html
[27256/27256] -> "<https://builds.apache.org/job/Struts-master-JDK7/ws/assembly/target/docs/tag-developers/submit-tag.html">
[1]
     [exec] 2017-10-22 08:33:32 URL:http://struts.apache.org/tag-developers/textarea-tag.html
[25611/25611] -> "<https://builds.apache.org/job/Struts-master-JDK7/ws/assembly/target/docs/tag-developers/textarea-tag.html">
[1]
     [exec] 2017-10-22 08:33:32 URL:http://struts.apache.org/tag-developers/textfield-tag.html
[26032/26032] -> "<https://builds.apache.org/job/Struts-master-JDK7/ws/assembly/target/docs/tag-developers/textfield-tag.html">
[1]
     [exec] 2017-10-22 08:33:32 URL:http://struts.apache.org/tag-developers/token-tag.html
[24345/24345] -> "<https://builds.apache.org/job/Struts-master-JDK7/ws/assembly/target/docs/tag-developers/token-tag.html">
[1]
     [exec] 2017-10-22 08:33:33 URL:http://struts.apache.org/tag-developers/updownselect-tag.html
[33059/33059] -> "<https://builds.apache.org/job/Struts-master-JDK7/ws/assembly/target/docs/tag-developers/updownselect-tag.html">
[1]
     [exec] 2017-10-22 08:33:33 URL:http://struts.apache.org/tag-developers/ui-tag-reference.html
[10591/10591] -> "<https://builds.apache.org/job/Struts-master-JDK7/ws/assembly/target/docs/tag-developers/ui-tag-reference.html">
[1]
     [exec] http://struts.apache.org/tag-developers/dojo-href-tag.html:
     [exec] 2017-10-22 08:33:33 ERROR 404: Not Found.
     [exec] 2017-10-22 08:33:33 URL:http://struts.apache.org/tag-developers/dojo-autocompleter-tag.html
[41761/41761] -> "<https://builds.apache.org/job/Struts-master-JDK7/ws/assembly/target/docs/tag-developers/dojo-autocompleter-tag.html">
[1]
     [exec] 2017-10-22 08:33:33 URL:http://struts.apache.org/tag-developers/dojo-bind-tag.html
[25441/25441] -> "<https://builds.apache.org/job/Struts-master-JDK7/ws/assembly/target/docs/tag-developers/dojo-bind-tag.html">
[1]
     [exec] 2017-10-22 08:33:33 URL:http://struts.apache.org/tag-developers/dojo-datetimepicker-tag.html
[32471/32471] -> "<https://builds.apache.org/job/Struts-master-JDK7/ws/assembly/target/docs/tag-developers/dojo-datetimepicker-tag.html">
[1]
     [exec] 2017-10-22 08:33:33 URL:http://struts.apache.org/tag-developers/dojo-div-tag.html
[37164/37164] -> "<https://builds.apache.org/job/Struts-master-JDK7/ws/assembly/target/docs/tag-developers/dojo-div-tag.html">
[1]
     [exec] 2017-10-22 08:33:33 URL:http://struts.apache.org/tag-developers/dojo-head-tag.html
[15783/15783] -> "<https://builds.apache.org/job/Struts-master-JDK7/ws/assembly/target/docs/tag-developers/dojo-head-tag.html">
[1]
     [exec] 2017-10-22 08:33:33 URL:http://struts.apache.org/tag-developers/dojo-submit-tag.html
[40428/40428] -> "<https://builds.apache.org/job/Struts-master-JDK7/ws/assembly/target/docs/tag-developers/dojo-submit-tag.html">
[1]
     [exec] 2017-10-22 08:33:33 URL:http://struts.apache.org/tag-developers/dojo-tabbedpanel-tag.html
[35876/35876] -> "<https://builds.apache.org/job/Struts-master-JDK7/ws/assembly/target/docs/tag-developers/dojo-tabbedpanel-tag.html">
[1]
     [exec] 2017-10-22 08:33:34 URL:http://struts.apache.org/tag-developers/dojo-textarea-tag.html
[24637/24637] -> "<https://builds.apache.org/job/Struts-master-JDK7/ws/assembly/target/docs/tag-developers/dojo-textarea-tag.html">
[1]
     [exec] 2017-10-22 08:33:34 URL:http://struts.apache.org/tag-developers/dojo-tree-tag.html
[37392/37392] -> "<https://builds.apache.org/job/Struts-master-JDK7/ws/assembly/target/docs/tag-developers/dojo-tree-tag.html">
[1]
     [exec] 2017-10-22 08:33:34 URL:http://struts.apache.org/tag-developers/dojo-treenode-tag.html
[26527/26527] -> "<https://builds.apache.org/job/Struts-master-JDK7/ws/assembly/target/docs/tag-developers/dojo-treenode-tag.html">
[1]
     [exec] 2017-10-22 08:33:34 URL:http://struts.apache.org/tag-developers/access-to-valuestack-from-jsps.html
[16373/16373] -> "<https://builds.apache.org/job/Struts-master-JDK7/ws/assembly/target/docs/tag-developers/access-to-valuestack-from-jsps.html">
[1]
     [exec] http://struts.apache.org/tag-developers/tags.html:
     [exec] 2017-10-22 08:33:34 ERROR 404: Not Found.
     [exec] http://struts.apache.org/tag-developers/ogn.html:
     [exec] 2017-10-22 08:33:34 ERROR 404: Not Found.
     [exec] http://struts.apache.org/tag-developers/css-xhtml-theme.xhtml:
     [exec] 2017-10-22 08:33:34 ERROR 404: Not Found.
     [exec] http://struts.apache.org/tag-developers/form-tag.htmk:
     [exec] 2017-10-22 08:33:34 ERROR 404: Not Found.
     [exec] 2017-10-22 08:33:34 URL:http://struts.apache.org/tag-developers/dojo-a-tag.html
[37911/37911] -> "<https://builds.apache.org/job/Struts-master-JDK7/ws/assembly/target/docs/tag-developers/dojo-a-tag.html">
[1]
     [exec] 2017-10-22 08:33:34 URL:http://struts.apache.org/tag-developers/ajax-head-template.html
[18587/18587] -> "<https://builds.apache.org/job/Struts-master-JDK7/ws/assembly/target/docs/tag-developers/ajax-head-template.html">
[1]
     [exec] 2017-10-22 08:33:35 URL:http://struts.apache.org/tag-developers/ajax-div-template.html
[19743/19743] -> "<https://builds.apache.org/job/Struts-master-JDK7/ws/assembly/target/docs/tag-developers/ajax-div-template.html">
[1]
     [exec] 2017-10-22 08:33:35 URL:http://struts.apache.org/tag-developers/ajax-a-template.html
[9586/9586] -> "<https://builds.apache.org/job/Struts-master-JDK7/ws/assembly/target/docs/tag-developers/ajax-a-template.html">
[1]
     [exec] 2017-10-22 08:33:35 URL:http://struts.apache.org/tag-developers/ajax-event-system.html
[10990/10990] -> "<https://builds.apache.org/job/Struts-master-JDK7/ws/assembly/target/docs/tag-developers/ajax-event-system.html">
[1]
     [exec] http://struts.apache.org/tag-developers/head-tag.htlm:
     [exec] 2017-10-22 08:33:35 ERROR 404: Not Found.
     [exec] http://struts.apache.org/tag-developers/autocompleter-tag.html:
     [exec] 2017-10-22 08:33:35 ERROR 404: Not Found.
     [exec] http://struts.apache.org/tag-developers/bind-tag.html:
     [exec] 2017-10-22 08:33:35 ERROR 404: Not Found.
     [exec] http://struts.apache.org/tag-developers/datetimepicker-tag.html:
     [exec] 2017-10-22 08:33:35 ERROR 404: Not Found.
     [exec] http://struts.apache.org/tag-developers/tabbed-tag.html:
     [exec] 2017-10-22 08:33:35 ERROR 404: Not Found.
     [exec] http://struts.apache.org/tag-developers/tree-tag.html:
     [exec] 2017-10-22 08:33:35 ERROR 404: Not Found.
     [exec] http://struts.apache.org/tag-developers/treenode-tag.html:
     [exec] 2017-10-22 08:33:35 ERROR 404: Not Found.
     [exec] 2017-10-22 08:33:35 URL:http://struts.apache.org/maven-archetypes/ [22310/22310]
-> "<https://builds.apache.org/job/Struts-master-JDK7/ws/assembly/target/docs/maven-archetypes/index.html">
[1]
     [exec] 2017-10-22 08:33:35 URL:http://struts.apache.org/maven-archetypes/struts2-archetype-blank.html
[23604/23604] -> "<https://builds.apache.org/job/Struts-master-JDK7/ws/assembly/target/docs/maven-archetypes/struts2-archetype-blank.html">
[1]
     [exec] 2017-10-22 08:33:36 URL:http://struts.apache.org/maven-archetypes/index.html [22310/22310]
-> "<https://builds.apache.org/job/Struts-master-JDK7/ws/assembly/target/docs/maven-archetypes/index.html">
[1]
     [exec] 2017-10-22 08:33:36 URL:http://struts.apache.org/plugins/ [10135/10135] ->
"<https://builds.apache.org/job/Struts-master-JDK7/ws/assembly/target/docs/plugins/index.html">
[1]
     [exec] 2017-10-22 08:33:36 URL:http://struts.apache.org/plugins/plugins.html [39614/39614]
-> "<https://builds.apache.org/job/Struts-master-JDK7/ws/assembly/target/docs/plugins/plugins.html">
[1]
     [exec] http://struts.apache.org/plugins/extending-an-application-with-custom-plugins.html:
     [exec] 2017-10-22 08:33:36 ERROR 404: Not Found.
     [exec] 2017-10-22 08:33:36 URL:http://struts.apache.org/plugins/bean-validation/ [28145/28145]
-> "<https://builds.apache.org/job/Struts-master-JDK7/ws/assembly/target/docs/plugins/bean-validation.html">
[1]
     [exec] 2017-10-22 08:33:36 URL:http://struts.apache.org/plugins/cdi/ [40844/40844] ->
"<https://builds.apache.org/job/Struts-master-JDK7/ws/assembly/target/docs/plugins/cdi.html">
[1]
     [exec] 2017-10-22 08:33:36 URL:http://struts.apache.org/plugins/codebehind/ [14976/14976]
-> "<https://builds.apache.org/job/Struts-master-JDK7/ws/assembly/target/docs/plugins/codebehind.html">
[1]
     [exec] 2017-10-22 08:33:37 URL:http://struts.apache.org/plugins/config-browser/ [9351/9351]
-> "<https://builds.apache.org/job/Struts-master-JDK7/ws/assembly/target/docs/plugins/config-browser.html">
[1]
     [exec] 2017-10-22 08:33:37 URL:http://struts.apache.org/plugins/convention/ [80174/80174]
-> "<https://builds.apache.org/job/Struts-master-JDK7/ws/assembly/target/docs/plugins/convention.html">
[1]
     [exec] 2017-10-22 08:33:37 URL:http://struts.apache.org/plugins/dwr/ [9572/9572] ->
"<https://builds.apache.org/job/Struts-master-JDK7/ws/assembly/target/docs/plugins/dwr.html">
[1]
     [exec] 2017-10-22 08:33:37 URL:http://struts.apache.org/plugins/embedded-jsp/ [11957/11957]
-> "<https://builds.apache.org/job/Struts-master-JDK7/ws/assembly/target/docs/plugins/embedded-jsp.html">
[1]
     [exec] 2017-10-22 08:33:37 URL:http://struts.apache.org/plugins/jasperreports/ [13230/13230]
-> "<https://builds.apache.org/job/Struts-master-JDK7/ws/assembly/target/docs/plugins/jasperreports.html">
[1]
     [exec] 2017-10-22 08:33:37 URL:http://struts.apache.org/plugins/java-8-support/ [9937/9937]
-> "<https://builds.apache.org/job/Struts-master-JDK7/ws/assembly/target/docs/plugins/java-8-support.html">
[1]
     [exec] 2017-10-22 08:33:38 URL:http://struts.apache.org/plugins/javatemplates/ [9724/9724]
-> "<https://builds.apache.org/job/Struts-master-JDK7/ws/assembly/target/docs/plugins/javatemplates.html">
[1]
     [exec] 2017-10-22 08:33:38 URL:http://struts.apache.org/plugins/jfreechart/ [15812/15812]
-> "<https://builds.apache.org/job/Struts-master-JDK7/ws/assembly/target/docs/plugins/jfreechart.html">
[1]
     [exec] 2017-10-22 08:33:38 URL:http://struts.apache.org/plugins/jsf/ [14912/14912] ->
"<https://builds.apache.org/job/Struts-master-JDK7/ws/assembly/target/docs/plugins/jsf.html">
[1]
     [exec] 2017-10-22 08:33:38 URL:http://struts.apache.org/plugins/json/ [59395/59395] ->
"<https://builds.apache.org/job/Struts-master-JDK7/ws/assembly/target/docs/plugins/json.html">
[1]
     [exec] 2017-10-22 08:33:38 URL:http://struts.apache.org/plugins/junit/ [21505/21505]
-> "<https://builds.apache.org/job/Struts-master-JDK7/ws/assembly/target/docs/plugins/junit.html">
[1]
     [exec] 2017-10-22 08:33:38 URL:http://struts.apache.org/plugins/oval/ [22999/22999] ->
"<https://builds.apache.org/job/Struts-master-JDK7/ws/assembly/target/docs/plugins/oval.html">
[1]
     [exec] 2017-10-22 08:33:39 URL:http://struts.apache.org/plugins/osgi/ [30855/30855] ->
"<https://builds.apache.org/job/Struts-master-JDK7/ws/assembly/target/docs/plugins/osgi.html">
[1]
     [exec] 2017-10-22 08:33:39 URL:http://struts.apache.org/plugins/plexus/ [10515/10515]
-> "<https://builds.apache.org/job/Struts-master-JDK7/ws/assembly/target/docs/plugins/plexus.html">
[1]
     [exec] 2017-10-22 08:33:39 URL:http://struts.apache.org/plugins/portlet/ [20812/20812]
-> "<https://builds.apache.org/job/Struts-master-JDK7/ws/assembly/target/docs/plugins/portlet.html">
[1]
     [exec] 2017-10-22 08:33:39 URL:http://struts.apache.org/plugins/portlet-tiles/ [11382/11382]
-> "<https://builds.apache.org/job/Struts-master-JDK7/ws/assembly/target/docs/plugins/portlet-tiles.html">
[1]
     [exec] 2017-10-22 08:33:39 URL:http://struts.apache.org/plugins/rest/ [36941/36941] ->
"<https://builds.apache.org/job/Struts-master-JDK7/ws/assembly/target/docs/plugins/rest.html">
[1]
     [exec] 2017-10-22 08:33:40 URL:http://struts.apache.org/plugins/sitegraph/ [15104/15104]
-> "<https://builds.apache.org/job/Struts-master-JDK7/ws/assembly/target/docs/plugins/sitegraph.html">
[1]
     [exec] 2017-10-22 08:33:40 URL:http://struts.apache.org/plugins/sitemesh/ [26943/26943]
-> "<https://builds.apache.org/job/Struts-master-JDK7/ws/assembly/target/docs/plugins/sitemesh.html">
[1]
     [exec] 2017-10-22 08:33:40 URL:http://struts.apache.org/plugins/spring/ [24998/24998]
-> "<https://builds.apache.org/job/Struts-master-JDK7/ws/assembly/target/docs/plugins/spring.html">
[1]
     [exec] 2017-10-22 08:33:40 URL:http://struts.apache.org/plugins/struts-1/ [22812/22812]
-> "<https://builds.apache.org/job/Struts-master-JDK7/ws/assembly/target/docs/plugins/struts-1.html">
[1]
     [exec] 2017-10-22 08:33:40 URL:http://struts.apache.org/plugins/testng/ [10314/10314]
-> "<https://builds.apache.org/job/Struts-master-JDK7/ws/assembly/target/docs/plugins/testng.html">
[1]
     [exec] 2017-10-22 08:33:40 URL:http://struts.apache.org/plugins/tiles/ [19113/19113]
-> "<https://builds.apache.org/job/Struts-master-JDK7/ws/assembly/target/docs/plugins/tiles.html">
[1]
     [exec] 2017-10-22 08:33:41 URL:http://struts.apache.org/plugins/tiles-3/ [11765/11765]
-> "<https://builds.apache.org/job/Struts-master-JDK7/ws/assembly/target/docs/plugins/tiles-3.html">
[1]
     [exec] 2017-10-22 08:33:41 URL:http://struts.apache.org/plugins/index.html [10135/10135]
-> "<https://builds.apache.org/job/Struts-master-JDK7/ws/assembly/target/docs/plugins/index.html">
[1]
     [exec] 2017-10-22 08:33:41 URL:http://struts.apache.org/plugins/plugin-developers.html
[10654/10654] -> "<https://builds.apache.org/job/Struts-master-JDK7/ws/assembly/target/docs/plugins/plugin-developers.html">
[1]
     [exec] http://struts.apache.org/plugins/architects-guide.html:
     [exec] 2017-10-22 08:33:41 ERROR 404: Not Found.
     [exec] FINISHED --2017-10-22 08:33:41--
     [exec] Total wall clock time: 34s
     [exec] Downloaded: 340 files, 6.0M in 0.5s (11.0 MB/s)
     [exec] Result: 8
[INFO] Executed tasks
[INFO] 
[INFO] >>> maven-source-plugin:3.0.0:jar (attach-sources) > generate-sources @
struts2-assembly >>>
[INFO] 
[INFO] <<< maven-source-plugin:3.0.0:jar (attach-sources) < generate-sources @
struts2-assembly <<<
[INFO] 
[INFO] 
[INFO] --- maven-source-plugin:3.0.0:jar (attach-sources) @ struts2-assembly ---
[INFO] 
[INFO] --- maven-site-plugin:3.5.1:attach-descriptor (attach-descriptor) @ struts2-assembly
---
[INFO] 
[INFO] --- dependency-maven-plugin:1.0:copy (copy-war) @ struts2-assembly ---
[INFO] Configured Artifact: org.apache.struts:struts2-showcase:null:2.5.14-SNAPSHOT:war
[INFO] Configured Artifact: org.apache.struts:struts2-rest-showcase:null:2.5.14-SNAPSHOT:war
[INFO] Copying <https://builds.apache.org/job/Struts-master-JDK7/ws/apps/showcase/target/struts2-showcase.war>
to <https://builds.apache.org/job/Struts-master-JDK7/ws/assembly/target/apps/struts2-showcase.war>
[INFO] Copying <https://builds.apache.org/job/Struts-master-JDK7/ws/apps/rest-showcase/target/struts2-rest-showcase.war>
to <https://builds.apache.org/job/Struts-master-JDK7/ws/assembly/target/apps/struts2-rest-showcase.war>
[INFO] 
[INFO] --- maven-assembly-plugin:2.6:attached (make-assembly) @ struts2-assembly ---
[INFO] Reading assembly descriptor: src/main/assembly/all.xml
[INFO] Reading assembly descriptor: src/main/assembly/lib.xml
[INFO] Reading assembly descriptor: src/main/assembly/min-lib.xml
[INFO] Reading assembly descriptor: src/main/assembly/apps.xml
[INFO] Reading assembly descriptor: src/main/assembly/src.xml
[INFO] Reading assembly descriptor: src/main/assembly/docs.xml
[INFO] Building zip: <https://builds.apache.org/job/Struts-master-JDK7/ws/assembly/target/assembly/out/struts-2.5.14-SNAPSHOT-all.zip>
[INFO] Building zip: <https://builds.apache.org/job/Struts-master-JDK7/ws/assembly/target/assembly/out/struts-2.5.14-SNAPSHOT-lib.zip>
[INFO] Building zip: <https://builds.apache.org/job/Struts-master-JDK7/ws/assembly/target/assembly/out/struts-2.5.14-SNAPSHOT-min-lib.zip>
[INFO] Building zip: <https://builds.apache.org/job/Struts-master-JDK7/ws/assembly/target/assembly/out/struts-2.5.14-SNAPSHOT-apps.zip>
[INFO] Building zip: <https://builds.apache.org/job/Struts-master-JDK7/ws/assembly/target/assembly/out/struts-2.5.14-SNAPSHOT-src.zip>
[INFO] Building zip: <https://builds.apache.org/job/Struts-master-JDK7/ws/assembly/target/assembly/out/struts-2.5.14-SNAPSHOT-docs.zip>
[INFO] 
[INFO] --- apache-rat-plugin:0.11:check (default) @ struts2-assembly ---
[INFO] 51 implicit excludes (use -debug for more details).
[INFO] Exclude: src/main/resources/org/apache/struts2/static/domTT.js
[INFO] Exclude: src/site/resources/tags/**/*.html
[INFO] Exclude: src/main/resources/*LICENSE.txt
[INFO] Exclude: src/test/resources/**/*.txt
[INFO] Exclude: src/main/webapp/**/*.css
[INFO] Exclude: src/main/webapp/**/*.map
[INFO] Exclude: src/main/webapp/**/*.js
[INFO] Exclude: src/main/webapp/**/*.svg
[INFO] Exclude: src/main/webapp/**/*.txt
[INFO] Exclude: src/main/resources/**/sitegraph-usage.txt
[INFO] Exclude: src/main/resources/static/css/**/*.css
[INFO] Exclude: src/main/resources/static/js/**/*.js
[INFO] Exclude: src/main/resources/docs.cfg
[INFO] Exclude: src/main/webapp/fonts/**/*
[INFO] 11 resources included (use -debug for more details)
[INFO] Rat check: Summary of files. Unapproved: 1 unknown: 1 generated: 0 approved: 9 licence.
[INFO] ------------------------------------------------------------------------
[INFO] Reactor Summary:
[INFO] 
[INFO] Struts 2 Bill of Materials ......................... SUCCESS [  6.494 s]
[INFO] Struts 2 ........................................... SUCCESS [  7.667 s]
[INFO] Struts 2 Core ...................................... SUCCESS [04:37 min]
[INFO] Struts Plugins ..................................... SUCCESS [  2.258 s]
[INFO] Struts 2 Configuration Browser Plugin .............. SUCCESS [  9.826 s]
[INFO] Struts 2 Sitemesh Plugin ........................... SUCCESS [  6.477 s]
[INFO] Struts 2 Tiles Plugin .............................. SUCCESS [  9.228 s]
[INFO] Struts 2 DWR Plugin ................................ SUCCESS [  5.434 s]
[INFO] Struts 2 Spring Plugin ............................. SUCCESS [  8.187 s]
[INFO] Struts 2 Convention Plugin ......................... SUCCESS [ 15.903 s]
[INFO] Struts 2 JUnit Plugin .............................. SUCCESS [ 15.746 s]
[INFO] Struts 2 JSON Plugin ............................... SUCCESS [ 15.362 s]
[INFO] Struts 2 Bean Validation Plugin .................... SUCCESS [ 10.735 s]
[INFO] Struts 2 Webapps ................................... SUCCESS [  2.364 s]
[INFO] Struts 2 Showcase Webapp ........................... SUCCESS [ 20.983 s]
[INFO] Struts 2 REST Plugin ............................... SUCCESS [ 12.687 s]
[INFO] Struts 2 Rest Showcase Webapp ...................... SUCCESS [  9.605 s]
[INFO] Struts 2 CDI Plugin ................................ SUCCESS [ 10.647 s]
[INFO] Struts 2 Embedded JSP Plugin ....................... SUCCESS [ 21.124 s]
[INFO] Struts 2 GXP Plugin ................................ SUCCESS [  3.884 s]
[INFO] Struts 2 Jasper Reports Plugin ..................... SUCCESS [  4.589 s]
[INFO] Struts 2 Java Templates Plugin ..................... SUCCESS [  7.768 s]
[INFO] Struts 2 JFreeChart Plugin ......................... SUCCESS [  7.663 s]
[INFO] Struts 2 OSGi Plugin ............................... SUCCESS [  6.153 s]
[INFO] Struts 2 OVal Plugin ............................... SUCCESS [  7.571 s]
[INFO] Struts 2 Pell Multipart Plugin ..................... SUCCESS [  2.995 s]
[INFO] Struts 2 Plexus Plugin ............................. SUCCESS [  3.368 s]
[INFO] Struts 2 Portlet Plugin ............................ SUCCESS [ 14.922 s]
[INFO] Struts 2 Portlet Tiles Plugin ...................... SUCCESS [  3.935 s]
[INFO] DEPRECATED: Struts 2 Sitegraph Plugin .............. SUCCESS [  9.078 s]
[INFO] Struts 2 TestNG Plugin ............................. SUCCESS [  9.792 s]
[INFO] Struts OSGi Bundles ................................ SUCCESS [  0.883 s]
[INFO] Struts 2 OSGi Admin Bundle ......................... SUCCESS [  7.259 s]
[INFO] Struts 2 OSGi Demo Bundle .......................... SUCCESS [  6.698 s]
[INFO] Struts 2 Assembly .................................. FAILURE [01:00 min]
[INFO] ------------------------------------------------------------------------
[INFO] BUILD FAILURE
[INFO] ------------------------------------------------------------------------
[INFO] Total time: 10:28 min
[INFO] Finished at: 2017-10-22T08:34:05Z
[INFO] Final Memory: 87M/1616M
[INFO] ------------------------------------------------------------------------
[ERROR] Failed to execute goal org.apache.rat:apache-rat-plugin:0.11:check (default) on project
struts2-assembly: Too many files with unapproved license: 1 See RAT report in: <https://builds.apache.org/job/Struts-master-JDK7/ws/assembly/target/rat.txt>
-> [Help 1]
[ERROR] 
[ERROR] To see the full stack trace of the errors, re-run Maven with the -e switch.
[ERROR] Re-run Maven using the -X switch to enable full debug logging.
[ERROR] 
[ERROR] For more information about the errors and possible solutions, please read the following
articles:
[ERROR] [Help 1] http://cwiki.apache.org/confluence/display/MAVEN/MojoFailureException
[ERROR] 
[ERROR] After correcting the problems, you can resume the build with the command
[ERROR]   mvn <goals> -rf :struts2-assembly
Build step 'Execute shell' marked build as failure
[locks-and-latches] Releasing all the locks
[locks-and-latches] All the locks released
Setting MAVEN_3_LATEST__HOME=/home/jenkins/tools/maven/latest3/

---------------------------------------------------------------------
To unsubscribe, e-mail: dev-unsubscribe@struts.apache.org
For additional commands, e-mail: dev-help@struts.apache.org


Mime
View raw message