struts-dev mailing list archives

Site index · List index
Message view « Date » · « Thread »
Top « Date » · « Thread »
From Apache Jenkins Server <jenk...@builds.apache.org>
Subject Build failed in Jenkins: Struts-support-2-3-JDK6 #15
Date Tue, 05 Sep 2017 18:54:03 GMT
See <https://builds.apache.org/job/Struts-support-2-3-JDK6/15/display/redirect?page=changes>

Changes:

[Lukasz Lenart] [maven-release-plugin] prepare release STRUTS_2_3_34

[Lukasz Lenart] [maven-release-plugin] prepare for next development iteration

------------------------------------------
[...truncated 901.60 KB...]
[INFO] ------------------------------------------------------------------------
[INFO] 
[INFO] >>> maven-source-plugin:3.0.0:jar (default-cli) @ struts2-apps >>>
[INFO] 
[INFO] <<< maven-source-plugin:3.0.0:jar (default-cli) @ struts2-apps <<<
[INFO] 
[INFO] --- maven-source-plugin:3.0.0:jar (default-cli) @ struts2-apps ---
[INFO] 
[INFO] --- maven-javadoc-plugin:2.10.3:jar (default-cli) @ struts2-apps ---
[INFO] Not executing Javadoc as the project is not a Java classpath-capable package
[INFO] 
[INFO] --- maven-antrun-plugin:1.8:run (copy-sources) @ struts2-apps ---
[WARNING] Parameter tasks is deprecated, use target instead
[INFO] Executing tasks

main:
     [copy] Warning: <https://builds.apache.org/job/Struts-support-2-3-JDK6/ws/apps/src/main/java>
does not exist.
     [copy] Warning: <https://builds.apache.org/job/Struts-support-2-3-JDK6/ws/apps/src/main/resources>
does not exist.
[INFO] Executed tasks
[INFO] 
[INFO] --- maven-remote-resources-plugin:1.5:process (process-resource-bundles) @ struts2-apps
---
[INFO] 
[INFO] --- maven-bundle-plugin:2.1.0:manifest (bundle-manifest) @ struts2-apps ---
[WARNING] Ignoring project type pom - supportedProjectTypes = [jar, bundle]
[INFO] 
[INFO] >>> maven-source-plugin:3.0.0:jar (attach-source) @ struts2-apps >>>
[INFO] 
[INFO] <<< maven-source-plugin:3.0.0:jar (attach-source) @ struts2-apps <<<
[INFO] 
[INFO] --- maven-source-plugin:3.0.0:jar (attach-source) @ struts2-apps ---
[INFO] 
[INFO] --- maven-site-plugin:3.3:attach-descriptor (attach-descriptor) @ struts2-apps ---
[INFO] 
[INFO] --- maven-install-plugin:2.5.2:install (default-install) @ struts2-apps ---
[INFO] Installing <https://builds.apache.org/job/Struts-support-2-3-JDK6/ws/apps/pom.xml>
to /home/jenkins/.m2/repository/org/apache/struts/struts2-apps/2.3.35-SNAPSHOT/struts2-apps-2.3.35-SNAPSHOT.pom
[INFO] 
[INFO] --- maven-antrun-plugin:1.8:run (copy-sources) @ struts2-apps ---
[WARNING] Parameter tasks is deprecated, use target instead
[INFO] Executing tasks

main:
     [copy] Warning: <https://builds.apache.org/job/Struts-support-2-3-JDK6/ws/apps/src/main/java>
does not exist.
     [copy] Warning: <https://builds.apache.org/job/Struts-support-2-3-JDK6/ws/apps/src/main/resources>
does not exist.
[INFO] Executed tasks
[INFO] 
[INFO] --- maven-remote-resources-plugin:1.5:process (process-resource-bundles) @ struts2-apps
---
[INFO] 
[INFO] --- maven-bundle-plugin:2.1.0:manifest (bundle-manifest) @ struts2-apps ---
[WARNING] Ignoring project type pom - supportedProjectTypes = [jar, bundle]
[INFO] 
[INFO] >>> maven-source-plugin:3.0.0:jar (attach-source) @ struts2-apps >>>
[INFO] 
[INFO] <<< maven-source-plugin:3.0.0:jar (attach-source) @ struts2-apps <<<
[INFO] 
[INFO] --- maven-source-plugin:3.0.0:jar (attach-source) @ struts2-apps ---
[INFO] 
[INFO] --- maven-site-plugin:3.3:attach-descriptor (attach-descriptor) @ struts2-apps ---
[INFO] 
[INFO] --- maven-install-plugin:2.5.2:install (default-install) @ struts2-apps ---
[INFO] Installing <https://builds.apache.org/job/Struts-support-2-3-JDK6/ws/apps/pom.xml>
to /home/jenkins/.m2/repository/org/apache/struts/struts2-apps/2.3.35-SNAPSHOT/struts2-apps-2.3.35-SNAPSHOT.pom
[INFO] 
[INFO] --- maven-deploy-plugin:2.8.2:deploy (default-deploy) @ struts2-apps ---
Downloading: https://repository.apache.org/content/repositories/snapshots/org/apache/struts/struts2-apps/2.3.35-SNAPSHOT/maven-metadata.xml
         Uploading: https://repository.apache.org/content/repositories/snapshots/org/apache/struts/struts2-apps/2.3.35-SNAPSHOT/struts2-apps-2.3.35-20170905.185356-1.pom
2/5 KB   4/5 KB   5/5 KB            Uploaded: https://repository.apache.org/content/repositories/snapshots/org/apache/struts/struts2-apps/2.3.35-SNAPSHOT/struts2-apps-2.3.35-20170905.185356-1.pom
(5 KB at 4.8 KB/sec)
Downloading: https://repository.apache.org/content/repositories/snapshots/org/apache/struts/struts2-apps/maven-metadata.xml
2/2 KB            Downloaded: https://repository.apache.org/content/repositories/snapshots/org/apache/struts/struts2-apps/maven-metadata.xml
(2 KB at 2.3 KB/sec)
Uploading: https://repository.apache.org/content/repositories/snapshots/org/apache/struts/struts2-apps/2.3.35-SNAPSHOT/maven-metadata.xml
608/608 B               Uploaded: https://repository.apache.org/content/repositories/snapshots/org/apache/struts/struts2-apps/2.3.35-SNAPSHOT/maven-metadata.xml
(608 B at 0.7 KB/sec)
Uploading: https://repository.apache.org/content/repositories/snapshots/org/apache/struts/struts2-apps/maven-metadata.xml
2/2 KB               Uploaded: https://repository.apache.org/content/repositories/snapshots/org/apache/struts/struts2-apps/maven-metadata.xml
(2 KB at 1.6 KB/sec)
[INFO]                                                                         
[INFO] ------------------------------------------------------------------------
[INFO] Building Struts 2 Blank Webapp 2.3.35-SNAPSHOT
[INFO] ------------------------------------------------------------------------
[INFO] 
[INFO] >>> maven-source-plugin:3.0.0:jar (default-cli) @ struts2-blank >>>
[INFO] 
[INFO] <<< maven-source-plugin:3.0.0:jar (default-cli) @ struts2-blank <<<
[INFO] 
[INFO] --- maven-source-plugin:3.0.0:jar (default-cli) @ struts2-blank ---
[INFO] Building jar: <https://builds.apache.org/job/Struts-support-2-3-JDK6/ws/apps/blank/target/struts2-blank-sources.jar>
[INFO] 
[INFO] --- maven-javadoc-plugin:2.10.3:jar (default-cli) @ struts2-blank ---
[INFO] 
Loading source files for package example...
Constructing Javadoc information...
Standard Doclet version 1.6.0_45
Building tree for all the packages and classes...
Generating <https://builds.apache.org/job/Struts-support-2-3-JDK6/ws/apps/blank/target/apidocs/example//ExampleSupport.html...>
Generating <https://builds.apache.org/job/Struts-support-2-3-JDK6/ws/apps/blank/target/apidocs/example//HelloWorld.html...>
Generating <https://builds.apache.org/job/Struts-support-2-3-JDK6/ws/apps/blank/target/apidocs/example//Login.html...>
Generating <https://builds.apache.org/job/Struts-support-2-3-JDK6/ws/apps/blank/target/apidocs/example//YesNo.html...>
Generating <https://builds.apache.org/job/Struts-support-2-3-JDK6/ws/apps/blank/target/apidocs/example//package-frame.html...>
Generating <https://builds.apache.org/job/Struts-support-2-3-JDK6/ws/apps/blank/target/apidocs/example//package-summary.html...>
Generating <https://builds.apache.org/job/Struts-support-2-3-JDK6/ws/apps/blank/target/apidocs/example//package-tree.html...>
Generating <https://builds.apache.org/job/Struts-support-2-3-JDK6/ws/apps/blank/target/apidocs/constant-values.html...>
Generating <https://builds.apache.org/job/Struts-support-2-3-JDK6/ws/apps/blank/target/apidocs/serialized-form.html...>
Generating <https://builds.apache.org/job/Struts-support-2-3-JDK6/ws/apps/blank/target/apidocs/example//class-use/HelloWorld.html...>
Generating <https://builds.apache.org/job/Struts-support-2-3-JDK6/ws/apps/blank/target/apidocs/example//class-use/YesNo.html...>
Generating <https://builds.apache.org/job/Struts-support-2-3-JDK6/ws/apps/blank/target/apidocs/example//class-use/ExampleSupport.html...>
Generating <https://builds.apache.org/job/Struts-support-2-3-JDK6/ws/apps/blank/target/apidocs/example//class-use/Login.html...>
Generating <https://builds.apache.org/job/Struts-support-2-3-JDK6/ws/apps/blank/target/apidocs/example//package-use.html...>
Building index for all the packages and classes...
Generating <https://builds.apache.org/job/Struts-support-2-3-JDK6/ws/apps/blank/target/apidocs/overview-tree.html...>
Generating <https://builds.apache.org/job/Struts-support-2-3-JDK6/ws/apps/blank/target/apidocs/index-all.html...>
Generating <https://builds.apache.org/job/Struts-support-2-3-JDK6/ws/apps/blank/target/apidocs/deprecated-list.html...>
Building index for all classes...
Generating <https://builds.apache.org/job/Struts-support-2-3-JDK6/ws/apps/blank/target/apidocs/allclasses-frame.html...>
Generating <https://builds.apache.org/job/Struts-support-2-3-JDK6/ws/apps/blank/target/apidocs/allclasses-noframe.html...>
Generating <https://builds.apache.org/job/Struts-support-2-3-JDK6/ws/apps/blank/target/apidocs/index.html...>
Generating <https://builds.apache.org/job/Struts-support-2-3-JDK6/ws/apps/blank/target/apidocs/help-doc.html...>
Generating <https://builds.apache.org/job/Struts-support-2-3-JDK6/ws/apps/blank/target/apidocs/stylesheet.css...>
[INFO] Fixed Javadoc frame injection vulnerability (CVE-2013-1571) in 1 files.
[INFO] Building jar: <https://builds.apache.org/job/Struts-support-2-3-JDK6/ws/apps/blank/target/struts2-blank-javadoc.jar>
[INFO] 
[INFO] --- maven-antrun-plugin:1.8:run (copy-sources) @ struts2-blank ---
[WARNING] Parameter tasks is deprecated, use target instead
[INFO] Executing tasks

main:
     [copy] Copying 1 file to <https://builds.apache.org/job/Struts-support-2-3-JDK6/ws/apps/blank/target/struts2-blank/WEB-INF/src/java>
[INFO] Executed tasks
[INFO] 
[INFO] --- maven-remote-resources-plugin:1.5:process (process-resource-bundles) @ struts2-blank
---
[INFO] 
[INFO] --- maven-resources-plugin:2.7:resources (default-resources) @ struts2-blank ---
[INFO] Using 'UTF-8' encoding to copy filtered resources.
[INFO] Copying 9 resources
[INFO] Copying 3 resources
[INFO] 
[INFO] --- maven-compiler-plugin:3.5.1:compile (default-compile) @ struts2-blank ---
[INFO] Changes detected - recompiling the module!
[INFO] Compiling 4 source files to <https://builds.apache.org/job/Struts-support-2-3-JDK6/ws/apps/blank/target/classes>
An exception has occurred in the compiler (1.6.0_45). Please file a bug at the Java Developer
Connection (http://java.sun.com/webapps/bugreport)  after checking the Bug Parade for duplicates.
Include your program and the following diagnostic in your report.  Thank you.
java.lang.LinkageError: loader constraint violation: when resolving method "com.sun.tools.javadoc.DocCommentScanner$Factory.preRegister(Lcom/sun/tools/javac/util/Context;)V"
the class loader (instance of java/net/FactoryURLClassLoader) of the current class, com/sun/tools/javac/main/JavaCompiler,
and the class loader (instance of sun/misc/Launcher$AppClassLoader) for resolved class, com/sun/tools/javadoc/DocCommentScanner$Factory,
have different Class objects for the type com/sun/tools/javac/util/Context used in the signature
	at com.sun.tools.javac.main.JavaCompiler.initProcessAnnotations(JavaCompiler.java:883)
	at com.sun.tools.javac.main.JavaCompiler.compile(JavaCompiler.java:724)
	at com.sun.tools.javac.main.Main.compile(Main.java:353)
	at com.sun.tools.javac.api.JavacTaskImpl.call(JavacTaskImpl.java:113)
	at org.codehaus.plexus.compiler.javac.JavaxToolsCompiler.compileInProcess(JavaxToolsCompiler.java:125)
	at org.codehaus.plexus.compiler.javac.JavacCompiler.performCompile(JavacCompiler.java:171)
	at org.apache.maven.plugin.compiler.AbstractCompilerMojo.execute(AbstractCompilerMojo.java:886)
	at org.apache.maven.plugin.compiler.CompilerMojo.execute(CompilerMojo.java:129)
	at org.apache.maven.plugin.DefaultBuildPluginManager.executeMojo(DefaultBuildPluginManager.java:101)
	at org.apache.maven.lifecycle.internal.MojoExecutor.execute(MojoExecutor.java:209)
	at org.apache.maven.lifecycle.internal.MojoExecutor.execute(MojoExecutor.java:153)
	at org.apache.maven.lifecycle.internal.MojoExecutor.execute(MojoExecutor.java:145)
	at org.apache.maven.lifecycle.internal.LifecycleModuleBuilder.buildProject(LifecycleModuleBuilder.java:84)
	at org.apache.maven.lifecycle.internal.LifecycleModuleBuilder.buildProject(LifecycleModuleBuilder.java:59)
	at org.apache.maven.lifecycle.internal.LifecycleStarter.singleThreadedBuild(LifecycleStarter.java:183)
	at org.apache.maven.lifecycle.internal.LifecycleStarter.execute(LifecycleStarter.java:161)
	at org.apache.maven.DefaultMaven.doExecute(DefaultMaven.java:320)
	at org.apache.maven.DefaultMaven.execute(DefaultMaven.java:156)
	at org.apache.maven.cli.MavenCli.execute(MavenCli.java:537)
	at org.apache.maven.cli.MavenCli.doMain(MavenCli.java:196)
	at org.apache.maven.cli.MavenCli.main(MavenCli.java:141)
	at sun.reflect.NativeMethodAccessorImpl.invoke0(Native Method)
	at sun.reflect.NativeMethodAccessorImpl.invoke(NativeMethodAccessorImpl.java:39)
	at sun.reflect.DelegatingMethodAccessorImpl.invoke(DelegatingMethodAccessorImpl.java:25)
	at java.lang.reflect.Method.invoke(Method.java:597)
	at org.codehaus.plexus.classworlds.launcher.Launcher.launchEnhanced(Launcher.java:290)
	at org.codehaus.plexus.classworlds.launcher.Launcher.launch(Launcher.java:230)
	at org.codehaus.plexus.classworlds.launcher.Launcher.mainWithExitCode(Launcher.java:409)
	at org.codehaus.plexus.classworlds.launcher.Launcher.main(Launcher.java:352)
[INFO] -------------------------------------------------------------
[ERROR] COMPILATION ERROR : 
[INFO] -------------------------------------------------------------
[ERROR] An unknown compilation problem occurred
[INFO] 1 error
[INFO] -------------------------------------------------------------
[INFO] ------------------------------------------------------------------------
[INFO] Reactor Summary:
[INFO] 
[INFO] Struts 2 Bill of Materials ........................ SUCCESS [7.781s]
[INFO] Struts 2 .......................................... SUCCESS [7.872s]
[INFO] XWork: Core ....................................... SUCCESS [1:02.262s]
[INFO] Struts 2 Core ..................................... SUCCESS [2:18.389s]
[INFO] Struts Plugins .................................... SUCCESS [5.641s]
[INFO] Struts 2 Spring Plugin ............................ SUCCESS [13.589s]
[INFO] Struts 2 Convention Plugin ........................ SUCCESS [15.912s]
[INFO] Struts 2 JUnit Plugin ............................. SUCCESS [17.945s]
[INFO] Struts 2 Webapps .................................. SUCCESS [4.222s]
[INFO] Struts 2 Blank Webapp ............................. FAILURE [2.100s]
[INFO] Struts 2 JBoss Blank Webapp ....................... SKIPPED
[INFO] Struts 2 Mail Reader Webapp ....................... SKIPPED
[INFO] Struts 2 Portlet Plugin ........................... SKIPPED
[INFO] Struts 2 DWR Plugin ............................... SKIPPED
[INFO] Struts 2 Tiles Plugin ............................. SKIPPED
[INFO] Struts 2 Portlet Tiles Plugin ..................... SKIPPED
[INFO] Struts 2 Portlet Webapp ........................... SKIPPED
[INFO] Struts 2 Struts 1 Plugin .......................... SKIPPED
[INFO] Struts 2 Dojo Plugin .............................. SKIPPED
[INFO] Struts 2 JSF Plugin ............................... SKIPPED
[INFO] Struts 2 Configuration Browser Plugin ............. SKIPPED
[INFO] Struts 2 Sitemesh Plugin .......................... SKIPPED
[INFO] Struts 2 JSON Plugin .............................. SKIPPED
[INFO] Struts 2 Showcase Webapp .......................... SKIPPED
[INFO] Struts 2 REST Plugin .............................. SKIPPED
[INFO] Struts 2 Rest Showcase Webapp ..................... SKIPPED
[INFO] Struts 2 CDI Plugin ............................... SKIPPED
[INFO] Struts 2 Codebehind Plugin ........................ SKIPPED
[INFO] Struts 2 Embedded JSP Plugin ...................... SKIPPED
[INFO] Struts 2 GXP Plugin ............................... SKIPPED
[INFO] Struts 2 Jasper Reports Plugin .................... SKIPPED
[INFO] Struts 2 Java 8 support plugin .................... SKIPPED
[INFO] Struts 2 Java Templates Plugin .................... SKIPPED
[INFO] Struts 2 JFreeChart Plugin ........................ SKIPPED
[INFO] Struts 2 OSGi Plugin .............................. SKIPPED
[INFO] Struts 2 OVal Plugin .............................. SKIPPED
[INFO] Struts 2 Pell Multipart Plugin .................... SKIPPED
[INFO] Struts 2 Plexus Plugin ............................ SKIPPED
[INFO] Struts 2 Sitegraph Plugin ......................... SKIPPED
[INFO] Struts 2 TestNG Plugin ............................ SKIPPED
[INFO] Struts 2 Tiles 3 Plugin ........................... SKIPPED
[INFO] Struts OSGi Bundles ............................... SKIPPED
[INFO] Struts 2 OSGi Admin Bundle ........................ SKIPPED
[INFO] Struts 2 OSGi Demo Bundle ......................... SKIPPED
[INFO] Struts 2 Maven Archetypes ......................... SKIPPED
[INFO] Struts 2 Archetypes - Angular JS .................. SKIPPED
[INFO] Struts 2 Archetypes - Blank ....................... SKIPPED
[INFO] Struts 2 Archetypes - Blank Convention ............ SKIPPED
[INFO] Struts 2 Archetypes - Database Portlet ............ SKIPPED
[INFO] Struts 2 Archetypes - Plugin ...................... SKIPPED
[INFO] Struts 2 Archetypes - Portlet ..................... SKIPPED
[INFO] Struts 2 Archetypes - Starter ..................... SKIPPED
[INFO] ------------------------------------------------------------------------
[INFO] BUILD FAILURE
[INFO] ------------------------------------------------------------------------
[INFO] Total time: 4:38.579s
[INFO] Finished at: Tue Sep 05 18:54:02 UTC 2017
[INFO] Final Memory: 67M/1460M
[INFO] ------------------------------------------------------------------------
[ERROR] Failed to execute goal org.apache.maven.plugins:maven-compiler-plugin:3.5.1:compile
(default-compile) on project struts2-blank: Compilation failure
[ERROR] An unknown compilation problem occurred
[ERROR] -> [Help 1]
[ERROR] 
[ERROR] To see the full stack trace of the errors, re-run Maven with the -e switch.
[ERROR] Re-run Maven using the -X switch to enable full debug logging.
[ERROR] 
[ERROR] For more information about the errors and possible solutions, please read the following
articles:
[ERROR] [Help 1] http://cwiki.apache.org/confluence/display/MAVEN/MojoFailureException
[ERROR] 
[ERROR] After correcting the problems, you can resume the build with the command
[ERROR]   mvn <goals> -rf :struts2-blank
Build step 'Execute shell' marked build as failure
[locks-and-latches] Releasing all the locks
[locks-and-latches] All the locks released
Setting MAVEN_3_0_5_HOME=/home/jenkins/tools/maven/apache-maven-3.0.5

---------------------------------------------------------------------
To unsubscribe, e-mail: dev-unsubscribe@struts.apache.org
For additional commands, e-mail: dev-help@struts.apache.org


Mime
View raw message