struts-dev mailing list archives

Site index · List index
Message view « Date » · « Thread »
Top « Date » · « Thread »
From Apache Jenkins Server <jenk...@builds.apache.org>
Subject Build failed in Jenkins: Struts-support-2-3-JDK6 #10
Date Wed, 23 Aug 2017 05:34:19 GMT
See <https://builds.apache.org/job/Struts-support-2-3-JDK6/10/display/redirect?page=changes>

Changes:

[Lukasz Lenart] WW-4844 Upgrades to struts-master 11

------------------------------------------
Started by an SCM change
[EnvInject] - Loading node environment variables.
Building remotely on qnode2 (ubuntu) in workspace <https://builds.apache.org/job/Struts-support-2-3-JDK6/ws/>
 > git rev-parse --is-inside-work-tree # timeout=10
Fetching changes from the remote Git repository
 > git config remote.origin.url http://git.apache.org/struts.git # timeout=10
Fetching upstream changes from http://git.apache.org/struts.git
 > git --version # timeout=10
 > git fetch --tags --progress http://git.apache.org/struts.git +refs/heads/*:refs/remotes/origin/*
 > git rev-parse refs/remotes/origin/support-2-3^{commit} # timeout=10
 > git rev-parse refs/remotes/origin/refs/heads/support-2-3^{commit} # timeout=10
Checking out Revision f11ac901d3074111db05239b15dac0dd44ede5bb (refs/remotes/origin/support-2-3)
Commit message: "WW-4844 Upgrades to struts-master 11"
 > git config core.sparsecheckout # timeout=10
 > git checkout -f f11ac901d3074111db05239b15dac0dd44ede5bb
 > git rev-list 3fddfb6eb562d597c935084e9e81d43ed6bcd02c # timeout=10
[locks-and-latches] Checking to see if we really have the locks
[locks-and-latches] Have all the locks, build can start
Setting MAVEN_3_0_5_HOME=/home/jenkins/tools/maven/apache-maven-3.0.5
[Struts-support-2-3-JDK6] $ /bin/bash -xe /tmp/jenkins78199105726054933.sh
+ /home/jenkins/tools/maven/apache-maven-3.0.5/bin/mvn source:jar javadoc:jar install deploy
-DskipAssembly
[INFO] Scanning for projects...
Downloading: http://repo.maven.apache.org/maven2/org/apache/struts/struts-master/11/struts-master-11.pom
[ERROR] The build could not read 1 project -> [Help 1]
[ERROR]   
[ERROR]   The project org.apache.struts:struts2-parent:2.3.34-SNAPSHOT (<https://builds.apache.org/job/Struts-support-2-3-JDK6/ws/pom.xml)>
has 1 error
[ERROR]     Non-resolvable parent POM: Could not find artifact org.apache.struts:struts-master:pom:11
in central (http://repo.maven.apache.org/maven2) and 'parent.relativePath' points at wrong
local POM @ line 4, column 13 -> [Help 2]
[ERROR] 
[ERROR] To see the full stack trace of the errors, re-run Maven with the -e switch.
[ERROR] Re-run Maven using the -X switch to enable full debug logging.
[ERROR] 
[ERROR] For more information about the errors and possible solutions, please read the following
articles:
[ERROR] [Help 1] http://cwiki.apache.org/confluence/display/MAVEN/ProjectBuildingException
[ERROR] [Help 2] http://cwiki.apache.org/confluence/display/MAVEN/UnresolvableModelException
Build step 'Execute shell' marked build as failure
[locks-and-latches] Releasing all the locks
[locks-and-latches] All the locks released
[JIRA] Updating issue WW-4844
Setting MAVEN_3_0_5_HOME=/home/jenkins/tools/maven/apache-maven-3.0.5

---------------------------------------------------------------------
To unsubscribe, e-mail: dev-unsubscribe@struts.apache.org
For additional commands, e-mail: dev-help@struts.apache.org


Mime
View raw message