struts-dev mailing list archives

Site index · List index
Message view « Date » · « Thread »
Top « Date » · « Thread »
From Apache Jenkins Server <jenk...@builds.apache.org>
Subject Build failed in Jenkins: Struts-master-JDK9 #2
Date Wed, 09 Aug 2017 05:14:09 GMT
See <https://builds.apache.org/job/Struts-master-JDK9/2/display/redirect>

------------------------------------------
[...truncated 269.78 KB...]
  testCallMethodOnNullObject on instance testCallMethodOnNullObject(com.opensymphony.xwork2.ognl.OgnlValueStackTest)(com.opensymphony.xwork2.ognl.OgnlValueStackTest)
  testPrimitiveSettingWithInvalidValueAddsFieldErrorInDevMode on instance testPrimitiveSettingWithInvalidValueAddsFieldErrorInDevMode(com.opensymphony.xwork2.ognl.OgnlValueStackTest)(com.opensymphony.xwork2.ognl.OgnlValueStackTest)
  testFailsOnMethodThatThrowsException on instance testFailsOnMethodThatThrowsException(com.opensymphony.xwork2.ognl.OgnlValueStackTest)(com.opensymphony.xwork2.ognl.OgnlValueStackTest)
  testNullValueFromContextGetsConverted on instance testNullValueFromContextGetsConverted(com.opensymphony.xwork2.ognl.OgnlValueStackTest)(com.opensymphony.xwork2.ognl.OgnlValueStackTest)
  testNullEntry on instance testNullEntry(com.opensymphony.xwork2.ognl.OgnlValueStackTest)(com.opensymphony.xwork2.ognl.OgnlValueStackTest)
  testConvertStringArrayToList on instance testConvertStringArrayToList(com.opensymphony.xwork2.ognl.OgnlValueStackTest)(com.opensymphony.xwork2.ognl.OgnlValueStackTest)
  testStatic on instance testStatic(com.opensymphony.xwork2.ognl.OgnlValueStackTest)(com.opensymphony.xwork2.ognl.OgnlValueStackTest)
  testSerializable on instance testSerializable(com.opensymphony.xwork2.ognl.OgnlValueStackTest)(com.opensymphony.xwork2.ognl.OgnlValueStackTest)
  testSetBarAsString on instance testSetBarAsString(com.opensymphony.xwork2.ognl.OgnlValueStackTest)(com.opensymphony.xwork2.ognl.OgnlValueStackTest)
  testSetReallyDeepBarAsString on instance testSetReallyDeepBarAsString(com.opensymphony.xwork2.ognl.OgnlValueStackTest)(com.opensymphony.xwork2.ognl.OgnlValueStackTest)
  testSetMultiple on instance testSetMultiple(com.opensymphony.xwork2.ognl.OgnlValueStackTest)(com.opensymphony.xwork2.ognl.OgnlValueStackTest)
  testDeepProperties on instance testDeepProperties(com.opensymphony.xwork2.ognl.OgnlValueStackTest)(com.opensymphony.xwork2.ognl.OgnlValueStackTest)
  testStatics on instance testStatics(com.opensymphony.xwork2.ognl.OgnlValueStackTest)(com.opensymphony.xwork2.ognl.OgnlValueStackTest)
  testGetNullValue on instance testGetNullValue(com.opensymphony.xwork2.ognl.OgnlValueStackTest)(com.opensymphony.xwork2.ognl.OgnlValueStackTest)
  testSubstitution on instance testSubstitution(com.opensymphony.xwork2.config.providers.XmlConfigurationProviderEnvsSubstitutionTest)(com.opensymphony.xwork2.config.providers.XmlConfigurationProviderEnvsSubstitutionTest)
  testChangeResultWhenNotifyAboutValidationErrors on instance testChangeResultWhenNotifyAboutValidationErrors(com.opensymphony.xwork2.interceptor.ValidationErrorAwareTest)(com.opensymphony.xwork2.interceptor.ValidationErrorAwareTest)
  testNotChangeResultWhenNotifyAboutValidationError on instance testNotChangeResultWhenNotifyAboutValidationError(com.opensymphony.xwork2.interceptor.ValidationErrorAwareTest)(com.opensymphony.xwork2.interceptor.ValidationErrorAwareTest)
  testRangeValidation on instance testRangeValidation(com.opensymphony.xwork2.validator.LongRangeValidatorTest)(com.opensymphony.xwork2.validator.LongRangeValidatorTest)
  testRequiredStringPass on instance testRequiredStringPass(com.opensymphony.xwork2.validator.validators.RequiredStringValidatorTest)(com.opensymphony.xwork2.validator.validators.RequiredStringValidatorTest)
  testRequiredCollectionOfStringsPass on instance testRequiredCollectionOfStringsPass(com.opensymphony.xwork2.validator.validators.RequiredStringValidatorTest)(com.opensymphony.xwork2.validator.validators.RequiredStringValidatorTest)
  testRequiredArrayOfStringsPass on instance testRequiredArrayOfStringsPass(com.opensymphony.xwork2.validator.validators.RequiredStringValidatorTest)(com.opensymphony.xwork2.validator.validators.RequiredStringValidatorTest)
  testRequiredStringFails on instance testRequiredStringFails(com.opensymphony.xwork2.validator.validators.RequiredStringValidatorTest)(com.opensymphony.xwork2.validator.validators.RequiredStringValidatorTest)
  testTrimAsExpression on instance testTrimAsExpression(com.opensymphony.xwork2.validator.validators.RequiredStringValidatorTest)(com.opensymphony.xwork2.validator.validators.RequiredStringValidatorTest)
  testTestError on instance testTestError(org.apache.struts2.views.jsp.IfTagTest)(org.apache.struts2.views.jsp.IfTagTest)
  testTestFalse on instance testTestFalse(org.apache.struts2.views.jsp.IfTagTest)(org.apache.struts2.views.jsp.IfTagTest)
  testTestTrue on instance testTestTrue(org.apache.struts2.views.jsp.IfTagTest)(org.apache.struts2.views.jsp.IfTagTest)
  testIfElseIfElse on instance testIfElseIfElse(org.apache.struts2.views.jsp.IfTagTest)(org.apache.struts2.views.jsp.IfTagTest)
  testIfElse1 on instance testIfElse1(org.apache.struts2.views.jsp.IfTagTest)(org.apache.struts2.views.jsp.IfTagTest)
  testIfElse2 on instance testIfElse2(org.apache.struts2.views.jsp.IfTagTest)(org.apache.struts2.views.jsp.IfTagTest)
  testIfElseIf on instance testIfElseIf(org.apache.struts2.views.jsp.IfTagTest)(org.apache.struts2.views.jsp.IfTagTest)
  testNestedIfElse1 on instance testNestedIfElse1(org.apache.struts2.views.jsp.IfTagTest)(org.apache.struts2.views.jsp.IfTagTest)
  testNestedIfElse2 on instance testNestedIfElse2(org.apache.struts2.views.jsp.IfTagTest)(org.apache.struts2.views.jsp.IfTagTest)
  testNonBooleanTest on instance testNonBooleanTest(org.apache.struts2.views.jsp.IfTagTest)(org.apache.struts2.views.jsp.IfTagTest)
  testStaticMethods on instance testStaticMethods(com.opensymphony.xwork2.ActionContextTest)(com.opensymphony.xwork2.ActionContextTest)
  testContextMap on instance testContextMap(com.opensymphony.xwork2.ActionContextTest)(com.opensymphony.xwork2.ActionContextTest)
  testParameters on instance testParameters(com.opensymphony.xwork2.ActionContextTest)(com.opensymphony.xwork2.ActionContextTest)
  testConversionErrors on instance testConversionErrors(com.opensymphony.xwork2.ActionContextTest)(com.opensymphony.xwork2.ActionContextTest)
  testNewActionContextCanFindDefaultTexts on instance testNewActionContextCanFindDefaultTexts(com.opensymphony.xwork2.ActionContextTest)(com.opensymphony.xwork2.ActionContextTest)
  testApplication on instance testApplication(com.opensymphony.xwork2.ActionContextTest)(com.opensymphony.xwork2.ActionContextTest)
  testGetContext on instance testGetContext(com.opensymphony.xwork2.ActionContextTest)(com.opensymphony.xwork2.ActionContextTest)
  testContextParams on instance testContextParams(com.opensymphony.xwork2.ActionContextTest)(com.opensymphony.xwork2.ActionContextTest)
  testGetContent1 on instance testGetContent1(com.opensymphony.xwork2.config.providers.XmlHelperTest)(com.opensymphony.xwork2.config.providers.XmlHelperTest)
  testGetContent2 on instance testGetContent2(com.opensymphony.xwork2.config.providers.XmlHelperTest)(com.opensymphony.xwork2.config.providers.XmlHelperTest)
  testGetParams on instance testGetParams(com.opensymphony.xwork2.config.providers.XmlHelperTest)(com.opensymphony.xwork2.config.providers.XmlHelperTest)
  testWildCardInclude on instance testWildCardInclude(com.opensymphony.xwork2.config.providers.XmlConfigurationProviderWildCardIncludeTest)(com.opensymphony.xwork2.config.providers.XmlConfigurationProviderWildCardIncludeTest)
  testStreamResultWithCharSet2 on instance testStreamResultWithCharSet2(org.apache.struts2.result.StreamResultTest)(org.apache.struts2.result.StreamResultTest)
  testStreamResultDefault on instance testStreamResultDefault(org.apache.struts2.result.StreamResultTest)(org.apache.struts2.result.StreamResultTest)
  testStreamResultParse1 on instance testStreamResultParse1(org.apache.struts2.result.StreamResultTest)(org.apache.struts2.result.StreamResultTest)
  testStreamResultParse2 on instance testStreamResultParse2(org.apache.struts2.result.StreamResultTest)(org.apache.struts2.result.StreamResultTest)
  testStreamResultNoInputName on instance testStreamResultNoInputName(org.apache.struts2.result.StreamResultTest)(org.apache.struts2.result.StreamResultTest)
  testAllowCacheDefault on instance testAllowCacheDefault(org.apache.struts2.result.StreamResultTest)(org.apache.struts2.result.StreamResultTest)
  testAllowCacheFalse on instance testAllowCacheFalse(org.apache.struts2.result.StreamResultTest)(org.apache.struts2.result.StreamResultTest)
  testStreamResultParseNoInputName on instance testStreamResultParseNoInputName(org.apache.struts2.result.StreamResultTest)(org.apache.struts2.result.StreamResultTest)
  testStreamResultWithCharSet on instance testStreamResultWithCharSet(org.apache.struts2.result.StreamResultTest)(org.apache.struts2.result.StreamResultTest)
  testStreamResultNoDefault on instance testStreamResultNoDefault(org.apache.struts2.result.StreamResultTest)(org.apache.struts2.result.StreamResultTest)
  testSimpleWithDisableOn on instance testSimpleWithDisableOn(org.apache.struts2.views.jsp.ui.CheckboxListTest)(org.apache.struts2.views.jsp.ui.CheckboxListTest)
  testMultipleWithDisabledOn on instance testMultipleWithDisabledOn(org.apache.struts2.views.jsp.ui.CheckboxListTest)(org.apache.struts2.views.jsp.ui.CheckboxListTest)
  testGenericXhtml on instance testGenericXhtml(org.apache.struts2.views.jsp.ui.CheckboxListTest)(org.apache.struts2.views.jsp.ui.CheckboxListTest)
  testMultiple on instance testMultiple(org.apache.struts2.views.jsp.ui.CheckboxListTest)(org.apache.struts2.views.jsp.ui.CheckboxListTest)
  testSimple on instance testSimple(org.apache.struts2.views.jsp.ui.CheckboxListTest)(org.apache.struts2.views.jsp.ui.CheckboxListTest)
  testGenericSimple on instance testGenericSimple(org.apache.struts2.views.jsp.ui.CheckboxListTest)(org.apache.struts2.views.jsp.ui.CheckboxListTest)
  testSortWithIllegalSource on instance testSortWithIllegalSource(org.apache.struts2.views.jsp.SortIteratorTagTest)(org.apache.struts2.views.jsp.SortIteratorTagTest)
  testSortWithIdIteratorAvailableInStackTop on instance testSortWithIdIteratorAvailableInStackTop(org.apache.struts2.views.jsp.SortIteratorTagTest)(org.apache.struts2.views.jsp.SortIteratorTagTest)
  testSortWithoutId on instance testSortWithoutId(org.apache.struts2.views.jsp.SortIteratorTagTest)(org.apache.struts2.views.jsp.SortIteratorTagTest)
  testSortWithIllegalComparator on instance testSortWithIllegalComparator(org.apache.struts2.views.jsp.SortIteratorTagTest)(org.apache.struts2.views.jsp.SortIteratorTagTest)
  testSortWithIdIteratorAvailableInPageContext on instance testSortWithIdIteratorAvailableInPageContext(org.apache.struts2.views.jsp.SortIteratorTagTest)(org.apache.struts2.views.jsp.SortIteratorTagTest)
  testTextTagDoNotSearchStackByDefault on instance testTextTagDoNotSearchStackByDefault(org.apache.struts2.views.jsp.TextTagTest)(org.apache.struts2.views.jsp.TextTagTest)
  testExpressionsEvaluated on instance testExpressionsEvaluated(org.apache.struts2.views.jsp.TextTagTest)(org.apache.struts2.views.jsp.TextTagTest)
  testPutId on instance testPutId(org.apache.struts2.views.jsp.TextTagTest)(org.apache.struts2.views.jsp.TextTagTest)
  testTextTagUsesLocaleFromValueStack on instance testTextTagUsesLocaleFromValueStack(org.apache.struts2.views.jsp.TextTagTest)(org.apache.struts2.views.jsp.TextTagTest)
  testCorrectI18NKey2 on instance testCorrectI18NKey2(org.apache.struts2.views.jsp.TextTagTest)(org.apache.struts2.views.jsp.TextTagTest)
  testDefaultMessageOk on instance testDefaultMessageOk(org.apache.struts2.views.jsp.TextTagTest)(org.apache.struts2.views.jsp.TextTagTest)
  testWithNoMessageAndNoDefaultKeyReturned on instance testWithNoMessageAndNoDefaultKeyReturned(org.apache.struts2.views.jsp.TextTagTest)(org.apache.struts2.views.jsp.TextTagTest)
  testSimpleKeyValueWorks on instance testSimpleKeyValueWorks(org.apache.struts2.views.jsp.TextTagTest)(org.apache.struts2.views.jsp.TextTagTest)
  testNoNameDefined on instance testNoNameDefined(org.apache.struts2.views.jsp.TextTagTest)(org.apache.struts2.views.jsp.TextTagTest)
  testBlankNameDefined on instance testBlankNameDefined(org.apache.struts2.views.jsp.TextTagTest)(org.apache.struts2.views.jsp.TextTagTest)
  testTextTagCanSearchStackToFindValue on instance testTextTagCanSearchStackToFindValue(org.apache.struts2.views.jsp.TextTagTest)(org.apache.struts2.views.jsp.TextTagTest)
  testMessageFormatWorks on instance testMessageFormatWorks(org.apache.struts2.views.jsp.TextTagTest)(org.apache.struts2.views.jsp.TextTagTest)
  testWithNoMessageAndBodyIsNotEmptyBodyIsReturned on instance testWithNoMessageAndBodyIsNotEmptyBodyIsReturned(org.apache.struts2.views.jsp.TextTagTest)(org.apache.struts2.views.jsp.TextTagTest)
  testTextTagUsesValueStackInRequestNotActionContext on instance testTextTagUsesValueStackInRequestNotActionContext(org.apache.struts2.views.jsp.TextTagTest)(org.apache.struts2.views.jsp.TextTagTest)
  testCorrectI18NKey on instance testCorrectI18NKey(org.apache.struts2.views.jsp.TextTagTest)(org.apache.struts2.views.jsp.TextTagTest)
  testIfStrutsEncodingIsSetProperty on instance testIfStrutsEncodingIsSetProperty(org.apache.struts2.views.freemarker.FreemarkerManagerTest)(org.apache.struts2.views.freemarker.FreemarkerManagerTest)
  testTemplateLoaderBaseOnFile on instance testTemplateLoaderBaseOnFile(org.apache.struts2.views.freemarker.FreemarkerManagerTest)(org.apache.struts2.views.freemarker.FreemarkerManagerTest)
  testWithParameter on instance testWithParameter(org.apache.struts2.result.ServletDispatcherResultTest)(org.apache.struts2.result.ServletDispatcherResultTest)
  testInclude on instance testInclude(org.apache.struts2.result.ServletDispatcherResultTest)(org.apache.struts2.result.ServletDispatcherResultTest)
  testSimple on instance testSimple(org.apache.struts2.result.ServletDispatcherResultTest)(org.apache.struts2.result.ServletDispatcherResultTest)
  testAppendingIteratorUsingArrayAsSource on instance testAppendingIteratorUsingArrayAsSource(org.apache.struts2.views.jsp.AppendIteratorTagTest)(org.apache.struts2.views.jsp.AppendIteratorTagTest)
  testAppendingIteratorsUsingListAsSource on instance testAppendingIteratorsUsingListAsSource(org.apache.struts2.views.jsp.AppendIteratorTagTest)(org.apache.struts2.views.jsp.AppendIteratorTagTest)
  testRangeValidation on instance testRangeValidation(com.opensymphony.xwork2.validator.ShortRangeValidatorTest)(com.opensymphony.xwork2.validator.ShortRangeValidatorTest)
  testDifficultSymbols1 on instance testDifficultSymbols1(com.opensymphony.xwork2.TextProviderSupportTest)(com.opensymphony.xwork2.TextProviderSupportTest)
  testDifficultSymbols2 on instance testDifficultSymbols2(com.opensymphony.xwork2.TextProviderSupportTest)(com.opensymphony.xwork2.TextProviderSupportTest)
  testGetTextsWithArrayArgs on instance testGetTextsWithArrayArgs(com.opensymphony.xwork2.TextProviderSupportTest)(com.opensymphony.xwork2.TextProviderSupportTest)
  testGetTextsWithListArgs on instance testGetTextsWithListArgs(com.opensymphony.xwork2.TextProviderSupportTest)(com.opensymphony.xwork2.TextProviderSupportTest)
  testGetBundle on instance testGetBundle(com.opensymphony.xwork2.TextProviderSupportTest)(com.opensymphony.xwork2.TextProviderSupportTest)
  testHasKey on instance testHasKey(com.opensymphony.xwork2.TextProviderSupportTest)(com.opensymphony.xwork2.TextProviderSupportTest)
  testSimpleGetTexts on instance testSimpleGetTexts(com.opensymphony.xwork2.TextProviderSupportTest)(com.opensymphony.xwork2.TextProviderSupportTest)
  testGetTextsWithArgs on instance testGetTextsWithArgs(com.opensymphony.xwork2.TextProviderSupportTest)(com.opensymphony.xwork2.TextProviderSupportTest)
  testDefaultValues on instance testDefaultValues(org.apache.struts2.views.jsp.ui.SubmitTest)(org.apache.struts2.views.jsp.ui.SubmitTest)
  testImageWithSrc on instance testImageWithSrc(org.apache.struts2.views.jsp.ui.SubmitTest)(org.apache.struts2.views.jsp.ui.SubmitTest)
  testSimpleThemeImageUsingActionOnly on instance testSimpleThemeImageUsingActionOnly(org.apache.struts2.views.jsp.ui.SubmitTest)(org.apache.struts2.views.jsp.ui.SubmitTest)
  testSimpleThemeInput on instance testSimpleThemeInput(org.apache.struts2.views.jsp.ui.SubmitTest)(org.apache.struts2.views.jsp.ui.SubmitTest)
  testSimpleThemeImageUsingActionAndMethod on instance testSimpleThemeImageUsingActionAndMethod(org.apache.struts2.views.jsp.ui.SubmitTest)(org.apache.struts2.views.jsp.ui.SubmitTest)
  testButtonSimpleWithBody on instance testButtonSimpleWithBody(org.apache.struts2.views.jsp.ui.SubmitTest)(org.apache.struts2.views.jsp.ui.SubmitTest)
  testGenericXhtml on instance testGenericXhtml(org.apache.struts2.views.jsp.ui.SubmitTest)(org.apache.struts2.views.jsp.ui.SubmitTest)
  testSimpleThemeImageUsingMethodOnly on instance testSimpleThemeImageUsingMethodOnly(org.apache.struts2.views.jsp.ui.SubmitTest)(org.apache.struts2.views.jsp.ui.SubmitTest)
  testButtonWithLabel on instance testButtonWithLabel(org.apache.struts2.views.jsp.ui.SubmitTest)(org.apache.struts2.views.jsp.ui.SubmitTest)
  testImageSimple on instance testImageSimple(org.apache.struts2.views.jsp.ui.SubmitTest)(org.apache.struts2.views.jsp.ui.SubmitTest)
  testSimple on instance testSimple(org.apache.struts2.views.jsp.ui.SubmitTest)(org.apache.struts2.views.jsp.ui.SubmitTest)
  testButtonSimple on instance testButtonSimple(org.apache.struts2.views.jsp.ui.SubmitTest)(org.apache.struts2.views.jsp.ui.SubmitTest)
  testGenericSimple on instance testGenericSimple(org.apache.struts2.views.jsp.ui.SubmitTest)(org.apache.struts2.views.jsp.ui.SubmitTest)
  testRangeValidation on instance testRangeValidation(com.opensymphony.xwork2.validator.IntRangeValidatorTest)(com.opensymphony.xwork2.validator.IntRangeValidatorTest)
  testSimpleValue on instance testSimpleValue(com.opensymphony.xwork2.config.providers.EnvsValueSubstitutorTest)(com.opensymphony.xwork2.config.providers.EnvsValueSubstitutorTest)
  testNoSubstitution on instance testNoSubstitution(com.opensymphony.xwork2.config.providers.EnvsValueSubstitutorTest)(com.opensymphony.xwork2.config.providers.EnvsValueSubstitutorTest)
  testMergingIteratorWithArrayAsSource on instance testMergingIteratorWithArrayAsSource(org.apache.struts2.views.jsp.MergeIteratorTagTest)(org.apache.struts2.views.jsp.MergeIteratorTagTest)
  testMergingIteratorsWithListAsSource on instance testMergingIteratorsWithListAsSource(org.apache.struts2.views.jsp.MergeIteratorTagTest)(org.apache.struts2.views.jsp.MergeIteratorTagTest)
  testExpressionParams on instance testExpressionParams(com.opensymphony.xwork2.validator.DoubleRangeFieldValidatorTest)(com.opensymphony.xwork2.validator.DoubleRangeFieldValidatorTest)
  testArrayOfDoubles on instance testArrayOfDoubles(com.opensymphony.xwork2.validator.DoubleRangeFieldValidatorTest)(com.opensymphony.xwork2.validator.DoubleRangeFieldValidatorTest)
  testRangeValidationWithError on instance testRangeValidationWithError(com.opensymphony.xwork2.validator.DoubleRangeFieldValidatorTest)(com.opensymphony.xwork2.validator.DoubleRangeFieldValidatorTest)
  testRangeSimpleDoubleValueInStack on instance testRangeSimpleDoubleValueInStack(com.opensymphony.xwork2.validator.DoubleRangeFieldValidatorTest)(com.opensymphony.xwork2.validator.DoubleRangeFieldValidatorTest)
  testEdgeOfMinRange on instance testEdgeOfMinRange(com.opensymphony.xwork2.validator.DoubleRangeFieldValidatorTest)(com.opensymphony.xwork2.validator.DoubleRangeFieldValidatorTest)
  testRangeValidationWithExpressionsFail on instance testRangeValidationWithExpressionsFail(com.opensymphony.xwork2.validator.DoubleRangeFieldValidatorTest)(com.opensymphony.xwork2.validator.DoubleRangeFieldValidatorTest)
  testCollectionOfDoubles on instance testCollectionOfDoubles(com.opensymphony.xwork2.validator.DoubleRangeFieldValidatorTest)(com.opensymphony.xwork2.validator.DoubleRangeFieldValidatorTest)
  testRangeValidationNoError on instance testRangeValidationNoError(com.opensymphony.xwork2.validator.DoubleRangeFieldValidatorTest)(com.opensymphony.xwork2.validator.DoubleRangeFieldValidatorTest)
  testRangeRealDoubleValueInStack on instance testRangeRealDoubleValueInStack(com.opensymphony.xwork2.validator.DoubleRangeFieldValidatorTest)(com.opensymphony.xwork2.validator.DoubleRangeFieldValidatorTest)
  testEdgeOfMaxRange on instance testEdgeOfMaxRange(com.opensymphony.xwork2.validator.DoubleRangeFieldValidatorTest)(com.opensymphony.xwork2.validator.DoubleRangeFieldValidatorTest)
  testNoValue on instance testNoValue(com.opensymphony.xwork2.validator.DoubleRangeFieldValidatorTest)(com.opensymphony.xwork2.validator.DoubleRangeFieldValidatorTest)
  testRangeNoExclusiveAndNoValueInStack on instance testRangeNoExclusiveAndNoValueInStack(com.opensymphony.xwork2.validator.DoubleRangeFieldValidatorTest)(com.opensymphony.xwork2.validator.DoubleRangeFieldValidatorTest)
  testRangeNotADoubleObjectValueInStack on instance testRangeNotADoubleObjectValueInStack(com.opensymphony.xwork2.validator.DoubleRangeFieldValidatorTest)(com.opensymphony.xwork2.validator.DoubleRangeFieldValidatorTest)
  testGetIndex on instance testGetIndex(org.apache.struts2.dispatcher.mapper.Restful2ActionMapperTest)(org.apache.struts2.dispatcher.mapper.Restful2ActionMapperTest)
  testPutUpdateWithFakePut on instance testPutUpdateWithFakePut(org.apache.struts2.dispatcher.mapper.Restful2ActionMapperTest)(org.apache.struts2.dispatcher.mapper.Restful2ActionMapperTest)
  testDeleteRemoveWithFakeDelete on instance testDeleteRemoveWithFakeDelete(org.apache.struts2.dispatcher.mapper.Restful2ActionMapperTest)(org.apache.struts2.dispatcher.mapper.Restful2ActionMapperTest)
  testGetId on instance testGetId(org.apache.struts2.dispatcher.mapper.Restful2ActionMapperTest)(org.apache.struts2.dispatcher.mapper.Restful2ActionMapperTest)
  testGetEdit on instance testGetEdit(org.apache.struts2.dispatcher.mapper.Restful2ActionMapperTest)(org.apache.struts2.dispatcher.mapper.Restful2ActionMapperTest)
  testDeleteRemove on instance testDeleteRemove(org.apache.struts2.dispatcher.mapper.Restful2ActionMapperTest)(org.apache.struts2.dispatcher.mapper.Restful2ActionMapperTest)
  testPutUpdate on instance testPutUpdate(org.apache.struts2.dispatcher.mapper.Restful2ActionMapperTest)(org.apache.struts2.dispatcher.mapper.Restful2ActionMapperTest)
  testPostCreate on instance testPostCreate(org.apache.struts2.dispatcher.mapper.Restful2ActionMapperTest)(org.apache.struts2.dispatcher.mapper.Restful2ActionMapperTest)
  testPutUpdateWithIdParam on instance testPutUpdateWithIdParam(org.apache.struts2.dispatcher.mapper.Restful2ActionMapperTest)(org.apache.struts2.dispatcher.mapper.Restful2ActionMapperTest)
  testGetIndexWithParams on instance testGetIndexWithParams(org.apache.struts2.dispatcher.mapper.Restful2ActionMapperTest)(org.apache.struts2.dispatcher.mapper.Restful2ActionMapperTest)
  testMinValidation on instance testMinValidation(com.opensymphony.xwork2.validator.validators.ShortRangeFieldValidatorTest)(com.opensymphony.xwork2.validator.validators.ShortRangeFieldValidatorTest)
  testPassValidation on instance testPassValidation(com.opensymphony.xwork2.validator.validators.ShortRangeFieldValidatorTest)(com.opensymphony.xwork2.validator.validators.ShortRangeFieldValidatorTest)
  testMaxValidation on instance testMaxValidation(com.opensymphony.xwork2.validator.validators.ShortRangeFieldValidatorTest)(com.opensymphony.xwork2.validator.validators.ShortRangeFieldValidatorTest)
  testCreateSession on instance testCreateSession(org.apache.struts2.interceptor.ClearSessionInterceptorTest)(org.apache.struts2.interceptor.ClearSessionInterceptorTest)
  testResourcesFoundUsingNames on instance testResourcesFoundUsingNames(org.apache.struts2.result.VelocityResultTest)(org.apache.struts2.result.VelocityResultTest)
  testResourcesFoundUsingAbsolutePath on instance testResourcesFoundUsingAbsolutePath(org.apache.struts2.result.VelocityResultTest)(org.apache.struts2.result.VelocityResultTest)
  testCanResolveLocationUsingOgnl on instance testCanResolveLocationUsingOgnl(org.apache.struts2.result.VelocityResultTest)(org.apache.struts2.result.VelocityResultTest)
  testCanResolveLocationUsingStaticExpression on instance testCanResolveLocationUsingStaticExpression(org.apache.struts2.result.VelocityResultTest)(org.apache.struts2.result.VelocityResultTest)
  testGenericXhtml on instance testGenericXhtml(org.apache.struts2.views.jsp.ui.FileTest)(org.apache.struts2.views.jsp.ui.FileTest)
  testSimple on instance testSimple(org.apache.struts2.views.jsp.ui.FileTest)(org.apache.struts2.views.jsp.ui.FileTest)
  testGenericSimple on instance testGenericSimple(org.apache.struts2.views.jsp.ui.FileTest)(org.apache.struts2.views.jsp.ui.FileTest)
  testWildCardEvaluation on instance testWildCardEvaluation(com.opensymphony.xwork2.DefaultClasstTest)(com.opensymphony.xwork2.DefaultClasstTest)
  testMultipleInheritance on instance testMultipleInheritance(com.opensymphony.xwork2.config.ConfigurationTest)(com.opensymphony.xwork2.config.ConfigurationTest)
  testInitOnceForConfigurationProviders on instance testInitOnceForConfigurationProviders(com.opensymphony.xwork2.config.ConfigurationTest)(com.opensymphony.xwork2.config.ConfigurationTest)
  testAbstract on instance testAbstract(com.opensymphony.xwork2.config.ConfigurationTest)(com.opensymphony.xwork2.config.ConfigurationTest)
  testInterceptorParamInehritanceOverride on instance testInterceptorParamInehritanceOverride(com.opensymphony.xwork2.config.ConfigurationTest)(com.opensymphony.xwork2.config.ConfigurationTest)
  testFileIncludeLoader on instance testFileIncludeLoader(com.opensymphony.xwork2.config.ConfigurationTest)(com.opensymphony.xwork2.config.ConfigurationTest)
  testMultipleContainerProviders on instance testMultipleContainerProviders(com.opensymphony.xwork2.config.ConfigurationTest)(com.opensymphony.xwork2.config.ConfigurationTest)
  testWildcardName on instance testWildcardName(com.opensymphony.xwork2.config.ConfigurationTest)(com.opensymphony.xwork2.config.ConfigurationTest)
  testInitForPackageProviders on instance testInitForPackageProviders(com.opensymphony.xwork2.config.ConfigurationTest)(com.opensymphony.xwork2.config.ConfigurationTest)
  testInterceptorParamOverride on instance testInterceptorParamOverride(com.opensymphony.xwork2.config.ConfigurationTest)(com.opensymphony.xwork2.config.ConfigurationTest)
  testPackageExtension on instance testPackageExtension(com.opensymphony.xwork2.config.ConfigurationTest)(com.opensymphony.xwork2.config.ConfigurationTest)
  testWildcardNamespace on instance testWildcardNamespace(com.opensymphony.xwork2.config.ConfigurationTest)(com.opensymphony.xwork2.config.ConfigurationTest)
  testInterceptorParamInheritance on instance testInterceptorParamInheritance(com.opensymphony.xwork2.config.ConfigurationTest)(com.opensymphony.xwork2.config.ConfigurationTest)
  testGlobalResults on instance testGlobalResults(com.opensymphony.xwork2.config.ConfigurationTest)(com.opensymphony.xwork2.config.ConfigurationTest)
  testMultipleConfigProviders on instance testMultipleConfigProviders(com.opensymphony.xwork2.config.ConfigurationTest)(com.opensymphony.xwork2.config.ConfigurationTest)
  testInterceptorParams on instance testInterceptorParams(com.opensymphony.xwork2.config.ConfigurationTest)(com.opensymphony.xwork2.config.ConfigurationTest)
  testDefaultNamespace on instance testDefaultNamespace(com.opensymphony.xwork2.config.ConfigurationTest)(com.opensymphony.xwork2.config.ConfigurationTest)
  testBasicAllowed on instance testBasicAllowed(com.opensymphony.xwork2.interceptor.ParameterFilterInterceptorTest)(com.opensymphony.xwork2.interceptor.ParameterFilterInterceptorTest)
  testAllSubpropertiesAllowed on instance testAllSubpropertiesAllowed(com.opensymphony.xwork2.interceptor.ParameterFilterInterceptorTest)(com.opensymphony.xwork2.interceptor.ParameterFilterInterceptorTest)
  testEnsureOnlyPropsBlocked on instance testEnsureOnlyPropsBlocked(com.opensymphony.xwork2.interceptor.ParameterFilterInterceptorTest)(com.opensymphony.xwork2.interceptor.ParameterFilterInterceptorTest)
  testBasicBlocked on instance testBasicBlocked(com.opensymphony.xwork2.interceptor.ParameterFilterInterceptorTest)(com.opensymphony.xwork2.interceptor.ParameterFilterInterceptorTest)
  testTreeBlocking on instance testTreeBlocking(com.opensymphony.xwork2.interceptor.ParameterFilterInterceptorTest)(com.opensymphony.xwork2.interceptor.ParameterFilterInterceptorTest)
  testAllSubpropertiesBlocked on instance testAllSubpropertiesBlocked(com.opensymphony.xwork2.interceptor.ParameterFilterInterceptorTest)(com.opensymphony.xwork2.interceptor.ParameterFilterInterceptorTest)
  testBasicBlockAll on instance testBasicBlockAll(com.opensymphony.xwork2.interceptor.ParameterFilterInterceptorTest)(com.opensymphony.xwork2.interceptor.ParameterFilterInterceptorTest)
  testAddAllIndex on instance testAddAllIndex(com.opensymphony.xwork2.util.XWorkListTest)(com.opensymphony.xwork2.util.XWorkListTest)
  testTagAttributeExclusion on instance testTagAttributeExclusion(org.apache.struts2.views.jsp.ui.ComponentTest)(org.apache.struts2.views.jsp.ui.ComponentTest)
  testIdIsEvaluatedAgainstStack1 on instance testIdIsEvaluatedAgainstStack1(org.apache.struts2.views.jsp.ui.ComponentTest)(org.apache.struts2.views.jsp.ui.ComponentTest)
  testIdIsEvaludatedAgainstStack2 on instance testIdIsEvaludatedAgainstStack2(org.apache.struts2.views.jsp.ui.ComponentTest)(org.apache.struts2.views.jsp.ui.ComponentTest)
  testWithParam on instance testWithParam(org.apache.struts2.views.jsp.ui.ComponentTest)(org.apache.struts2.views.jsp.ui.ComponentTest)
  testSimple on instance testSimple(org.apache.struts2.views.jsp.ui.ComponentTest)(org.apache.struts2.views.jsp.ui.ComponentTest)
  testAutomatic on instance testAutomatic(org.apache.struts2.interceptor.MessageStoreInterceptorTest)(org.apache.struts2.interceptor.MessageStoreInterceptorTest)
  testRequestOperationMode1 on instance testRequestOperationMode1(org.apache.struts2.interceptor.MessageStoreInterceptorTest)(org.apache.struts2.interceptor.MessageStoreInterceptorTest)
  testRequestOperationMode2 on instance testRequestOperationMode2(org.apache.struts2.interceptor.MessageStoreInterceptorTest)(org.apache.struts2.interceptor.MessageStoreInterceptorTest)
  testRequestOperationMode3 on instance testRequestOperationMode3(org.apache.struts2.interceptor.MessageStoreInterceptorTest)(org.apache.struts2.interceptor.MessageStoreInterceptorTest)
  testRetrieveMessage on instance testRetrieveMessage(org.apache.struts2.interceptor.MessageStoreInterceptorTest)(org.apache.struts2.interceptor.MessageStoreInterceptorTest)
  testIgnoreMessageWithoutSession on instance testIgnoreMessageWithoutSession(org.apache.struts2.interceptor.MessageStoreInterceptorTest)(org.apache.struts2.interceptor.MessageStoreInterceptorTest)

Tests run: 1743, Failures: 1538, Errors: 0, Skipped: 2

[INFO] ------------------------------------------------------------------------
[INFO] Reactor Summary:
[INFO] 
[INFO] Struts 2 Bill of Materials ......................... SUCCESS [  1.374 s]
[INFO] Struts 2 ........................................... SUCCESS [  1.090 s]
[INFO] Struts 2 Core ...................................... FAILURE [01:10 min]
[INFO] Struts Plugins ..................................... SKIPPED
[INFO] Struts 2 Configuration Browser Plugin .............. SKIPPED
[INFO] Struts 2 Sitemesh Plugin ........................... SKIPPED
[INFO] Struts 2 Tiles Plugin .............................. SKIPPED
[INFO] Struts 2 DWR Plugin ................................ SKIPPED
[INFO] Struts 2 Spring Plugin ............................. SKIPPED
[INFO] Struts 2 Convention Plugin ......................... SKIPPED
[INFO] Struts 2 JUnit Plugin .............................. SKIPPED
[INFO] Struts 2 JSON Plugin ............................... SKIPPED
[INFO] Struts 2 Bean Validation Plugin .................... SKIPPED
[INFO] Struts 2 Webapps ................................... SKIPPED
[INFO] Struts 2 Showcase Webapp ........................... SKIPPED
[INFO] Struts 2 REST Plugin ............................... SKIPPED
[INFO] Struts 2 Rest Showcase Webapp ...................... SKIPPED
[INFO] Struts 2 CDI Plugin ................................ SKIPPED
[INFO] Struts 2 Embedded JSP Plugin ....................... SKIPPED
[INFO] Struts 2 GXP Plugin ................................ SKIPPED
[INFO] Struts 2 Jasper Reports Plugin ..................... SKIPPED
[INFO] Struts 2 Java Templates Plugin ..................... SKIPPED
[INFO] Struts 2 JFreeChart Plugin ......................... SKIPPED
[INFO] Struts 2 OSGi Plugin ............................... SKIPPED
[INFO] Struts 2 OVal Plugin ............................... SKIPPED
[INFO] Struts 2 Pell Multipart Plugin ..................... SKIPPED
[INFO] Struts 2 Plexus Plugin ............................. SKIPPED
[INFO] Struts 2 Portlet Plugin ............................ SKIPPED
[INFO] Struts 2 Portlet Tiles Plugin ...................... SKIPPED
[INFO] DEPRECATED: Struts 2 Sitegraph Plugin .............. SKIPPED
[INFO] Struts 2 TestNG Plugin ............................. SKIPPED
[INFO] Struts OSGi Bundles ................................ SKIPPED
[INFO] Struts 2 OSGi Admin Bundle ......................... SKIPPED
[INFO] Struts 2 OSGi Demo Bundle .......................... SKIPPED
[INFO] ------------------------------------------------------------------------
[INFO] BUILD FAILURE
[INFO] ------------------------------------------------------------------------
[INFO] Total time: 01:13 min
[INFO] Finished at: 2017-08-09T05:14:08Z
[INFO] Final Memory: 47M/157M
[INFO] ------------------------------------------------------------------------
[ERROR] Failed to execute goal org.apache.maven.plugins:maven-surefire-plugin:2.6:test (default-test)
on project struts2-core: There are test failures.
[ERROR] 
[ERROR] Please refer to <https://builds.apache.org/job/Struts-master-JDK9/ws/core/target/surefire-reports>
for the individual test results.
[ERROR] -> [Help 1]
[ERROR] 
[ERROR] To see the full stack trace of the errors, re-run Maven with the -e switch.
[ERROR] Re-run Maven using the -X switch to enable full debug logging.
[ERROR] 
[ERROR] For more information about the errors and possible solutions, please read the following
articles:
[ERROR] [Help 1] http://cwiki.apache.org/confluence/display/MAVEN/MojoFailureException
[ERROR] 
[ERROR] After correcting the problems, you can resume the build with the command
[ERROR]   mvn <goals> -rf :struts2-core
Build step 'Execute shell' marked build as failure
[locks-and-latches] Releasing all the locks
[locks-and-latches] All the locks released
Setting MAVEN_3_LATEST__HOME=/home/jenkins/tools/maven/latest3/

---------------------------------------------------------------------
To unsubscribe, e-mail: dev-unsubscribe@struts.apache.org
For additional commands, e-mail: dev-help@struts.apache.org


Mime
View raw message