struts-dev mailing list archives

Site index · List index
Message view « Date » · « Thread »
Top « Date » · « Thread »
From Apache Jenkins Server <jenk...@builds.apache.org>
Subject Build failed in Jenkins: Struts-examples-JDK8-master #59
Date Fri, 07 Jul 2017 07:29:55 GMT
See <https://builds.apache.org/job/Struts-examples-JDK8-master/59/display/redirect?page=changes>

Changes:

[phillips1021] added crud module

[phillips1021] initial commit of Struts 2 CRUD example

[phillips1021] changed logging

[phillips1021] added log4j DTD

[phillips1021] Added comments and general code cleanup

[adsn37] Added netbeans section in .gitignore

[adsn37] Display country name in persons list; implementation to be enhanced.

[adsn37] Fixed invalid update been saved: using clones of Person in MemoryDay.

[adsn37] Final clean up for comitting CRUD TODOs

[tkofford] Initial commit

[tkofford] Cleaning up CR/LF and tabs

[tkofford] Adding project 'shiro-basic'

[tkofford] Modifications for integrating with 'struts-examples' parent pom.xml file

[tkofford] Modifying package name to be consistent with other projects in the

[tkofford] Reorganizing package directories

[Lukasz Lenart] Upgrades to the latest Struts version

[Lukasz Lenart] Adds support for Travis

[Lukasz Lenart] Fixes post merge issues

[Lukasz Lenart] Drops unused definition

[Lukasz Lenart] Uses proper filter definition

[Lukasz Lenart] Fixes logging layer

[Lukasz Lenart] Converts readme to MD

[Lukasz Lenart] Adds info about builds

[Lukasz Lenart] Adds an empty line ... and closes outdated PRs Closes #1 Closes #2

[Lukasz Lenart] Uses only JDK8 to build the examples

------------------------------------------
[...truncated 2.25 KB...]
[Struts-examples-JDK8-master] $ /home/jenkins/tools/java/latest1.8/bin/java -Xms128m -Xmx768m
-XX:MaxPermSize=256m -XX:PermSize=128m -cp /home/jenkins/jenkins-slave/maven35-agent.jar:/home/jenkins/tools/maven/latest3/boot/plexus-classworlds-2.5.2.jar:/home/jenkins/tools/maven/latest3/conf/logging
jenkins.maven3.agent.Maven35Main /home/jenkins/tools/maven/latest3/ /home/jenkins/jenkins-slave/slave.jar
/home/jenkins/jenkins-slave/maven35-interceptor.jar /home/jenkins/jenkins-slave/maven3-interceptor-commons.jar
45501
Java HotSpot(TM) 64-Bit Server VM warning: ignoring option MaxPermSize=256m; support was removed
in 8.0
Java HotSpot(TM) 64-Bit Server VM warning: ignoring option PermSize=128m; support was removed
in 8.0
<===[JENKINS REMOTING CAPACITY]===>   channel started
Executing Maven:  -B -f <https://builds.apache.org/job/Struts-examples-JDK8-master/ws/pom.xml>
-Dmaven.repo.local=/home/jenkins/jenkins-slave/maven-repositories/0 package
[INFO] Scanning for projects...
[WARNING] 
[WARNING] Some problems were encountered while building the effective model for org.apache.struts:annotations:war:1.0.0
[WARNING] The expression ${artifactId} is deprecated. Please use ${project.artifactId} instead.
[WARNING] 
[WARNING] Some problems were encountered while building the effective model for org.apache.struts:bean-validation:war:1.0.0
[WARNING] The expression ${artifactId} is deprecated. Please use ${project.artifactId} instead.
[WARNING] 
[WARNING] Some problems were encountered while building the effective model for org.apache.struts:blank:war:1.0.0
[WARNING] The expression ${artifactId} is deprecated. Please use ${project.artifactId} instead.
[WARNING] 
[WARNING] Some problems were encountered while building the effective model for org.apache.struts:control-tags:war:1.0.0
[WARNING] The expression ${artifactId} is deprecated. Please use ${project.artifactId} instead.
[WARNING] 
[WARNING] Some problems were encountered while building the effective model for org.apache.struts:debugging-struts:war:1.0.0
[WARNING] The expression ${artifactId} is deprecated. Please use ${project.artifactId} instead.
[WARNING] 
[WARNING] Some problems were encountered while building the effective model for org.apache.struts:exception-handling:war:1.0.0
[WARNING] The expression ${artifactId} is deprecated. Please use ${project.artifactId} instead.
[WARNING] 
[WARNING] Some problems were encountered while building the effective model for org.apache.struts:exclude-parameters:war:1.0.0
[WARNING] The expression ${artifactId} is deprecated. Please use ${project.artifactId} instead.
[WARNING] 
[WARNING] Some problems were encountered while building the effective model for org.apache.struts:form-processing:war:1.0.0
[WARNING] The expression ${artifactId} is deprecated. Please use ${project.artifactId} instead.
[WARNING] 
[WARNING] Some problems were encountered while building the effective model for org.apache.struts:form-tags:war:1.0.0
[WARNING] The expression ${artifactId} is deprecated. Please use ${project.artifactId} instead.
[WARNING] 
[WARNING] Some problems were encountered while building the effective model for org.apache.struts:form-validation:war:1.0.0
[WARNING] The expression ${artifactId} is deprecated. Please use ${project.artifactId} instead.
[WARNING] 
[WARNING] Some problems were encountered while building the effective model for org.apache.struts:form-xml-validation:war:1.0.0
[WARNING] The expression ${artifactId} is deprecated. Please use ${project.artifactId} instead.
[WARNING] 
[WARNING] Some problems were encountered while building the effective model for org.apache.struts:http-session:war:1.0.0
[WARNING] The expression ${artifactId} is deprecated. Please use ${project.artifactId} instead.
[WARNING] 
[WARNING] Some problems were encountered while building the effective model for org.apache.struts:interceptors:war:1.0.0
[WARNING] The expression ${artifactId} is deprecated. Please use ${project.artifactId} instead.
[WARNING] 
[WARNING] Some problems were encountered while building the effective model for org.apache.struts:mailreader:war:1.0.0
[WARNING] The expression ${artifactId} is deprecated. Please use ${project.artifactId} instead.
[WARNING] 
[WARNING] Some problems were encountered while building the effective model for org.apache.struts:message-resource:war:1.0.0
[WARNING] The expression ${artifactId} is deprecated. Please use ${project.artifactId} instead.
[WARNING] 
[WARNING] Some problems were encountered while building the effective model for org.apache.struts:portlet:war:1.0.0
[WARNING] 'build.plugins.plugin.version' for org.apache.maven.plugins:maven-surefire-plugin
is missing. @ org.apache.struts:portlet:[unknown-version], <https://builds.apache.org/job/Struts-examples-JDK8-master/ws/portlet/pom.xml,>
line 180, column 21
[WARNING] 
[WARNING] Some problems were encountered while building the effective model for org.apache.struts:preparable-interface:war:1.0.0
[WARNING] The expression ${artifactId} is deprecated. Please use ${project.artifactId} instead.
[WARNING] 
[WARNING] Some problems were encountered while building the effective model for org.apache.struts:restful2actionmapper:war:1.0.0
[WARNING] The expression ${artifactId} is deprecated. Please use ${project.artifactId} instead.
[WARNING] 
[WARNING] Some problems were encountered while building the effective model for org.apache.struts:rest-angular:jar:1.0.0
[WARNING] 'build.plugins.plugin.version' for com.cj.jshintmojo:jshint-maven-plugin is missing.
@ org.apache.struts:rest-angular:[unknown-version], <https://builds.apache.org/job/Struts-examples-JDK8-master/ws/rest-angular/pom.xml,>
line 109, column 21
[WARNING] The expression ${artifactId} is deprecated. Please use ${project.artifactId} instead.
[WARNING] 
[WARNING] Some problems were encountered while building the effective model for org.apache.struts:spring-struts:war:1.0.0
[WARNING] The expression ${artifactId} is deprecated. Please use ${project.artifactId} instead.
[WARNING] 
[WARNING] Some problems were encountered while building the effective model for org.apache.struts:text-provider:war:1.0.0
[WARNING] The expression ${artifactId} is deprecated. Please use ${project.artifactId} instead.
[WARNING] 
[WARNING] Some problems were encountered while building the effective model for org.apache.struts:themes:war:1.0.0
[WARNING] The expression ${artifactId} is deprecated. Please use ${project.artifactId} instead.
[WARNING] 
[WARNING] Some problems were encountered while building the effective model for org.apache.struts:unit-testing:war:1.0.0
[WARNING] The expression ${artifactId} is deprecated. Please use ${project.artifactId} instead.
[WARNING] 
[WARNING] Some problems were encountered while building the effective model for org.apache.struts:wildcard-method-selection:war:1.0.0
[WARNING] The expression ${artifactId} is deprecated. Please use ${project.artifactId} instead.
[WARNING] 
[WARNING] It is highly recommended to fix these problems because they threaten the stability
of your build.
[WARNING] 
[WARNING] For this reason, future Maven versions might no longer support building such malformed
projects.
[WARNING] 
[INFO] ------------------------------------------------------------------------
[INFO] Reactor Build Order:
[INFO] 
[INFO] Struts 2 Examples
[INFO] Action chaining
[INFO] Annotations with Convention Plugin
[INFO] Basic Struts2 Example
[INFO] Bean Validation
[INFO] Struts 2 Blank Webapp
[INFO] Coding Struts 2 Action
[INFO] Control Tags
[INFO] CRUD Example
[INFO] Debugging Struts
[INFO] Exception handling
[INFO] Exclude Parameters
[INFO] File upload
[INFO] Form Processing
[INFO] Form Tags
[INFO] Form validation
[INFO] XML based form validation
[INFO] Hello World Struts 2 Example Application
[INFO] Http Session
[INFO] Struts 2 Interceptors
[INFO] JSON produce/consume
[INFO] Struts 2 Mail Reader Webapp
[INFO] Message resource
[INFO] Message Store
[INFO] Portlet Webapp
[INFO] Preparable Interface
[INFO] REST to Action Mapper Example Application
[INFO] REST Plugin based application with AngularJS
[INFO] Struts2 with Basic Shiro Security Integration
[INFO] Struts2 with Spring Integration
[INFO] Custom TextProvider
[INFO] Struts Tiles Example
[INFO] Struts 2 Themes
[INFO] Struts 2 Themes Override
[INFO] Type Conversion
[INFO] Unit Testing
[INFO] Using Struts 2 Tags
[INFO] Wildcard Method Selection
[INFO] Wildcard RegEx pattern matching
[INFO] Unknown handler
[INFO] 
[INFO] ------------------------------------------------------------------------
[INFO] Building Struts 2 Examples 1.0.0
[INFO] ------------------------------------------------------------------------
[INFO] 
[INFO] ------------------------------------------------------------------------
[INFO] Building Action chaining 1.0-SNAPSHOT
[INFO] ------------------------------------------------------------------------
[INFO] Downloading: https://repository.apache.org/content/groups/public/org/apache/struts/struts2-core/2.5.12/struts2-core-2.5.12.pom
[INFO] Downloading: https://repository.apache.org/content/groups/snapshots/org/apache/struts/struts2-core/2.5.12/struts2-core-2.5.12.pom
[INFO] Downloading: https://oss.sonatype.org/content/repositories/snapshots/org/apache/struts/struts2-core/2.5.12/struts2-core-2.5.12.pom
[INFO] Downloading: https://repo.maven.apache.org/maven2/org/apache/struts/struts2-core/2.5.12/struts2-core-2.5.12.pom
[WARNING] The POM for org.apache.struts:struts2-core:jar:2.5.12 is missing, no dependency
information available
[INFO] Downloading: https://repository.apache.org/content/groups/public/org/apache/struts/struts2-core/2.5.12/struts2-core-2.5.12.jar
[INFO] Downloading: https://repository.apache.org/content/groups/snapshots/org/apache/struts/struts2-core/2.5.12/struts2-core-2.5.12.jar
[INFO] Downloading: https://oss.sonatype.org/content/repositories/snapshots/org/apache/struts/struts2-core/2.5.12/struts2-core-2.5.12.jar
[INFO] Downloading: https://repo.maven.apache.org/maven2/org/apache/struts/struts2-core/2.5.12/struts2-core-2.5.12.jar
[INFO] ------------------------------------------------------------------------
[INFO] Reactor Summary:
[INFO] 
[INFO] Struts 2 Examples .................................. SUCCESS [  0.147 s]
[INFO] Action chaining .................................... FAILURE [  3.221 s]
[INFO] Annotations with Convention Plugin ................. SKIPPED
[INFO] Basic Struts2 Example .............................. SKIPPED
[INFO] Bean Validation .................................... SKIPPED
[INFO] Struts 2 Blank Webapp .............................. SKIPPED
[INFO] Coding Struts 2 Action ............................. SKIPPED
[INFO] Control Tags ....................................... SKIPPED
[INFO] CRUD Example ....................................... SKIPPED
[INFO] Debugging Struts ................................... SKIPPED
[INFO] Exception handling ................................. SKIPPED
[INFO] Exclude Parameters ................................. SKIPPED
[INFO] File upload ........................................ SKIPPED
[INFO] Form Processing .................................... SKIPPED
[INFO] Form Tags .......................................... SKIPPED
[INFO] Form validation .................................... SKIPPED
[INFO] XML based form validation .......................... SKIPPED
[INFO] Hello World Struts 2 Example Application ........... SKIPPED
[INFO] Http Session ....................................... SKIPPED
[INFO] Struts 2 Interceptors .............................. SKIPPED
[INFO] JSON produce/consume ............................... SKIPPED
[INFO] Struts 2 Mail Reader Webapp ........................ SKIPPED
[INFO] Message resource ................................... SKIPPED
[INFO] Message Store ...................................... SKIPPED
[INFO] Portlet Webapp ..................................... SKIPPED
[INFO] Preparable Interface ............................... SKIPPED
[INFO] REST to Action Mapper Example Application .......... SKIPPED
[INFO] REST Plugin based application with AngularJS ....... SKIPPED
[INFO] Struts2 with Basic Shiro Security Integration ...... SKIPPED
[INFO] Struts2 with Spring Integration .................... SKIPPED
[INFO] Custom TextProvider ................................ SKIPPED
[INFO] Struts Tiles Example ............................... SKIPPED
[INFO] Struts 2 Themes .................................... SKIPPED
[INFO] Struts 2 Themes Override ........................... SKIPPED
[INFO] Type Conversion .................................... SKIPPED
[INFO] Unit Testing ....................................... SKIPPED
[INFO] Using Struts 2 Tags ................................ SKIPPED
[INFO] Wildcard Method Selection .......................... SKIPPED
[INFO] Wildcard RegEx pattern matching .................... SKIPPED
[INFO] Unknown handler .................................... SKIPPED
[INFO] ------------------------------------------------------------------------
[INFO] BUILD FAILURE
[INFO] ------------------------------------------------------------------------
[INFO] Total time: 8.177 s
[INFO] Finished at: 2017-07-07T07:29:37Z
[INFO] Final Memory: 15M/197M
[INFO] ------------------------------------------------------------------------
[ERROR] Failed to execute goal on project action-chaining: Could not resolve dependencies
for project org.apache.struts:action-chaining:war:1.0-SNAPSHOT: Could not find artifact org.apache.struts:struts2-core:jar:2.5.12
in apache-public (https://repository.apache.org/content/groups/public/) -> [Help 1]
[ERROR] 
[ERROR] To see the full stack trace of the errors, re-run Maven with the -e switch.
[ERROR] Re-run Maven using the -X switch to enable full debug logging.
[ERROR] 
[ERROR] For more information about the errors and possible solutions, please read the following
articles:
[ERROR] [Help 1] http://cwiki.apache.org/confluence/display/MAVEN/DependencyResolutionException
[ERROR] 
[ERROR] After correcting the problems, you can resume the build with the command
[ERROR]   mvn <goals> -rf :action-chaining
[JENKINS] Archiving <https://builds.apache.org/job/Struts-examples-JDK8-master/ws/preparable-interface/pom.xml>
to org.apache.struts/preparable-interface/1.0.0/preparable-interface-1.0.0.pom
[JENKINS] Archiving <https://builds.apache.org/job/Struts-examples-JDK8-master/ws/bean-validation/pom.xml>
to org.apache.struts/bean-validation/1.0.0/bean-validation-1.0.0.pom
[JENKINS] Archiving <https://builds.apache.org/job/Struts-examples-JDK8-master/ws/debugging-struts/pom.xml>
to org.apache.struts/debugging-struts/1.0.0/debugging-struts-1.0.0.pom
[JENKINS] Archiving <https://builds.apache.org/job/Struts-examples-JDK8-master/ws/wildcard-method-selection/pom.xml>
to org.apache.struts/wildcard-method-selection/1.0.0/wildcard-method-selection-1.0.0.pom
[JENKINS] Archiving <https://builds.apache.org/job/Struts-examples-JDK8-master/ws/unit-testing/pom.xml>
to org.apache.struts/unit-testing/1.0.0/unit-testing-1.0.0.pom
[JENKINS] Archiving <https://builds.apache.org/job/Struts-examples-JDK8-master/ws/http-session/pom.xml>
to org.apache.struts/http-session/1.0.0/http-session-1.0.0.pom
[JENKINS] Archiving <https://builds.apache.org/job/Struts-examples-JDK8-master/ws/message-resource/pom.xml>
to org.apache.struts/message-resource/1.0.0/message-resource-1.0.0.pom
[JENKINS] Archiving <https://builds.apache.org/job/Struts-examples-JDK8-master/ws/portlet/pom.xml>
to org.apache.struts/portlet/1.0.0/portlet-1.0.0.pom
[JENKINS] Archiving <https://builds.apache.org/job/Struts-examples-JDK8-master/ws/wildcard-regex/pom.xml>
to org.apache.struts/wildcard-regex/1/wildcard-regex-1.pom
[JENKINS] Archiving <https://builds.apache.org/job/Struts-examples-JDK8-master/ws/form-tags/pom.xml>
to org.apache.struts/form-tags/1.0.0/form-tags-1.0.0.pom
[JENKINS] Archiving <https://builds.apache.org/job/Struts-examples-JDK8-master/ws/unknown-handler/pom.xml>
to org.apache.org/unknown-handler/1.0.0/unknown-handler-1.0.0.pom
[JENKINS] Archiving <https://builds.apache.org/job/Struts-examples-JDK8-master/ws/helloworld/pom.xml>
to org.apache.struts/helloworld/1.0.0/helloworld-1.0.0.pom
[JENKINS] Archiving <https://builds.apache.org/job/Struts-examples-JDK8-master/ws/restful2actionmapper/pom.xml>
to org.apache.struts/restful2actionmapper/1.0.0/restful2actionmapper-1.0.0.pom
[JENKINS] Archiving <https://builds.apache.org/job/Struts-examples-JDK8-master/ws/message-store/pom.xml>
to org.apache.struts/message-store/1.0-SNAPSHOT/message-store-1.0-SNAPSHOT.pom
[JENKINS] Archiving <https://builds.apache.org/job/Struts-examples-JDK8-master/ws/crud/pom.xml>
to org.apache.struts/crud/1.0-SNAPSHOT/crud-1.0-SNAPSHOT.pom
No prior successful build to compare, so performing full copy of artifacts
[JENKINS] Archiving <https://builds.apache.org/job/Struts-examples-JDK8-master/ws/themes/pom.xml>
to org.apache.struts/themes/1.0.0/themes-1.0.0.pom
[JENKINS] Archiving <https://builds.apache.org/job/Struts-examples-JDK8-master/ws/action-chaining/pom.xml>
to org.apache.struts/action-chaining/1.0-SNAPSHOT/action-chaining-1.0-SNAPSHOT.pom
[JENKINS] Archiving <https://builds.apache.org/job/Struts-examples-JDK8-master/ws/rest-angular/pom.xml>
to org.apache.struts/rest-angular/1.0.0/rest-angular-1.0.0.pom
[JENKINS] Archiving <https://builds.apache.org/job/Struts-examples-JDK8-master/ws/exception-handling/pom.xml>
to org.apache.struts/exception-handling/1.0.0/exception-handling-1.0.0.pom
[JENKINS] Archiving <https://builds.apache.org/job/Struts-examples-JDK8-master/ws/form-processing/pom.xml>
to org.apache.struts/form-processing/1.0.0/form-processing-1.0.0.pom
[JENKINS] Archiving <https://builds.apache.org/job/Struts-examples-JDK8-master/ws/shiro-basic/pom.xml>
to org.apache.struts/shiro-basic/1.0.0/shiro-basic-1.0.0.pom
No prior successful build to compare, so performing full copy of artifacts
[JENKINS] Archiving <https://builds.apache.org/job/Struts-examples-JDK8-master/ws/mailreader/pom.xml>
to org.apache.struts/mailreader/1.0.0/mailreader-1.0.0.pom
[JENKINS] Archiving <https://builds.apache.org/job/Struts-examples-JDK8-master/ws/text-provider/pom.xml>
to org.apache.struts/text-provider/1.0.0/text-provider-1.0.0.pom
[JENKINS] Archiving <https://builds.apache.org/job/Struts-examples-JDK8-master/ws/type-conversion/pom.xml>
to org.apache.struts/type-conversion/1.0.0/type-conversion-1.0.0.pom
[JENKINS] Archiving <https://builds.apache.org/job/Struts-examples-JDK8-master/ws/pom.xml>
to org.apache.struts/struts-examples/1.0.0/struts-examples-1.0.0.pom
[JENKINS] Archiving <https://builds.apache.org/job/Struts-examples-JDK8-master/ws/file-upload/pom.xml>
to org.apache.struts/file-upload/1.0.0/file-upload-1.0.0.pom
[JENKINS] Archiving <https://builds.apache.org/job/Struts-examples-JDK8-master/ws/blank/pom.xml>
to org.apache.struts/blank/1.0.0/blank-1.0.0.pom
[JENKINS] Archiving <https://builds.apache.org/job/Struts-examples-JDK8-master/ws/spring-struts/pom.xml>
to org.apache.struts/spring-struts/1.0.0/spring-struts-1.0.0.pom
[JENKINS] Archiving <https://builds.apache.org/job/Struts-examples-JDK8-master/ws/basic-struts/pom.xml>
to org.apache.struts/basic-struts/1.0.0/basic-struts-1.0.0.pom
[JENKINS] Archiving <https://builds.apache.org/job/Struts-examples-JDK8-master/ws/themes-override/pom.xml>
to org.apache.struts/themes-override/1.0.0/themes-override-1.0.0.pom
[JENKINS] Archiving <https://builds.apache.org/job/Struts-examples-JDK8-master/ws/json/pom.xml>
to org.demo/json/1.0-SNAPSHOT/json-1.0-SNAPSHOT.pom
[JENKINS] Archiving <https://builds.apache.org/job/Struts-examples-JDK8-master/ws/interceptors/pom.xml>
to org.apache.struts/interceptors/1.0.0/interceptors-1.0.0.pom
[JENKINS] Archiving <https://builds.apache.org/job/Struts-examples-JDK8-master/ws/tiles/pom.xml>
to org.apache.struts/tiles/1.0.0/tiles-1.0.0.pom
[JENKINS] Archiving <https://builds.apache.org/job/Struts-examples-JDK8-master/ws/form-xml-validation/pom.xml>
to org.apache.struts/form-xml-validation/1.0.0/form-xml-validation-1.0.0.pom
[JENKINS] Archiving <https://builds.apache.org/job/Struts-examples-JDK8-master/ws/exclude-parameters/pom.xml>
to org.apache.struts/exclude-parameters/1.0.0/exclude-parameters-1.0.0.pom
[JENKINS] Archiving <https://builds.apache.org/job/Struts-examples-JDK8-master/ws/coding-actions/pom.xml>
to org.apache.struts/coding-actions/1.0.0/coding-actions-1.0.0.pom
[JENKINS] Archiving <https://builds.apache.org/job/Struts-examples-JDK8-master/ws/using-tags/pom.xml>
to org.apache.struts/using-tags/1.0.0/using-tags-1.0.0.pom
[JENKINS] Archiving <https://builds.apache.org/job/Struts-examples-JDK8-master/ws/control-tags/pom.xml>
to org.apache.struts/control-tags/1.0.0/control-tags-1.0.0.pom
[JENKINS] Archiving <https://builds.apache.org/job/Struts-examples-JDK8-master/ws/annotations/pom.xml>
to org.apache.struts/annotations/1.0.0/annotations-1.0.0.pom
[JENKINS] Archiving <https://builds.apache.org/job/Struts-examples-JDK8-master/ws/form-validation/pom.xml>
to org.apache.struts/form-validation/1.0.0/form-validation-1.0.0.pom
[locks-and-latches] Releasing all the locks
[locks-and-latches] All the locks released
channel stopped

---------------------------------------------------------------------
To unsubscribe, e-mail: dev-unsubscribe@struts.apache.org
For additional commands, e-mail: dev-help@struts.apache.org


Mime
View raw message