struts-dev mailing list archives

Site index · List index
Message view « Date » · « Thread »
Top « Date » · « Thread »
From Apache Jenkins Server <jenk...@builds.apache.org>
Subject Build failed in Jenkins: Struts-JDK7-pull-request #313
Date Fri, 16 Jun 2017 08:52:33 GMT
See <https://builds.apache.org/job/Struts-JDK7-pull-request/313/display/redirect>

------------------------------------------
[...truncated 4.31 KB...]
 > git rev-parse refs/tags/STRUTS_2_3_24_2^{commit} # timeout=10
 > git rev-parse refs/tags/STRUTS_2_3_25^{commit} # timeout=10
 > git rev-parse refs/tags/STRUTS_2_3_28_1^{commit} # timeout=10
 > git rev-parse refs/tags/STRUTS_2_3_26^{commit} # timeout=10
 > git rev-parse refs/tags/STRUTS_2_3_27^{commit} # timeout=10
 > git rev-parse refs/tags/STRUTS_2_3_28^{commit} # timeout=10
 > git rev-parse refs/tags/changes/305^{commit} # timeout=10
 > git rev-parse refs/tags/STRUTS_2_0_9^{commit} # timeout=10
 > git rev-parse refs/tags/STRUTS_2_0_8^{commit} # timeout=10
 > git rev-parse refs/tags/changes/269^{commit} # timeout=10
 > git rev-parse refs/tags/changes/302^{commit} # timeout=10
 > git rev-parse refs/tags/changes/304^{commit} # timeout=10
 > git rev-parse refs/tags/STRUTS_2_2_3_1^{commit} # timeout=10
 > git rev-parse refs/tags/changes/265^{commit} # timeout=10
 > git rev-parse refs/tags/changes/266^{commit} # timeout=10
 > git rev-parse refs/tags/changes/267^{commit} # timeout=10
 > git rev-parse refs/tags/changes/260^{commit} # timeout=10
 > git rev-parse refs/tags/changes/261^{commit} # timeout=10
 > git rev-parse refs/tags/changes/262^{commit} # timeout=10
 > git rev-parse refs/tags/changes/263^{commit} # timeout=10
 > git rev-parse refs/tags/STRUTS_2_3_10^{commit} # timeout=10
 > git rev-parse refs/tags/STRUTS_2_3_11^{commit} # timeout=10
 > git rev-parse refs/tags/STRUTS_2_3_12^{commit} # timeout=10
 > git rev-parse refs/tags/STRUTS_2_3_13^{commit} # timeout=10
 > git rev-parse refs/tags/STRUTS_2_0_3^{commit} # timeout=10
 > git rev-parse refs/tags/STRUTS_2_0_2^{commit} # timeout=10
 > git rev-parse refs/tags/STRUTS_2_3_19^{commit} # timeout=10
 > git rev-parse refs/tags/STRUTS_2_0_1^{commit} # timeout=10
 > git rev-parse refs/tags/STRUTS_2_0_0^{commit} # timeout=10
 > git rev-parse refs/tags/STRUTS_2_0_7^{commit} # timeout=10
 > git rev-parse refs/tags/STRUTS_2_3_14^{commit} # timeout=10
 > git rev-parse refs/tags/STRUTS_2_0_6^{commit} # timeout=10
 > git rev-parse refs/tags/STRUTS_2_3_15^{commit} # timeout=10
 > git rev-parse refs/tags/STRUTS_2_0_5^{commit} # timeout=10
 > git rev-parse refs/tags/STRUTS_2_3_16^{commit} # timeout=10
 > git rev-parse refs/tags/STRUTS_2_0_4^{commit} # timeout=10
 > git rev-parse refs/tags/STRUTS_2_3_17^{commit} # timeout=10
 > git rev-parse refs/tags/changes/235^{commit} # timeout=10
 > git rev-parse refs/tags/STRUTS_2_3_4_1^{commit} # timeout=10
 > git rev-parse refs/tags/changes/237^{commit} # timeout=10
 > git rev-parse refs/tags/changes/231^{commit} # timeout=10
 > git rev-parse refs/tags/changes/232^{commit} # timeout=10
 > git rev-parse refs/tags/changes/233^{commit} # timeout=10
 > git rev-parse refs/tags/changes/234^{commit} # timeout=10
 > git rev-parse refs/tags/changes/230^{commit} # timeout=10
 > git rev-parse refs/tags/STRUTS_2_0_10^{commit} # timeout=10
 > git rev-parse refs/tags/STRUTS_2_0_14^{commit} # timeout=10
 > git rev-parse refs/tags/STRUTS_2_0_13^{commit} # timeout=10
 > git rev-parse refs/tags/STRUTS_2_0_12^{commit} # timeout=10
 > git rev-parse refs/tags/STRUTS_2_0_11^{commit} # timeout=10
 > git rev-parse refs/tags/STRUTS_2_5_BETA3^{commit} # timeout=10
 > git rev-parse refs/tags/STRUTS_2_5_6^{commit} # timeout=10
 > git rev-parse refs/tags/STRUTS_2_5_5^{commit} # timeout=10
 > git rev-parse refs/tags/STRUTS_2_1_8^{commit} # timeout=10
 > git rev-parse refs/tags/STRUTS_2_5_4^{commit} # timeout=10
 > git rev-parse refs/tags/STRUTS_2_5_BETA2^{commit} # timeout=10
 > git rev-parse refs/tags/STRUTS_2_1_7^{commit} # timeout=10
 > git rev-parse refs/tags/STRUTS_2_5_3^{commit} # timeout=10
 > git rev-parse refs/tags/STRUTS_2_5_BETA1^{commit} # timeout=10
 > git rev-parse refs/tags/changes/246^{commit} # timeout=10
 > git rev-parse refs/tags/STRUTS_2_5_9^{commit} # timeout=10
 > git rev-parse refs/tags/changes/247^{commit} # timeout=10
 > git rev-parse refs/tags/STRUTS_2_5_8^{commit} # timeout=10
 > git rev-parse refs/tags/changes/248^{commit} # timeout=10
 > git rev-parse refs/tags/STRUTS_2_5_7^{commit} # timeout=10
 > git rev-parse refs/tags/changes/243^{commit} # timeout=10
 > git rev-parse refs/tags/changes/244^{commit} # timeout=10
 > git rev-parse refs/tags/STRUTS_2_1_8_1^{commit} # timeout=10
 > git rev-parse refs/tags/changes/245^{commit} # timeout=10
 > git rev-parse refs/tags/changes/240^{commit} # timeout=10
 > git rev-parse refs/tags/STRUTS_2_5_10^{commit} # timeout=10
 > git rev-parse refs/tags/STRUTS_2_0_11_1^{commit} # timeout=10
 > git rev-parse refs/tags/STRUTS_2_1_2^{commit} # timeout=10
 > git rev-parse refs/tags/STRUTS_2_0_11_2^{commit} # timeout=10
 > git rev-parse refs/tags/STRUTS_2_1_1^{commit} # timeout=10
 > git rev-parse refs/tags/STRUTS_2_1_0^{commit} # timeout=10
 > git rev-parse refs/tags/STRUTS_2_3_14_1^{commit} # timeout=10
 > git rev-parse refs/tags/STRUTS_2_3_14_2^{commit} # timeout=10
 > git rev-parse refs/tags/STRUTS_2_1_6^{commit} # timeout=10
 > git rev-parse refs/tags/STRUTS_2_3_14_3^{commit} # timeout=10
 > git rev-parse refs/tags/STRUTS_2_5_2^{commit} # timeout=10
 > git rev-parse refs/tags/STRUTS_2_1_5^{commit} # timeout=10
 > git rev-parse refs/tags/STRUTS_2_5_1^{commit} # timeout=10
 > git rev-parse refs/tags/STRUTS_2_1_4^{commit} # timeout=10
 > git rev-parse refs/tags/STRUTS_2_1_3^{commit} # timeout=10
 > git rev-parse refs/tags/changes/297^{commit} # timeout=10
 > git rev-parse refs/tags/changes/298^{commit} # timeout=10
 > git rev-parse refs/tags/changes/299^{commit} # timeout=10
 > git rev-parse refs/tags/changes/294^{commit} # timeout=10
 > git rev-parse refs/tags/changes/295^{commit} # timeout=10
 > git rev-parse refs/tags/changes/296^{commit} # timeout=10
 > git rev-parse refs/tags/STRUTS_2_5^{commit} # timeout=10
 > git rev-parse refs/tags/changes/228^{commit} # timeout=10
 > git rev-parse refs/tags/changes/229^{commit} # timeout=10
 > git rev-parse refs/tags/STRUTS_2_2_1_1^{commit} # timeout=10
Multiple candidate revisions
Scheduling another build to catch up with Struts-JDK7-pull-request
Checking out Revision df365f17ea11e319302f648e86da3188ce1c5656 (refs/tags/STRUTS_2_0_4)
 > git config core.sparsecheckout # timeout=10
 > git checkout -f df365f17ea11e319302f648e86da3188ce1c5656
First time build. Skipping changelog.
[locks-and-latches] Checking to see if we really have the locks
[locks-and-latches] Have all the locks, build can start
Parsing POMs
Modules changed, recalculating dependency graph
Established TCP socket on 38484
maven35-agent.jar already up to date
maven35-interceptor.jar already up to date
maven3-interceptor-commons.jar already up to date
[Struts-JDK7-pull-request] $ /home/jenkins/tools/java/latest1.7/bin/java -Xms128m -Xmx768m
-XX:MaxPermSize=256m -XX:PermSize=128m -cp /home/jenkins/jenkins-slave/maven35-agent.jar:/home/jenkins/tools/maven/latest3/boot/plexus-classworlds-2.5.2.jar:/home/jenkins/tools/maven/latest3/conf/logging
jenkins.maven3.agent.Maven35Main /home/jenkins/tools/maven/latest3/ /home/jenkins/jenkins-slave/slave.jar
/home/jenkins/jenkins-slave/maven35-interceptor.jar /home/jenkins/jenkins-slave/maven3-interceptor-commons.jar
38484
<===[JENKINS REMOTING CAPACITY]===>   channel started
Executing Maven:  -B -f <https://builds.apache.org/job/Struts-JDK7-pull-request/ws/pom.xml>
-Dmaven.repo.local=/home/jenkins/jenkins-slave/maven-repositories/1 package -DskipAssembly
[INFO] Scanning for projects...
[WARNING] 
[WARNING] Some problems were encountered while building the effective model for org.apache.struts:struts2-core:jar:2.0.4
[WARNING] 'build.plugins.plugin.version' for org.apache.myfaces.tobago:maven-apt-plugin is
missing. @ org.apache.struts:struts2-core:[unknown-version], <https://builds.apache.org/job/Struts-JDK7-pull-request/ws/core/pom.xml,>
line 47, column 21
[WARNING] The expression ${pom.version} is deprecated. Please use ${project.version} instead.
[WARNING] 'repositories.repository.layout' for opensymphony uses the unsupported value 'legacy',
artifact resolution might fail. @ org.apache.struts:struts2-parent:2.0.4, <https://builds.apache.org/job/Struts-JDK7-pull-request/ws/pom.xml,>
line 347, column 21
[WARNING] 
[WARNING] Some problems were encountered while building the effective model for org.apache.struts:struts2-api:jar:2.0.4
[WARNING] 'build.plugins.plugin.version' for org.apache.maven.plugins:maven-javadoc-plugin
is missing. @ org.apache.struts:struts2-api:[unknown-version], <https://builds.apache.org/job/Struts-JDK7-pull-request/ws/api/pom.xml,>
line 45, column 21
[WARNING] 'repositories.repository.layout' for opensymphony uses the unsupported value 'legacy',
artifact resolution might fail. @ org.apache.struts:struts2-parent:2.0.4, <https://builds.apache.org/job/Struts-JDK7-pull-request/ws/pom.xml,>
line 347, column 21
[WARNING] 
[WARNING] Some problems were encountered while building the effective model for org.apache.struts:struts2-parent:pom:2.0.4
[WARNING] 'repositories.repository.layout' for opensymphony uses the unsupported value 'legacy',
artifact resolution might fail. @ line 347, column 21
[WARNING] 
[WARNING] It is highly recommended to fix these problems because they threaten the stability
of your build.
[WARNING] 
[WARNING] For this reason, future Maven versions might no longer support building such malformed
projects.
[WARNING] 
[INFO] ------------------------------------------------------------------------
[INFO] Reactor Build Order:
[INFO] 
[INFO] Struts 2
[INFO] Struts 2 API
[INFO] Struts 2 Core
[INFO] 
[INFO] ------------------------------------------------------------------------
[INFO] Building Struts 2 2.0.4
[INFO] ------------------------------------------------------------------------
[INFO] Downloading: http://snapshots.maven.codehaus.org/maven2/org/apache/maven/plugins/maven-idea-plugin/maven-metadata.xml
[INFO] Downloading: http://repository.apache.org/snapshots/org/apache/maven/plugins/maven-idea-plugin/maven-metadata.xml
[INFO] Downloaded: http://repository.apache.org/snapshots/org/apache/maven/plugins/maven-idea-plugin/maven-metadata.xml
(394 B at 786 B/s)
[WARNING] Could not transfer metadata org.apache.maven.plugins:maven-idea-plugin/maven-metadata.xml
from/to Maven Snapshots (http://snapshots.maven.codehaus.org/maven2/): Connect to snapshots.maven.codehaus.org:80
[snapshots.maven.codehaus.org/52.5.67.234] failed: Connection timed out
[INFO] Downloading: http://snapshots.maven.codehaus.org/maven2/org/apache/maven/plugins/maven-compiler-plugin/maven-metadata.xml
[INFO] Downloading: http://repository.apache.org/snapshots/org/apache/maven/plugins/maven-compiler-plugin/maven-metadata.xml
[INFO] Downloaded: http://repository.apache.org/snapshots/org/apache/maven/plugins/maven-compiler-plugin/maven-metadata.xml
(583 B at 1.5 kB/s)
[WARNING] Could not transfer metadata org.apache.maven.plugins:maven-compiler-plugin/maven-metadata.xml
from/to Maven Snapshots (http://snapshots.maven.codehaus.org/maven2/): Connect to snapshots.maven.codehaus.org:80
[snapshots.maven.codehaus.org/52.5.67.234] failed: Connection timed out
[INFO] 
[INFO] ------------------------------------------------------------------------
[INFO] Building Struts 2 API 2.0.4
[INFO] ------------------------------------------------------------------------
[INFO] Downloading: http://snapshots.maven.codehaus.org/maven2/org/apache/maven/plugins/maven-javadoc-plugin/maven-metadata.xml
[INFO] Downloading: http://repository.apache.org/snapshots/org/apache/maven/plugins/maven-javadoc-plugin/maven-metadata.xml
[INFO] Downloaded: http://repository.apache.org/snapshots/org/apache/maven/plugins/maven-javadoc-plugin/maven-metadata.xml
(582 B at 1.6 kB/s)
[WARNING] Could not transfer metadata org.apache.maven.plugins:maven-javadoc-plugin/maven-metadata.xml
from/to Maven Snapshots (http://snapshots.maven.codehaus.org/maven2/): Connect to snapshots.maven.codehaus.org:80
[snapshots.maven.codehaus.org/52.5.67.234] failed: Connection timed out
[WARNING] Failure to transfer org.apache.maven.plugins:maven-idea-plugin/maven-metadata.xml
from http://snapshots.maven.codehaus.org/maven2/ was cached in the local repository, resolution
will not be reattempted until the update interval of Maven Snapshots has elapsed or updates
are forced. Original error: Could not transfer metadata org.apache.maven.plugins:maven-idea-plugin/maven-metadata.xml
from/to Maven Snapshots (http://snapshots.maven.codehaus.org/maven2/): Connect to snapshots.maven.codehaus.org:80
[snapshots.maven.codehaus.org/52.5.67.234] failed: Connection timed out
[INFO] Downloading: https://repo.maven.apache.org/maven2/org/apache/maven/plugins/maven-surefire-plugin/2.1.3/maven-surefire-plugin-2.1.3.pom
[INFO] Downloaded: https://repo.maven.apache.org/maven2/org/apache/maven/plugins/maven-surefire-plugin/2.1.3/maven-surefire-plugin-2.1.3.pom
(1.7 kB at 3.8 kB/s)
[INFO] Downloading: https://repo.maven.apache.org/maven2/org/apache/maven/plugins/maven-plugins/1/maven-plugins-1.pom
[INFO] Downloaded: https://repo.maven.apache.org/maven2/org/apache/maven/plugins/maven-plugins/1/maven-plugins-1.pom
(3.2 kB at 216 kB/s)
[INFO] Downloading: https://repo.maven.apache.org/maven2/org/apache/maven/plugins/maven-surefire-plugin/2.1.3/maven-surefire-plugin-2.1.3.jar
[INFO] Downloaded: https://repo.maven.apache.org/maven2/org/apache/maven/plugins/maven-surefire-plugin/2.1.3/maven-surefire-plugin-2.1.3.jar
(10 kB at 332 kB/s)
[INFO] 
[INFO] --- maven-resources-plugin:2.6:resources (default-resources) @ struts2-api ---
[WARNING] Using platform encoding (ISO-8859-1 actually) to copy filtered resources, i.e. build
is platform dependent!
[INFO] Copying 2 resources
[INFO] 
[INFO] --- maven-compiler-plugin:3.1:compile (default-compile) @ struts2-api ---
[INFO] Changes detected - recompiling the module!
[WARNING] File encoding has not been set, using platform encoding ISO-8859-1, i.e. build is
platform dependent!
[INFO] Compiling 14 source files to <https://builds.apache.org/job/Struts-JDK7-pull-request/ws/api/target/classes>
[INFO] 
[INFO] --- maven-resources-plugin:2.6:testResources (default-testResources) @ struts2-api
---
[WARNING] Using platform encoding (ISO-8859-1 actually) to copy filtered resources, i.e. build
is platform dependent!
[INFO] skip non existing resourceDirectory <https://builds.apache.org/job/Struts-JDK7-pull-request/ws/api/src/test/resources>
[INFO] 
[INFO] --- maven-compiler-plugin:3.1:testCompile (default-testCompile) @ struts2-api ---
[INFO] No sources to compile
[INFO] 
[INFO] --- maven-surefire-plugin:2.1.3:test (default-test) @ struts2-api ---
[INFO] Downloading: https://repo.maven.apache.org/maven2/org/apache/maven/surefire/surefire-booter/1.5.3/surefire-booter-1.5.3.pom
[INFO] Downloaded: https://repo.maven.apache.org/maven2/org/apache/maven/surefire/surefire-booter/1.5.3/surefire-booter-1.5.3.pom
(778 B at 46 kB/s)
[INFO] Downloading: https://repo.maven.apache.org/maven2/org/apache/maven/surefire/surefire-root/1.1/surefire-root-1.1.pom
[INFO] Downloaded: https://repo.maven.apache.org/maven2/org/apache/maven/surefire/surefire-root/1.1/surefire-root-1.1.pom
(4.3 kB at 239 kB/s)
[INFO] Downloading: https://repo.maven.apache.org/maven2/org/apache/maven/surefire/surefire/1.5.3/surefire-1.5.3.pom
[INFO] Downloaded: https://repo.maven.apache.org/maven2/org/apache/maven/surefire/surefire/1.5.3/surefire-1.5.3.pom
(731 B at 52 kB/s)
[INFO] Downloading: https://repo.maven.apache.org/maven2/org/apache/maven/surefire/surefire-booter/1.5.3/surefire-booter-1.5.3.jar
[INFO] Downloading: https://repo.maven.apache.org/maven2/org/apache/maven/surefire/surefire/1.5.3/surefire-1.5.3.jar
[INFO] Downloaded: https://repo.maven.apache.org/maven2/org/apache/maven/surefire/surefire-booter/1.5.3/surefire-booter-1.5.3.jar
(14 kB at 555 kB/s)
[INFO] Downloaded: https://repo.maven.apache.org/maven2/org/apache/maven/surefire/surefire/1.5.3/surefire-1.5.3.jar
(50 kB at 659 kB/s)
[INFO] No tests to run.
[JENKINS] Recording test results
[INFO] 
[INFO] --- maven-jar-plugin:2.4:jar (default-jar) @ struts2-api ---
[INFO] Building jar: <https://builds.apache.org/job/Struts-JDK7-pull-request/ws/api/target/struts2-api-2.0.4.jar>
[INFO] 
[INFO] ------------------------------------------------------------------------
[INFO] Building Struts 2 Core 2.0.4
[INFO] ------------------------------------------------------------------------
[INFO] Downloading: http://repository.apache.org/snapshots/org/apache/myfaces/tobago/maven-apt-plugin/maven-metadata.xml
[INFO] Downloading: https://repo.maven.apache.org/maven2/org/apache/myfaces/tobago/maven-apt-plugin/maven-metadata.xml
[INFO] Downloading: http://snapshots.maven.codehaus.org/maven2/org/apache/myfaces/tobago/maven-apt-plugin/maven-metadata.xml
[INFO] Downloaded: https://repo.maven.apache.org/maven2/org/apache/myfaces/tobago/maven-apt-plugin/maven-metadata.xml
(1.4 kB at 60 kB/s)
[INFO] Downloaded: http://repository.apache.org/snapshots/org/apache/myfaces/tobago/maven-apt-plugin/maven-metadata.xml
(1.2 kB at 3.0 kB/s)
[WARNING] Could not transfer metadata org.apache.myfaces.tobago:maven-apt-plugin/maven-metadata.xml
from/to Maven Snapshots (http://snapshots.maven.codehaus.org/maven2/): Connect to snapshots.maven.codehaus.org:80
[snapshots.maven.codehaus.org/52.5.67.234] failed: Connection timed out
[INFO] Downloading: https://repo.maven.apache.org/maven2/org/apache/myfaces/tobago/maven-apt-plugin/1.0.42/maven-apt-plugin-1.0.42.pom
[INFO] Downloaded: https://repo.maven.apache.org/maven2/org/apache/myfaces/tobago/maven-apt-plugin/1.0.42/maven-apt-plugin-1.0.42.pom
(4.2 kB at 235 kB/s)
[INFO] Downloading: https://repo.maven.apache.org/maven2/org/apache/myfaces/tobago/tobago-tool/1.0.42/tobago-tool-1.0.42.pom
[INFO] Downloaded: https://repo.maven.apache.org/maven2/org/apache/myfaces/tobago/tobago-tool/1.0.42/tobago-tool-1.0.42.pom
(1.5 kB at 69 kB/s)
[INFO] Downloading: https://repo.maven.apache.org/maven2/org/apache/myfaces/tobago/tobago/1.0.42/tobago-1.0.42.pom
[INFO] Downloaded: https://repo.maven.apache.org/maven2/org/apache/myfaces/tobago/tobago/1.0.42/tobago-1.0.42.pom
(44 kB at 1.6 MB/s)
[INFO] Downloading: https://repo.maven.apache.org/maven2/org/apache/myfaces/tobago/maven-apt-plugin/1.0.42/maven-apt-plugin-1.0.42.jar
[INFO] Downloaded: https://repo.maven.apache.org/maven2/org/apache/myfaces/tobago/maven-apt-plugin/1.0.42/maven-apt-plugin-1.0.42.jar
(26 kB at 1.2 MB/s)
[WARNING] Failure to transfer org.apache.maven.plugins:maven-idea-plugin/maven-metadata.xml
from http://snapshots.maven.codehaus.org/maven2/ was cached in the local repository, resolution
will not be reattempted until the update interval of Maven Snapshots has elapsed or updates
are forced. Original error: Could not transfer metadata org.apache.maven.plugins:maven-idea-plugin/maven-metadata.xml
from/to Maven Snapshots (http://snapshots.maven.codehaus.org/maven2/): Connect to snapshots.maven.codehaus.org:80
[snapshots.maven.codehaus.org/52.5.67.234] failed: Connection timed out
[INFO] Downloading: http://snapshots.maven.codehaus.org/maven2/org/apache/maven/plugins/maven-dependency-plugin/2.0-alpha-1-SNAPSHOT/maven-metadata.xml
[INFO] Downloading: http://repository.apache.org/snapshots/org/apache/maven/plugins/maven-dependency-plugin/2.0-alpha-1-SNAPSHOT/maven-metadata.xml
[WARNING] Could not transfer metadata org.apache.maven.plugins:maven-dependency-plugin:2.0-alpha-1-SNAPSHOT/maven-metadata.xml
from/to Maven Snapshots (http://snapshots.maven.codehaus.org/maven2/): Connect to snapshots.maven.codehaus.org:80
[snapshots.maven.codehaus.org/52.5.67.234] failed: Connection timed out
[WARNING] Failure to transfer org.apache.maven.plugins:maven-dependency-plugin:2.0-alpha-1-SNAPSHOT/maven-metadata.xml
from http://snapshots.maven.codehaus.org/maven2/ was cached in the local repository, resolution
will not be reattempted until the update interval of Maven Snapshots has elapsed or updates
are forced. Original error: Could not transfer metadata org.apache.maven.plugins:maven-dependency-plugin:2.0-alpha-1-SNAPSHOT/maven-metadata.xml
from/to Maven Snapshots (http://snapshots.maven.codehaus.org/maven2/): Connect to snapshots.maven.codehaus.org:80
[snapshots.maven.codehaus.org/52.5.67.234] failed: Connection timed out
[INFO] Downloading: http://snapshots.maven.codehaus.org/maven2/org/apache/maven/plugins/maven-dependency-plugin/2.0-alpha-1-SNAPSHOT/maven-dependency-plugin-2.0-alpha-1-SNAPSHOT.pom
[INFO] Downloading: http://repository.apache.org/snapshots/org/apache/maven/plugins/maven-dependency-plugin/2.0-alpha-1-SNAPSHOT/maven-dependency-plugin-2.0-alpha-1-SNAPSHOT.pom
[INFO] ------------------------------------------------------------------------
[INFO] Reactor Summary:
[INFO] 
[INFO] Struts 2 ........................................... SUCCESS [04:15 min]
[INFO] Struts 2 API ....................................... SUCCESS [02:11 min]
[INFO] Struts 2 Core ...................................... FAILURE [06:22 min]
[INFO] ------------------------------------------------------------------------
[INFO] BUILD FAILURE
[INFO] ------------------------------------------------------------------------
[INFO] Total time: 12:52 min
[INFO] Finished at: 2017-06-16T08:52:21Z
[INFO] Final Memory: 25M/232M
[INFO] ------------------------------------------------------------------------
Waiting for Jenkins to finish collecting data
[ERROR] Plugin org.apache.maven.plugins:maven-dependency-plugin:2.0-alpha-1-SNAPSHOT or one
of its dependencies could not be resolved: Failed to read artifact descriptor for org.apache.maven.plugins:maven-dependency-plugin:jar:2.0-alpha-1-SNAPSHOT:
Could not transfer artifact org.apache.maven.plugins:maven-dependency-plugin:pom:2.0-alpha-1-SNAPSHOT
from/to Maven Snapshots (http://snapshots.maven.codehaus.org/maven2/): Connect to snapshots.maven.codehaus.org:80
[snapshots.maven.codehaus.org/52.5.67.234] failed: Connection timed out -> [Help 1]
[ERROR] 
[ERROR] To see the full stack trace of the errors, re-run Maven with the -e switch.
[ERROR] Re-run Maven using the -X switch to enable full debug logging.
[ERROR] 
[ERROR] For more information about the errors and possible solutions, please read the following
articles:
[ERROR] [Help 1] http://cwiki.apache.org/confluence/display/MAVEN/PluginResolutionException
[JENKINS] Archiving <https://builds.apache.org/job/Struts-JDK7-pull-request/ws/pom.xml>
to org.apache.struts/struts2-parent/2.0.4/struts2-parent-2.0.4.pom
[JENKINS] Archiving <https://builds.apache.org/job/Struts-JDK7-pull-request/ws/core/pom.xml>
to org.apache.struts/struts2-core/2.0.4/struts2-core-2.0.4.pom
[JENKINS] Archiving <https://builds.apache.org/job/Struts-JDK7-pull-request/ws/api/pom.xml>
to org.apache.struts/struts2-api/2.0.4/struts2-api-2.0.4.pom
[JENKINS] Archiving <https://builds.apache.org/job/Struts-JDK7-pull-request/ws/api/target/struts2-api-2.0.4.jar>
to org.apache.struts/struts2-api/2.0.4/struts2-api-2.0.4.jar
[locks-and-latches] Releasing all the locks
[locks-and-latches] All the locks released
channel stopped

---------------------------------------------------------------------
To unsubscribe, e-mail: dev-unsubscribe@struts.apache.org
For additional commands, e-mail: dev-help@struts.apache.org


Mime
View raw message