struts-dev mailing list archives

Site index · List index
Message view « Date » · « Thread »
Top « Date » · « Thread »
From Apache Jenkins Server <jenk...@builds.apache.org>
Subject Build failed in Jenkins: Struts-JDK7-master #536
Date Thu, 06 Oct 2016 19:06:51 GMT
See <https://builds.apache.org/job/Struts-JDK7-master/536/changes>

Changes:

[Lukasz Lenart] WW-4572 Reverts ParameterAware interface to its previous version and

[Lukasz Lenart] WW-4572 Updates JavaDocs

[Lukasz Lenart] [maven-release-plugin] prepare release STRUTS_2_5_4

------------------------------------------
Started by an SCM change
[EnvInject] - Loading node environment variables.
Building remotely on ubuntu-1 (Ubuntu ubuntu1 yahoo-not-h2 ubuntu docker) in workspace <https://builds.apache.org/job/Struts-JDK7-master/ws/>
Cloning the remote Git repository
Cloning repository http://git.apache.org/struts.git
 > git init <https://builds.apache.org/job/Struts-JDK7-master/ws/> # timeout=10
Fetching upstream changes from http://git.apache.org/struts.git
 > git --version # timeout=10
 > git -c core.askpass=true fetch --tags --progress http://git.apache.org/struts.git +refs/heads/*:refs/remotes/origin/*
 > git config remote.origin.url http://git.apache.org/struts.git # timeout=10
 > git config --add remote.origin.fetch +refs/heads/*:refs/remotes/origin/* # timeout=10
 > git config remote.origin.url http://git.apache.org/struts.git # timeout=10
Cleaning workspace
 > git rev-parse --verify HEAD # timeout=10
No valid HEAD. Skipping the resetting
 > git clean -fdx # timeout=10
Fetching upstream changes from http://git.apache.org/struts.git
 > git -c core.askpass=true fetch --tags --progress http://git.apache.org/struts.git +refs/heads/*:refs/remotes/origin/*
 > git rev-parse refs/remotes/origin/master^{commit} # timeout=10
 > git rev-parse refs/remotes/origin/refs/heads/master^{commit} # timeout=10
Checking out Revision 12cc861875665e19c9d72a131f606a9b855b5c80 (refs/remotes/origin/master)
 > git config core.sparsecheckout # timeout=10
 > git checkout -f 12cc861875665e19c9d72a131f606a9b855b5c80
 > git rev-list 67541e07a7523114a819eff0321a0dc91179c3ea # timeout=10
[locks-and-latches] Checking to see if we really have the locks
[locks-and-latches] Have all the locks, build can start
Parsing POMs
Modules changed, recalculating dependency graph
Established TCP socket on 41779
maven32-agent.jar already up to date
maven32-interceptor.jar already up to date
maven3-interceptor-commons.jar already up to date
[Struts-JDK7-master] $ /home/jenkins/tools/java/latest1.7/bin/java -Xms128m -Xmx768m -XX:MaxPermSize=256m
-XX:PermSize=128m -cp /home/jenkins/jenkins-slave/maven32-agent.jar:/home/jenkins/tools/maven/latest3/boot/plexus-classworlds-2.5.2.jar:/home/jenkins/tools/maven/latest3/conf/logging
jenkins.maven3.agent.Maven32Main /home/jenkins/tools/maven/latest3/ /home/jenkins/jenkins-slave/slave.jar
/home/jenkins/jenkins-slave/maven32-interceptor.jar /home/jenkins/jenkins-slave/maven3-interceptor-commons.jar
41779
<===[JENKINS REMOTING CAPACITY]===>   channel started
Executing Maven:  -B -f <https://builds.apache.org/job/Struts-JDK7-master/ws/pom.xml>
-Dmaven.repo.local=/home/jenkins/jenkins-slave/maven-repositories/0 clean source:jar javadoc:jar
install deploy -DskipWiki
[INFO] Scanning for projects...
[INFO] ------------------------------------------------------------------------
[INFO] Reactor Build Order:
[INFO] 
[INFO] Struts 2 Bill of Materials
[INFO] Struts 2
[INFO] Struts 2 Core
[INFO] Struts Plugins
[INFO] Struts 2 Configuration Browser Plugin
[INFO] Struts 2 Sitemesh Plugin
[INFO] Struts 2 Tiles Plugin
[INFO] Struts 2 DWR Plugin
[INFO] Struts 2 Spring Plugin
[INFO] Struts 2 Convention Plugin
[INFO] Struts 2 JUnit Plugin
[INFO] Struts 2 JSON Plugin
[INFO] Struts 2 Bean Validation Plugin
[INFO] Struts 2 Webapps
[INFO] Struts 2 Showcase Webapp
[INFO] Struts 2 REST Plugin
[INFO] Struts 2 Rest Showcase Webapp
[INFO] Struts 2 CDI Plugin
[INFO] Struts 2 Embedded JSP Plugin
[INFO] Struts 2 GXP Plugin
[INFO] Struts 2 Jasper Reports Plugin
[INFO] Struts 2 Java Templates Plugin
[INFO] Struts 2 JFreeChart Plugin
[INFO] Struts 2 OSGi Plugin
[INFO] Struts 2 OVal Plugin
[INFO] Struts 2 Pell Multipart Plugin
[INFO] Struts 2 Plexus Plugin
[INFO] Struts 2 Portlet Plugin
[INFO] Struts 2 Portlet Tiles Plugin
[INFO] Struts 2 Sitegraph Plugin
[INFO] Struts 2 TestNG Plugin
[INFO] Struts OSGi Bundles
[INFO] Struts 2 OSGi Admin Bundle
[INFO] Struts 2 OSGi Demo Bundle
[INFO] Struts 2 Assembly
[INFO] Downloading: https://repo.maven.apache.org/maven2/org/apache/maven/plugins/maven-release-plugin/2.2.1/maven-release-plugin-2.2.1.pom
[INFO] Downloaded: https://repo.maven.apache.org/maven2/org/apache/maven/plugins/maven-release-plugin/2.2.1/maven-release-plugin-2.2.1.pom
(9 KB at 16.2 KB/sec)
[INFO] Downloading: https://repo.maven.apache.org/maven2/org/apache/maven/release/maven-release/2.2.1/maven-release-2.2.1.pom
[INFO] Downloaded: https://repo.maven.apache.org/maven2/org/apache/maven/release/maven-release/2.2.1/maven-release-2.2.1.pom
(9 KB at 250.3 KB/sec)
[INFO] Downloading: https://repo.maven.apache.org/maven2/org/apache/maven/plugins/maven-release-plugin/2.2.1/maven-release-plugin-2.2.1.jar
[INFO] Downloaded: https://repo.maven.apache.org/maven2/org/apache/maven/plugins/maven-release-plugin/2.2.1/maven-release-plugin-2.2.1.jar
(43 KB at 370.7 KB/sec)
[INFO] Downloading: https://repo.maven.apache.org/maven2/org/apache/maven/plugins/maven-scm-plugin/1.4/maven-scm-plugin-1.4.pom
[INFO] Downloaded: https://repo.maven.apache.org/maven2/org/apache/maven/plugins/maven-scm-plugin/1.4/maven-scm-plugin-1.4.pom
(6 KB at 108.6 KB/sec)
[INFO] Downloading: https://repo.maven.apache.org/maven2/org/apache/maven/plugins/maven-scm-plugin/1.4/maven-scm-plugin-1.4.jar
[INFO] Downloaded: https://repo.maven.apache.org/maven2/org/apache/maven/plugins/maven-scm-plugin/1.4/maven-scm-plugin-1.4.jar
(54 KB at 1771.8 KB/sec)
[INFO]                                                                         
[INFO] ------------------------------------------------------------------------
[INFO] Building Struts 2 Bill of Materials 2.5.4
[INFO] ------------------------------------------------------------------------
[INFO] 
[INFO] --- maven-clean-plugin:2.4.1:clean (default-clean) @ struts2-bom ---
[INFO] 
[INFO] >>> maven-source-plugin:2.1.2:jar (default-cli) > generate-sources @ struts2-bom
>>>
[WARNING] Failed to getClass for org.apache.maven.plugin.source.SourceJarMojo
[INFO] 
[INFO] <<< maven-source-plugin:2.1.2:jar (default-cli) < generate-sources @ struts2-bom
<<<
[INFO] 
[INFO] --- maven-source-plugin:2.1.2:jar (default-cli) @ struts2-bom ---
[INFO] 
[INFO] --- maven-javadoc-plugin:2.8:jar (default-cli) @ struts2-bom ---
[INFO] Not executing Javadoc as the project is not a Java classpath-capable package
[INFO] 
[INFO] --- maven-remote-resources-plugin:1.2.1:process (default) @ struts2-bom ---
[INFO] 
[INFO] --- maven-site-plugin:3.0:attach-descriptor (attach-descriptor) @ struts2-bom ---
[INFO] 
[INFO] --- maven-install-plugin:2.3.1:install (default-install) @ struts2-bom ---
[INFO] Installing <https://builds.apache.org/job/Struts-JDK7-master/ws/bom/pom.xml>
to /home/jenkins/jenkins-slave/maven-repositories/0/org/apache/struts/struts2-bom/2.5.4/struts2-bom-2.5.4.pom
[INFO] 
[INFO] --- maven-remote-resources-plugin:1.2.1:process (default) @ struts2-bom ---
[INFO] 
[INFO] --- maven-site-plugin:3.0:attach-descriptor (attach-descriptor) @ struts2-bom ---
[INFO] 
[INFO] --- maven-install-plugin:2.3.1:install (default-install) @ struts2-bom ---
[INFO] Installing <https://builds.apache.org/job/Struts-JDK7-master/ws/bom/pom.xml>
to /home/jenkins/jenkins-slave/maven-repositories/0/org/apache/struts/struts2-bom/2.5.4/struts2-bom-2.5.4.pom
[INFO] 
[INFO] --- maven-deploy-plugin:2.6:deploy (default-deploy) @ struts2-bom ---
[INFO] Uploading: https://repository.apache.org/service/local/staging/deploy/maven2/org/apache/struts/struts2-bom/2.5.4/struts2-bom-2.5.4.pom
[INFO] ------------------------------------------------------------------------
[INFO] Reactor Summary:
[INFO] 
[INFO] Struts 2 Bill of Materials ......................... FAILURE [  6.388 s]
[INFO] Struts 2 ........................................... SKIPPED
[INFO] Struts 2 Core ...................................... SKIPPED
[INFO] Struts Plugins ..................................... SKIPPED
[INFO] Struts 2 Configuration Browser Plugin .............. SKIPPED
[INFO] Struts 2 Sitemesh Plugin ........................... SKIPPED
[INFO] Struts 2 Tiles Plugin .............................. SKIPPED
[INFO] Struts 2 DWR Plugin ................................ SKIPPED
[INFO] Struts 2 Spring Plugin ............................. SKIPPED
[INFO] Struts 2 Convention Plugin ......................... SKIPPED
[INFO] Struts 2 JUnit Plugin .............................. SKIPPED
[INFO] Struts 2 JSON Plugin ............................... SKIPPED
[INFO] Struts 2 Bean Validation Plugin .................... SKIPPED
[INFO] Struts 2 Webapps ................................... SKIPPED
[INFO] Struts 2 Showcase Webapp ........................... SKIPPED
[INFO] Struts 2 REST Plugin ............................... SKIPPED
[INFO] Struts 2 Rest Showcase Webapp ...................... SKIPPED
[INFO] Struts 2 CDI Plugin ................................ SKIPPED
[INFO] Struts 2 Embedded JSP Plugin ....................... SKIPPED
[INFO] Struts 2 GXP Plugin ................................ SKIPPED
[INFO] Struts 2 Jasper Reports Plugin ..................... SKIPPED
[INFO] Struts 2 Java Templates Plugin ..................... SKIPPED
[INFO] Struts 2 JFreeChart Plugin ......................... SKIPPED
[INFO] Struts 2 OSGi Plugin ............................... SKIPPED
[INFO] Struts 2 OVal Plugin ............................... SKIPPED
[INFO] Struts 2 Pell Multipart Plugin ..................... SKIPPED
[INFO] Struts 2 Plexus Plugin ............................. SKIPPED
[INFO] Struts 2 Portlet Plugin ............................ SKIPPED
[INFO] Struts 2 Portlet Tiles Plugin ...................... SKIPPED
[INFO] Struts 2 Sitegraph Plugin .......................... SKIPPED
[INFO] Struts 2 TestNG Plugin ............................. SKIPPED
[INFO] Struts OSGi Bundles ................................ SKIPPED
[INFO] Struts 2 OSGi Admin Bundle ......................... SKIPPED
[INFO] Struts 2 OSGi Demo Bundle .......................... SKIPPED
[INFO] Struts 2 Assembly .................................. SKIPPED
[INFO] ------------------------------------------------------------------------
[INFO] BUILD FAILURE
[INFO] ------------------------------------------------------------------------
[INFO] Total time: 17.747 s
[INFO] Finished at: 2016-10-06T19:05:12+00:00
[INFO] Final Memory: 43M/308M
[INFO] ------------------------------------------------------------------------
[ERROR] Failed to execute goal org.apache.maven.plugins:maven-deploy-plugin:2.6:deploy (default-deploy)
on project struts2-bom: Failed to deploy artifacts: Could not transfer artifact org.apache.struts:struts2-bom:pom:2.5.4
from/to apache.releases.https (https://repository.apache.org/service/local/staging/deploy/maven2):
Failed to transfer file: https://repository.apache.org/service/local/staging/deploy/maven2/org/apache/struts/struts2-bom/2.5.4/struts2-bom-2.5.4.pom.
Return code is: 401, ReasonPhrase: Unauthorized. -> [Help 1]
[ERROR] 
[ERROR] To see the full stack trace of the errors, re-run Maven with the -e switch.
[ERROR] Re-run Maven using the -X switch to enable full debug logging.
[ERROR] 
[ERROR] For more information about the errors and possible solutions, please read the following
articles:
[ERROR] [Help 1] http://cwiki.apache.org/confluence/display/MAVEN/MojoExecutionException
[JENKINS] Archiving <https://builds.apache.org/job/Struts-JDK7-master/ws/plugins/portlet/pom.xml>
to org.apache.struts/struts2-portlet-plugin/2.5.4/struts2-portlet-plugin-2.5.4.pom
[JENKINS] Archiving <https://builds.apache.org/job/Struts-JDK7-master/ws/plugins/portlet-tiles/pom.xml>
to org.apache.struts/struts2-portlet-tiles-plugin/2.5.4/struts2-portlet-tiles-plugin-2.5.4.pom
[JENKINS] Archiving <https://builds.apache.org/job/Struts-JDK7-master/ws/core/pom.xml>
to org.apache.struts/struts2-core/2.5.4/struts2-core-2.5.4.pom
[JENKINS] Archiving <https://builds.apache.org/job/Struts-JDK7-master/ws/plugins/osgi/pom.xml>
to org.apache.struts/struts2-osgi-plugin/2.5.4/struts2-osgi-plugin-2.5.4.pom
[JENKINS] Archiving <https://builds.apache.org/job/Struts-JDK7-master/ws/plugins/dwr/pom.xml>
to org.apache.struts/struts2-dwr-plugin/2.5.4/struts2-dwr-plugin-2.5.4.pom
[JENKINS] Archiving <https://builds.apache.org/job/Struts-JDK7-master/ws/apps/rest-showcase/pom.xml>
to org.apache.struts/struts2-rest-showcase/2.5.4/struts2-rest-showcase-2.5.4.pom
[JENKINS] Archiving <https://builds.apache.org/job/Struts-JDK7-master/ws/plugins/gxp/pom.xml>
to org.apache.struts/struts2-gxp-plugin/2.5.4/struts2-gxp-plugin-2.5.4.pom
[JENKINS] Archiving <https://builds.apache.org/job/Struts-JDK7-master/ws/plugins/javatemplates/pom.xml>
to org.apache.struts/struts2-javatemplates-plugin/2.5.4/struts2-javatemplates-plugin-2.5.4.pom
[JENKINS] Archiving <https://builds.apache.org/job/Struts-JDK7-master/ws/plugins/testng/pom.xml>
to org.apache.struts/struts2-testng-plugin/2.5.4/struts2-testng-plugin-2.5.4.pom
[JENKINS] Archiving <https://builds.apache.org/job/Struts-JDK7-master/ws/assembly/pom.xml>
to org.apache.struts/struts2-assembly/2.5.4/struts2-assembly-2.5.4.pom
[JENKINS] Archiving <https://builds.apache.org/job/Struts-JDK7-master/ws/apps/pom.xml>
to org.apache.struts/struts2-apps/2.5.4/struts2-apps-2.5.4.pom
[JENKINS] Archiving <https://builds.apache.org/job/Struts-JDK7-master/ws/bom/pom.xml>
to org.apache.struts/struts2-bom/2.5.4/struts2-bom-2.5.4.pom
[JENKINS] Archiving <https://builds.apache.org/job/Struts-JDK7-master/ws/plugins/oval/pom.xml>
to org.apache.struts/struts2-oval-plugin/2.5.4/struts2-oval-plugin-2.5.4.pom
[JENKINS] Archiving <https://builds.apache.org/job/Struts-JDK7-master/ws/plugins/convention/pom.xml>
to org.apache.struts/struts2-convention-plugin/2.5.4/struts2-convention-plugin-2.5.4.pom
[JENKINS] Archiving <https://builds.apache.org/job/Struts-JDK7-master/ws/pom.xml> to
org.apache.struts/struts2-parent/2.5.4/struts2-parent-2.5.4.pom
[JENKINS] Archiving <https://builds.apache.org/job/Struts-JDK7-master/ws/apps/showcase/pom.xml>
to org.apache.struts/struts2-showcase/2.5.4/struts2-showcase-2.5.4.pom
[JENKINS] Archiving <https://builds.apache.org/job/Struts-JDK7-master/ws/plugins/jasperreports/pom.xml>
to org.apache.struts/struts2-jasperreports-plugin/2.5.4/struts2-jasperreports-plugin-2.5.4.pom
[JENKINS] Archiving <https://builds.apache.org/job/Struts-JDK7-master/ws/plugins/rest/pom.xml>
to org.apache.struts/struts2-rest-plugin/2.5.4/struts2-rest-plugin-2.5.4.pom
[JENKINS] Archiving <https://builds.apache.org/job/Struts-JDK7-master/ws/bundles/pom.xml>
to org.apache.struts/struts2-osgi-bundles/2.5.4/struts2-osgi-bundles-2.5.4.pom
[JENKINS] Archiving <https://builds.apache.org/job/Struts-JDK7-master/ws/plugins/config-browser/pom.xml>
to org.apache.struts/struts2-config-browser-plugin/2.5.4/struts2-config-browser-plugin-2.5.4.pom
[JENKINS] Archiving <https://builds.apache.org/job/Struts-JDK7-master/ws/plugins/pell-multipart/pom.xml>
to org.apache.struts/struts2-pell-multipart-plugin/2.5.4/struts2-pell-multipart-plugin-2.5.4.pom
[JENKINS] Archiving <https://builds.apache.org/job/Struts-JDK7-master/ws/bundles/admin/pom.xml>
to org.apache.struts/struts2-osgi-admin-bundle/2.5.4/struts2-osgi-admin-bundle-2.5.4.pom
[JENKINS] Archiving <https://builds.apache.org/job/Struts-JDK7-master/ws/plugins/sitemesh/pom.xml>
to org.apache.struts/struts2-sitemesh-plugin/2.5.4/struts2-sitemesh-plugin-2.5.4.pom
[JENKINS] Archiving <https://builds.apache.org/job/Struts-JDK7-master/ws/plugins/pom.xml>
to org.apache.struts/struts2-plugins/2.5.4/struts2-plugins-2.5.4.pom
[JENKINS] Archiving <https://builds.apache.org/job/Struts-JDK7-master/ws/plugins/bean-validation/pom.xml>
to org.apache.struts/struts2-bean-validation-plugin/2.5.4/struts2-bean-validation-plugin-2.5.4.pom
[JENKINS] Archiving <https://builds.apache.org/job/Struts-JDK7-master/ws/plugins/plexus/pom.xml>
to org.apache.struts/struts2-plexus-plugin/2.5.4/struts2-plexus-plugin-2.5.4.pom
[JENKINS] Archiving <https://builds.apache.org/job/Struts-JDK7-master/ws/plugins/sitegraph/pom.xml>
to org.apache.struts/struts2-sitegraph-plugin/2.5.4/struts2-sitegraph-plugin-2.5.4.pom
[JENKINS] Archiving <https://builds.apache.org/job/Struts-JDK7-master/ws/plugins/cdi/pom.xml>
to org.apache.struts/struts2-cdi-plugin/2.5.4/struts2-cdi-plugin-2.5.4.pom
[JENKINS] Archiving <https://builds.apache.org/job/Struts-JDK7-master/ws/plugins/json/pom.xml>
to org.apache.struts/struts2-json-plugin/2.5.4/struts2-json-plugin-2.5.4.pom
[JENKINS] Archiving <https://builds.apache.org/job/Struts-JDK7-master/ws/plugins/tiles/pom.xml>
to org.apache.struts/struts2-tiles-plugin/2.5.4/struts2-tiles-plugin-2.5.4.pom
[JENKINS] Archiving <https://builds.apache.org/job/Struts-JDK7-master/ws/plugins/spring/pom.xml>
to org.apache.struts/struts2-spring-plugin/2.5.4/struts2-spring-plugin-2.5.4.pom
[JENKINS] Archiving <https://builds.apache.org/job/Struts-JDK7-master/ws/plugins/jfreechart/pom.xml>
to org.apache.struts/struts2-jfreechart-plugin/2.5.4/struts2-jfreechart-plugin-2.5.4.pom
[JENKINS] Archiving <https://builds.apache.org/job/Struts-JDK7-master/ws/bundles/demo/pom.xml>
to org.apache.struts/struts2-osgi-demo-bundle/2.5.4/struts2-osgi-demo-bundle-2.5.4.pom
[JENKINS] Archiving <https://builds.apache.org/job/Struts-JDK7-master/ws/plugins/embeddedjsp/pom.xml>
to org.apache.struts/struts2-embeddedjsp-plugin/2.5.4/struts2-embeddedjsp-plugin-2.5.4.pom
[JENKINS] Archiving <https://builds.apache.org/job/Struts-JDK7-master/ws/plugins/junit/pom.xml>
to org.apache.struts/struts2-junit-plugin/2.5.4/struts2-junit-plugin-2.5.4.pom
[locks-and-latches] Releasing all the locks
[locks-and-latches] All the locks released
channel stopped
Updating WW-4572

---------------------------------------------------------------------
To unsubscribe, e-mail: dev-unsubscribe@struts.apache.org
For additional commands, e-mail: dev-help@struts.apache.org


Mime
View raw message