struts-dev mailing list archives

Site index · List index
Message view « Date » · « Thread »
Top « Date » · « Thread »
From Apache Jenkins Server <jenk...@builds.apache.org>
Subject Build failed in Jenkins: Struts-JDK7-master #499
Date Wed, 27 Jul 2016 07:12:04 GMT
See <https://builds.apache.org/job/Struts-JDK7-master/499/>

------------------------------------------
[...truncated 3140 lines...]
[INFO] Downloaded: https://repo.maven.apache.org/maven2/xerces/xercesImpl/2.9.1/xercesImpl-2.9.1.pom
(2 KB at 41.6 KB/sec)
[INFO] Downloading: https://repo.maven.apache.org/maven2/xml-apis/xml-apis/1.3.04/xml-apis-1.3.04.pom
[INFO] Downloaded: https://repo.maven.apache.org/maven2/xml-apis/xml-apis/1.3.04/xml-apis-1.3.04.pom
(2 KB at 55.6 KB/sec)
[INFO] Downloading: https://repo.maven.apache.org/maven2/org/apache/httpcomponents/httpclient/4.0.2/httpclient-4.0.2.pom
[INFO] Downloaded: https://repo.maven.apache.org/maven2/org/apache/httpcomponents/httpclient/4.0.2/httpclient-4.0.2.pom
(8 KB at 221.8 KB/sec)
[INFO] Downloading: https://repo.maven.apache.org/maven2/org/apache/httpcomponents/httpcomponents-client/4.0.2/httpcomponents-client-4.0.2.pom
[INFO] Downloaded: https://repo.maven.apache.org/maven2/org/apache/httpcomponents/httpcomponents-client/4.0.2/httpcomponents-client-4.0.2.pom
(9 KB at 273.6 KB/sec)
[INFO] Downloading: https://repo.maven.apache.org/maven2/org/apache/httpcomponents/project/4.1/project-4.1.pom
[INFO] Downloaded: https://repo.maven.apache.org/maven2/org/apache/httpcomponents/project/4.1/project-4.1.pom
(16 KB at 484.8 KB/sec)
[INFO] Downloading: https://repo.maven.apache.org/maven2/org/apache/httpcomponents/httpcore/4.0.1/httpcore-4.0.1.pom
[INFO] Downloaded: https://repo.maven.apache.org/maven2/org/apache/httpcomponents/httpcore/4.0.1/httpcore-4.0.1.pom
(5 KB at 149.2 KB/sec)
[INFO] Downloading: https://repo.maven.apache.org/maven2/org/apache/httpcomponents/httpcomponents-core/4.0.1/httpcomponents-core-4.0.1.pom
[INFO] Downloaded: https://repo.maven.apache.org/maven2/org/apache/httpcomponents/httpcomponents-core/4.0.1/httpcomponents-core-4.0.1.pom
(10 KB at 276.8 KB/sec)
[INFO] Downloading: https://repo.maven.apache.org/maven2/org/apache/httpcomponents/project/4.0/project-4.0.pom
[INFO] Downloaded: https://repo.maven.apache.org/maven2/org/apache/httpcomponents/project/4.0/project-4.0.pom
(13 KB at 400.2 KB/sec)
[INFO] Downloading: https://repo.maven.apache.org/maven2/commons-codec/commons-codec/1.3/commons-codec-1.3.pom
[INFO] Downloaded: https://repo.maven.apache.org/maven2/commons-codec/commons-codec/1.3/commons-codec-1.3.pom
(6 KB at 186.3 KB/sec)
[INFO] Downloading: https://repo.maven.apache.org/maven2/org/apache/maven/doxia/doxia-module-xhtml/1.2/doxia-module-xhtml-1.2.pom
[INFO] Downloaded: https://repo.maven.apache.org/maven2/org/apache/maven/doxia/doxia-module-xhtml/1.2/doxia-module-xhtml-1.2.pom
(2 KB at 52.1 KB/sec)
[INFO] Downloading: https://repo.maven.apache.org/maven2/org/apache/maven/doxia/doxia-modules/1.2/doxia-modules-1.2.pom
[INFO] Downloaded: https://repo.maven.apache.org/maven2/org/apache/maven/doxia/doxia-modules/1.2/doxia-modules-1.2.pom
(3 KB at 76.3 KB/sec)
[INFO] Downloading: https://repo.maven.apache.org/maven2/org/apache/maven/doxia/doxia-module-apt/1.2/doxia-module-apt-1.2.pom
[INFO] Downloaded: https://repo.maven.apache.org/maven2/org/apache/maven/doxia/doxia-module-apt/1.2/doxia-module-apt-1.2.pom
(3 KB at 76.3 KB/sec)
[INFO] Downloading: https://repo.maven.apache.org/maven2/org/apache/maven/doxia/doxia-module-xdoc/1.2/doxia-module-xdoc-1.2.pom
[INFO] Downloaded: https://repo.maven.apache.org/maven2/org/apache/maven/doxia/doxia-module-xdoc/1.2/doxia-module-xdoc-1.2.pom
(6 KB at 160.5 KB/sec)
[INFO] Downloading: https://repo.maven.apache.org/maven2/org/apache/maven/doxia/doxia-module-fml/1.2/doxia-module-fml-1.2.pom
[INFO] Downloaded: https://repo.maven.apache.org/maven2/org/apache/maven/doxia/doxia-module-fml/1.2/doxia-module-fml-1.2.pom
(6 KB at 166.5 KB/sec)
[INFO] Downloading: https://repo.maven.apache.org/maven2/javax/servlet/servlet-api/2.5/servlet-api-2.5.pom
[INFO] Downloaded: https://repo.maven.apache.org/maven2/javax/servlet/servlet-api/2.5/servlet-api-2.5.pom
(157 B at 4.6 KB/sec)
[INFO] Downloading: https://repo.maven.apache.org/maven2/org/apache/maven/doxia/doxia-decoration-model/1.2/doxia-decoration-model-1.2.pom
[INFO] Downloaded: https://repo.maven.apache.org/maven2/org/apache/maven/doxia/doxia-decoration-model/1.2/doxia-decoration-model-1.2.pom
(3 KB at 96.3 KB/sec)
[INFO] Downloading: https://repo.maven.apache.org/maven2/org/apache/maven/doxia/doxia-sitetools/1.2/doxia-sitetools-1.2.pom
[INFO] Downloaded: https://repo.maven.apache.org/maven2/org/apache/maven/doxia/doxia-sitetools/1.2/doxia-sitetools-1.2.pom
(16 KB at 475.4 KB/sec)
[INFO] Downloading: https://repo.maven.apache.org/maven2/org/apache/maven/doxia/doxia-site-renderer/1.2/doxia-site-renderer-1.2.pom
[INFO] Downloaded: https://repo.maven.apache.org/maven2/org/apache/maven/doxia/doxia-site-renderer/1.2/doxia-site-renderer-1.2.pom
(7 KB at 184.6 KB/sec)
[INFO] Downloading: https://repo.maven.apache.org/maven2/org/apache/maven/shared/maven-doxia-tools/1.4/maven-doxia-tools-1.4.pom
[INFO] Downloaded: https://repo.maven.apache.org/maven2/org/apache/maven/shared/maven-doxia-tools/1.4/maven-doxia-tools-1.4.pom
(8 KB at 220.2 KB/sec)
[INFO] Downloading: https://repo.maven.apache.org/maven2/commons-io/commons-io/1.4/commons-io-1.4.pom
[INFO] Downloaded: https://repo.maven.apache.org/maven2/commons-io/commons-io/1.4/commons-io-1.4.pom
(13 KB at 378.2 KB/sec)
[INFO] Downloading: https://repo.maven.apache.org/maven2/org/apache/commons/commons-parent/7/commons-parent-7.pom
[INFO] Downloaded: https://repo.maven.apache.org/maven2/org/apache/commons/commons-parent/7/commons-parent-7.pom
(18 KB at 502.5 KB/sec)
[INFO] Downloading: https://repo.maven.apache.org/maven2/org/apache/maven/maven-artifact/2.2.1/maven-artifact-2.2.1.pom
[INFO] Downloaded: https://repo.maven.apache.org/maven2/org/apache/maven/maven-artifact/2.2.1/maven-artifact-2.2.1.pom
(2 KB at 48.2 KB/sec)
[INFO] Downloading: https://repo.maven.apache.org/maven2/org/apache/maven/maven/2.2.1/maven-2.2.1.pom
[INFO] Downloaded: https://repo.maven.apache.org/maven2/org/apache/maven/maven/2.2.1/maven-2.2.1.pom
(22 KB at 663.1 KB/sec)
[INFO] Downloading: https://repo.maven.apache.org/maven2/org/apache/maven/maven-model/2.2.1/maven-model-2.2.1.pom
[INFO] Downloaded: https://repo.maven.apache.org/maven2/org/apache/maven/maven-model/2.2.1/maven-model-2.2.1.pom
(4 KB at 93.1 KB/sec)
[INFO] Downloading: https://repo.maven.apache.org/maven2/org/apache/maven/maven-plugin-api/2.2.1/maven-plugin-api-2.2.1.pom
[INFO] Downloaded: https://repo.maven.apache.org/maven2/org/apache/maven/maven-plugin-api/2.2.1/maven-plugin-api-2.2.1.pom
(2 KB at 43.2 KB/sec)
[INFO] Downloading: https://repo.maven.apache.org/maven2/org/codehaus/plexus/plexus-utils/1.5.10/plexus-utils-1.5.10.pom
[INFO] Downloaded: https://repo.maven.apache.org/maven2/org/codehaus/plexus/plexus-utils/1.5.10/plexus-utils-1.5.10.pom
(6 KB at 166.7 KB/sec)
[INFO] Downloading: https://repo.maven.apache.org/maven2/org/mortbay/jetty/jetty/6.1.25/jetty-6.1.25.pom
[INFO] Downloaded: https://repo.maven.apache.org/maven2/org/mortbay/jetty/jetty/6.1.25/jetty-6.1.25.pom
(7 KB at 185.2 KB/sec)
[INFO] Downloading: https://repo.maven.apache.org/maven2/org/mortbay/jetty/project/6.1.25/project-6.1.25.pom
[INFO] Downloaded: https://repo.maven.apache.org/maven2/org/mortbay/jetty/project/6.1.25/project-6.1.25.pom
(9 KB at 272.4 KB/sec)
[INFO] Downloading: https://repo.maven.apache.org/maven2/org/mortbay/jetty/jetty-parent/10/jetty-parent-10.pom
[INFO] Downloaded: https://repo.maven.apache.org/maven2/org/mortbay/jetty/jetty-parent/10/jetty-parent-10.pom
(4 KB at 100.4 KB/sec)
[INFO] Downloading: https://repo.maven.apache.org/maven2/org/eclipse/jetty/jetty-parent/14/jetty-parent-14.pom
[INFO] Downloaded: https://repo.maven.apache.org/maven2/org/eclipse/jetty/jetty-parent/14/jetty-parent-14.pom
(17 KB at 473.5 KB/sec)
[INFO] Downloading: https://repo.maven.apache.org/maven2/org/mortbay/jetty/jetty-util/6.1.25/jetty-util-6.1.25.pom
[INFO] Downloaded: https://repo.maven.apache.org/maven2/org/mortbay/jetty/jetty-util/6.1.25/jetty-util-6.1.25.pom
(4 KB at 114.7 KB/sec)
[INFO] Downloading: https://repo.maven.apache.org/maven2/org/mortbay/jetty/servlet-api/2.5-20081211/servlet-api-2.5-20081211.pom
[INFO] Downloaded: https://repo.maven.apache.org/maven2/org/mortbay/jetty/servlet-api/2.5-20081211/servlet-api-2.5-20081211.pom
(3 KB at 79.2 KB/sec)
[INFO] Downloading: https://repo.maven.apache.org/maven2/org/mortbay/jetty/jetty-parent/7/jetty-parent-7.pom
[INFO] Downloaded: https://repo.maven.apache.org/maven2/org/mortbay/jetty/jetty-parent/7/jetty-parent-7.pom
(13 KB at 382.3 KB/sec)
[INFO] Downloading: https://repo.maven.apache.org/maven2/commons-lang/commons-lang/2.5/commons-lang-2.5.pom
[INFO] Downloaded: https://repo.maven.apache.org/maven2/commons-lang/commons-lang/2.5/commons-lang-2.5.pom
(17 KB at 492.0 KB/sec)
[INFO] Downloading: https://repo.maven.apache.org/maven2/org/apache/commons/commons-parent/12/commons-parent-12.pom
[INFO] Downloaded: https://repo.maven.apache.org/maven2/org/apache/commons/commons-parent/12/commons-parent-12.pom
(27 KB at 773.2 KB/sec)
[INFO] Downloading: https://repo.maven.apache.org/maven2/org/apache/maven/wagon/wagon-ssh/1.0/wagon-ssh-1.0.jar
[INFO] Downloading: https://repo.maven.apache.org/maven2/com/jcraft/jsch/0.1.44-1/jsch-0.1.44-1.jar
[INFO] Downloading: https://repo.maven.apache.org/maven2/org/codehaus/plexus/plexus-interactivity-api/1.0-alpha-6/plexus-interactivity-api-1.0-alpha-6.jar
[INFO] Downloading: https://repo.maven.apache.org/maven2/org/apache/maven/wagon/wagon-ssh-common/1.0/wagon-ssh-common-1.0.jar
[INFO] Downloading: https://repo.maven.apache.org/maven2/org/apache/maven/reporting/maven-reporting-exec/1.0.1/maven-reporting-exec-1.0.1.jar
[INFO] Downloaded: https://repo.maven.apache.org/maven2/org/codehaus/plexus/plexus-interactivity-api/1.0-alpha-6/plexus-interactivity-api-1.0-alpha-6.jar
(12 KB at 311.2 KB/sec)
[INFO] Downloaded: https://repo.maven.apache.org/maven2/org/apache/maven/wagon/wagon-ssh/1.0/wagon-ssh-1.0.jar
(28 KB at 727.6 KB/sec)
[INFO] Downloaded: https://repo.maven.apache.org/maven2/org/apache/maven/wagon/wagon-ssh-common/1.0/wagon-ssh-common-1.0.jar
(26 KB at 665.6 KB/sec)
[INFO] Downloading: https://repo.maven.apache.org/maven2/org/sonatype/aether/aether-util/1.7/aether-util-1.7.jar
[INFO] Downloading: https://repo.maven.apache.org/maven2/org/sonatype/sisu/sisu-guice/2.1.7/sisu-guice-2.1.7-noaop.jar
[INFO] Downloading: https://repo.maven.apache.org/maven2/org/sonatype/sisu/sisu-inject-bean/1.4.2/sisu-inject-bean-1.4.2.jar
[INFO] Downloaded: https://repo.maven.apache.org/maven2/org/apache/maven/reporting/maven-reporting-exec/1.0.1/maven-reporting-exec-1.0.1.jar
(22 KB at 553.9 KB/sec)
[INFO] Downloading: https://repo.maven.apache.org/maven2/org/codehaus/plexus/plexus-interpolation/1.14/plexus-interpolation-1.14.jar
[INFO] Downloaded: https://repo.maven.apache.org/maven2/com/jcraft/jsch/0.1.44-1/jsch-0.1.44-1.jar
(209 KB at 4744.8 KB/sec)
[INFO] Downloading: https://repo.maven.apache.org/maven2/org/codehaus/plexus/plexus-component-annotations/1.5.5/plexus-component-annotations-1.5.5.jar
[INFO] Downloaded: https://repo.maven.apache.org/maven2/org/codehaus/plexus/plexus-interpolation/1.14/plexus-interpolation-1.14.jar
(60 KB at 795.2 KB/sec)
[INFO] Downloaded: https://repo.maven.apache.org/maven2/org/codehaus/plexus/plexus-component-annotations/1.5.5/plexus-component-annotations-1.5.5.jar
(5 KB at 54.8 KB/sec)
[INFO] Downloading: https://repo.maven.apache.org/maven2/org/sonatype/plexus/plexus-sec-dispatcher/1.3/plexus-sec-dispatcher-1.3.jar
[INFO] Downloading: https://repo.maven.apache.org/maven2/org/sonatype/plexus/plexus-cipher/1.4/plexus-cipher-1.4.jar
[INFO] Downloaded: https://repo.maven.apache.org/maven2/org/sonatype/sisu/sisu-inject-bean/1.4.2/sisu-inject-bean-1.4.2.jar
(150 KB at 1940.3 KB/sec)
[INFO] Downloading: https://repo.maven.apache.org/maven2/org/apache/maven/doxia/doxia-sink-api/1.2/doxia-sink-api-1.2.jar
[INFO] Downloaded: https://repo.maven.apache.org/maven2/org/sonatype/aether/aether-util/1.7/aether-util-1.7.jar
(106 KB at 1369.1 KB/sec)
[INFO] Downloading: https://repo.maven.apache.org/maven2/org/apache/maven/doxia/doxia-logging-api/1.2/doxia-logging-api-1.2.jar
[INFO] Downloaded: https://repo.maven.apache.org/maven2/org/sonatype/sisu/sisu-guice/2.1.7/sisu-guice-2.1.7-noaop.jar
(461 KB at 5356.8 KB/sec)
[INFO] Downloading: https://repo.maven.apache.org/maven2/org/apache/maven/doxia/doxia-core/1.2/doxia-core-1.2.jar
[INFO] Downloaded: https://repo.maven.apache.org/maven2/org/sonatype/plexus/plexus-cipher/1.4/plexus-cipher-1.4.jar
(14 KB at 122.0 KB/sec)
[INFO] Downloading: https://repo.maven.apache.org/maven2/xerces/xercesImpl/2.9.1/xercesImpl-2.9.1.jar
[INFO] Downloaded: https://repo.maven.apache.org/maven2/org/sonatype/plexus/plexus-sec-dispatcher/1.3/plexus-sec-dispatcher-1.3.jar
(28 KB at 255.8 KB/sec)
[INFO] Downloading: https://repo.maven.apache.org/maven2/xml-apis/xml-apis/1.3.04/xml-apis-1.3.04.jar
[INFO] Downloaded: https://repo.maven.apache.org/maven2/org/apache/maven/doxia/doxia-sink-api/1.2/doxia-sink-api-1.2.jar
(11 KB at 100.7 KB/sec)
[INFO] Downloading: https://repo.maven.apache.org/maven2/org/apache/httpcomponents/httpclient/4.0.2/httpclient-4.0.2.jar
[INFO] Downloaded: https://repo.maven.apache.org/maven2/org/apache/maven/doxia/doxia-logging-api/1.2/doxia-logging-api-1.2.jar
(12 KB at 100.7 KB/sec)
[INFO] Downloading: https://repo.maven.apache.org/maven2/org/apache/httpcomponents/httpcore/4.0.1/httpcore-4.0.1.jar
[INFO] Downloaded: https://repo.maven.apache.org/maven2/org/apache/maven/doxia/doxia-core/1.2/doxia-core-1.2.jar
(151 KB at 1233.7 KB/sec)
[INFO] Downloading: https://repo.maven.apache.org/maven2/commons-codec/commons-codec/1.3/commons-codec-1.3.jar
[INFO] Downloaded: https://repo.maven.apache.org/maven2/xml-apis/xml-apis/1.3.04/xml-apis-1.3.04.jar
(190 KB at 1291.1 KB/sec)
[INFO] Downloading: https://repo.maven.apache.org/maven2/org/apache/maven/doxia/doxia-module-xhtml/1.2/doxia-module-xhtml-1.2.jar
[INFO] Downloaded: https://repo.maven.apache.org/maven2/org/apache/httpcomponents/httpcore/4.0.1/httpcore-4.0.1.jar
(169 KB at 1125.6 KB/sec)
[INFO] Downloading: https://repo.maven.apache.org/maven2/org/apache/maven/doxia/doxia-module-apt/1.2/doxia-module-apt-1.2.jar
[INFO] Downloaded: https://repo.maven.apache.org/maven2/org/apache/httpcomponents/httpclient/4.0.2/httpclient-4.0.2.jar
(287 KB at 1894.2 KB/sec)
[INFO] Downloading: https://repo.maven.apache.org/maven2/org/apache/maven/doxia/doxia-module-xdoc/1.2/doxia-module-xdoc-1.2.jar
[INFO] Downloaded: https://repo.maven.apache.org/maven2/commons-codec/commons-codec/1.3/commons-codec-1.3.jar
(46 KB at 292.5 KB/sec)
[INFO] Downloading: https://repo.maven.apache.org/maven2/org/apache/maven/doxia/doxia-module-fml/1.2/doxia-module-fml-1.2.jar
[INFO] Downloaded: https://repo.maven.apache.org/maven2/xerces/xercesImpl/2.9.1/xercesImpl-2.9.1.jar
(1201 KB at 6705.7 KB/sec)
[INFO] Downloading: https://repo.maven.apache.org/maven2/javax/servlet/servlet-api/2.5/servlet-api-2.5.jar
[INFO] Downloaded: https://repo.maven.apache.org/maven2/org/apache/maven/doxia/doxia-module-xhtml/1.2/doxia-module-xhtml-1.2.jar
(15 KB at 81.9 KB/sec)
[INFO] Downloading: https://repo.maven.apache.org/maven2/org/apache/maven/doxia/doxia-decoration-model/1.2/doxia-decoration-model-1.2.jar
[INFO] Downloaded: https://repo.maven.apache.org/maven2/org/apache/maven/doxia/doxia-module-xdoc/1.2/doxia-module-xdoc-1.2.jar
(36 KB at 193.1 KB/sec)
[INFO] Downloading: https://repo.maven.apache.org/maven2/org/apache/maven/doxia/doxia-site-renderer/1.2/doxia-site-renderer-1.2.jar
[INFO] Downloaded: https://repo.maven.apache.org/maven2/org/apache/maven/doxia/doxia-module-apt/1.2/doxia-module-apt-1.2.jar
(51 KB at 271.2 KB/sec)
[INFO] Downloading: https://repo.maven.apache.org/maven2/commons-collections/commons-collections/3.2.1/commons-collections-3.2.1.jar
[INFO] Downloaded: https://repo.maven.apache.org/maven2/org/apache/maven/doxia/doxia-module-fml/1.2/doxia-module-fml-1.2.jar
(37 KB at 195.6 KB/sec)
[INFO] Downloading: https://repo.maven.apache.org/maven2/org/apache/maven/shared/maven-doxia-tools/1.4/maven-doxia-tools-1.4.jar
[INFO] Downloaded: https://repo.maven.apache.org/maven2/org/apache/maven/doxia/doxia-decoration-model/1.2/doxia-decoration-model-1.2.jar
(59 KB at 272.6 KB/sec)
[INFO] Downloading: https://repo.maven.apache.org/maven2/org/codehaus/plexus/plexus-utils/1.5.10/plexus-utils-1.5.10.jar
[INFO] Downloaded: https://repo.maven.apache.org/maven2/javax/servlet/servlet-api/2.5/servlet-api-2.5.jar
(103 KB at 477.4 KB/sec)
[INFO] Downloading: https://repo.maven.apache.org/maven2/org/mortbay/jetty/jetty/6.1.25/jetty-6.1.25.jar
[INFO] Downloaded: https://repo.maven.apache.org/maven2/org/apache/maven/doxia/doxia-site-renderer/1.2/doxia-site-renderer-1.2.jar
(51 KB at 231.2 KB/sec)
[INFO] Downloading: https://repo.maven.apache.org/maven2/org/mortbay/jetty/servlet-api/2.5-20081211/servlet-api-2.5-20081211.jar
[INFO] Downloaded: https://repo.maven.apache.org/maven2/org/apache/maven/shared/maven-doxia-tools/1.4/maven-doxia-tools-1.4.jar
(45 KB at 197.8 KB/sec)
[INFO] Downloading: https://repo.maven.apache.org/maven2/org/mortbay/jetty/jetty-util/6.1.25/jetty-util-6.1.25.jar
[INFO] Downloaded: https://repo.maven.apache.org/maven2/commons-collections/commons-collections/3.2.1/commons-collections-3.2.1.jar
(562 KB at 2360.9 KB/sec)
[INFO] Downloading: https://repo.maven.apache.org/maven2/commons-lang/commons-lang/2.5/commons-lang-2.5.jar
[INFO] Downloaded: https://repo.maven.apache.org/maven2/org/codehaus/plexus/plexus-utils/1.5.10/plexus-utils-1.5.10.jar
(274 KB at 1065.9 KB/sec)
[INFO] Downloading: https://repo.maven.apache.org/maven2/commons-io/commons-io/1.4/commons-io-1.4.jar
[INFO] Downloaded: https://repo.maven.apache.org/maven2/org/mortbay/jetty/servlet-api/2.5-20081211/servlet-api-2.5-20081211.jar
(131 KB at 511.7 KB/sec)
[INFO] Downloaded: https://repo.maven.apache.org/maven2/org/mortbay/jetty/jetty-util/6.1.25/jetty-util-6.1.25.jar
(174 KB at 662.9 KB/sec)
[INFO] Downloaded: https://repo.maven.apache.org/maven2/org/mortbay/jetty/jetty/6.1.25/jetty-6.1.25.jar
(526 KB at 1992.3 KB/sec)
[INFO] Downloaded: https://repo.maven.apache.org/maven2/commons-lang/commons-lang/2.5/commons-lang-2.5.jar
(273 KB at 960.0 KB/sec)
[INFO] Downloaded: https://repo.maven.apache.org/maven2/commons-io/commons-io/1.4/commons-io-1.4.jar
(107 KB at 364.7 KB/sec)
[INFO] 
[INFO] --- maven-remote-resources-plugin:1.2.1:process (default) @ struts2-bom ---
[INFO] 
[INFO] --- maven-site-plugin:3.0:attach-descriptor (attach-descriptor) @ struts2-bom ---
[INFO] 
[INFO] --- maven-install-plugin:2.3.1:install (default-install) @ struts2-bom ---
[INFO] Downloading: https://repo.maven.apache.org/maven2/org/codehaus/plexus/plexus-digest/1.0/plexus-digest-1.0.pom
[INFO] Downloaded: https://repo.maven.apache.org/maven2/org/codehaus/plexus/plexus-digest/1.0/plexus-digest-1.0.pom
(2 KB at 31.3 KB/sec)
[INFO] Downloading: https://repo.maven.apache.org/maven2/org/codehaus/plexus/plexus-components/1.1.7/plexus-components-1.1.7.pom
[INFO] Downloaded: https://repo.maven.apache.org/maven2/org/codehaus/plexus/plexus-components/1.1.7/plexus-components-1.1.7.pom
(5 KB at 151.8 KB/sec)
[INFO] Downloading: https://repo.maven.apache.org/maven2/org/codehaus/plexus/plexus-digest/1.0/plexus-digest-1.0.jar
[INFO] Downloaded: https://repo.maven.apache.org/maven2/org/codehaus/plexus/plexus-digest/1.0/plexus-digest-1.0.jar
(12 KB at 350.9 KB/sec)
[INFO] Installing <https://builds.apache.org/job/Struts-JDK7-master/ws/bom/pom.xml>
to /home/jenkins/jenkins-slave/maven-repositories/0/org/apache/struts/struts2-bom/2.5.3-SNAPSHOT/struts2-bom-2.5.3-SNAPSHOT.pom
[INFO] 
[INFO] --- maven-deploy-plugin:2.6:deploy (default-deploy) @ struts2-bom ---
[INFO] Downloading: https://repo.maven.apache.org/maven2/org/codehaus/plexus/plexus-utils/1.5.6/plexus-utils-1.5.6.jar
[INFO] Downloaded: https://repo.maven.apache.org/maven2/org/codehaus/plexus/plexus-utils/1.5.6/plexus-utils-1.5.6.jar
(245 KB at 5825.6 KB/sec)
[INFO] Downloading: https://repository.apache.org/content/repositories/snapshots/org/apache/struts/struts2-bom/2.5.3-SNAPSHOT/maven-metadata.xml
[WARNING] Checksum validation failed, expected a7620bb60107da1795904ab3ee64d834 but is c019a850bf0410bfd1a5c1d78868b104
for https://repository.apache.org/content/repositories/snapshots/org/apache/struts/struts2-bom/2.5.3-SNAPSHOT/maven-metadata.xml
[WARNING] Could not transfer metadata org.apache.struts:struts2-bom:2.5.3-SNAPSHOT/maven-metadata.xml
from/to apache.snapshots.https (https://repository.apache.org/content/repositories/snapshots):
Connect to repository.apache.org:443 [repository.apache.org/207.244.88.143] failed: Connection
timed out
[INFO] ------------------------------------------------------------------------
[INFO] Reactor Summary:
[INFO] 
[INFO] Struts 2 Bill of Materials ......................... FAILURE [08:02 min]
[INFO] Struts 2 ........................................... SKIPPED
[INFO] Struts 2 Core ...................................... SKIPPED
[INFO] Struts Plugins ..................................... SKIPPED
[INFO] Struts 2 Configuration Browser Plugin .............. SKIPPED
[INFO] Struts 2 Sitemesh Plugin ........................... SKIPPED
[INFO] Struts 2 Tiles Plugin .............................. SKIPPED
[INFO] Struts 2 DWR Plugin ................................ SKIPPED
[INFO] Struts 2 Spring Plugin ............................. SKIPPED
[INFO] Struts 2 Convention Plugin ......................... SKIPPED
[INFO] Struts 2 JUnit Plugin .............................. SKIPPED
[INFO] Struts 2 JSON Plugin ............................... SKIPPED
[INFO] Struts 2 Bean Validation Plugin .................... SKIPPED
[INFO] Struts 2 Webapps ................................... SKIPPED
[INFO] Struts 2 Showcase Webapp ........................... SKIPPED
[INFO] Struts 2 REST Plugin ............................... SKIPPED
[INFO] Struts 2 Rest Showcase Webapp ...................... SKIPPED
[INFO] Struts 2 CDI Plugin ................................ SKIPPED
[INFO] Struts 2 Embedded JSP Plugin ....................... SKIPPED
[INFO] Struts 2 GXP Plugin ................................ SKIPPED
[INFO] Struts 2 Jasper Reports Plugin ..................... SKIPPED
[INFO] Struts 2 Java Templates Plugin ..................... SKIPPED
[INFO] Struts 2 JFreeChart Plugin ......................... SKIPPED
[INFO] Struts 2 OSGi Plugin ............................... SKIPPED
[INFO] Struts 2 OVal Plugin ............................... SKIPPED
[INFO] Struts 2 Pell Multipart Plugin ..................... SKIPPED
[INFO] Struts 2 Plexus Plugin ............................. SKIPPED
[INFO] Struts 2 Portlet Plugin ............................ SKIPPED
[INFO] Struts 2 Portlet Tiles Plugin ...................... SKIPPED
[INFO] Struts 2 Sitegraph Plugin .......................... SKIPPED
[INFO] Struts 2 TestNG Plugin ............................. SKIPPED
[INFO] Struts OSGi Bundles ................................ SKIPPED
[INFO] Struts 2 OSGi Admin Bundle ......................... SKIPPED
[INFO] Struts 2 OSGi Demo Bundle .......................... SKIPPED
[INFO] Struts 2 Assembly .................................. SKIPPED
[INFO] ------------------------------------------------------------------------
[INFO] BUILD FAILURE
[INFO] ------------------------------------------------------------------------
[INFO] Total time: 08:25 min
[INFO] Finished at: 2016-07-27T07:11:49+00:00
[INFO] Final Memory: 42M/314M
[INFO] ------------------------------------------------------------------------
[ERROR] Failed to execute goal org.apache.maven.plugins:maven-deploy-plugin:2.6:deploy (default-deploy)
on project struts2-bom: Failed to retrieve remote metadata org.apache.struts:struts2-bom:2.5.3-SNAPSHOT/maven-metadata.xml:
Could not transfer metadata org.apache.struts:struts2-bom:2.5.3-SNAPSHOT/maven-metadata.xml
from/to apache.snapshots.https (https://repository.apache.org/content/repositories/snapshots):
Connect to repository.apache.org:443 [repository.apache.org/207.244.88.143] failed: Connection
timed out -> [Help 1]
[ERROR] 
[ERROR] To see the full stack trace of the errors, re-run Maven with the -e switch.
[ERROR] Re-run Maven using the -X switch to enable full debug logging.
[ERROR] 
[ERROR] For more information about the errors and possible solutions, please read the following
articles:
[ERROR] [Help 1] http://cwiki.apache.org/confluence/display/MAVEN/MojoExecutionException
[JENKINS] Archiving <https://builds.apache.org/job/Struts-JDK7-master/ws/plugins/pell-multipart/pom.xml>
to org.apache.struts/struts2-pell-multipart-plugin/2.5.3-SNAPSHOT/struts2-pell-multipart-plugin-2.5.3-SNAPSHOT.pom
[JENKINS] Archiving <https://builds.apache.org/job/Struts-JDK7-master/ws/plugins/plexus/pom.xml>
to org.apache.struts/struts2-plexus-plugin/2.5.3-SNAPSHOT/struts2-plexus-plugin-2.5.3-SNAPSHOT.pom
[JENKINS] Archiving <https://builds.apache.org/job/Struts-JDK7-master/ws/plugins/jfreechart/pom.xml>
to org.apache.struts/struts2-jfreechart-plugin/2.5.3-SNAPSHOT/struts2-jfreechart-plugin-2.5.3-SNAPSHOT.pom
[JENKINS] Archiving <https://builds.apache.org/job/Struts-JDK7-master/ws/plugins/sitemesh/pom.xml>
to org.apache.struts/struts2-sitemesh-plugin/2.5.3-SNAPSHOT/struts2-sitemesh-plugin-2.5.3-SNAPSHOT.pom
[JENKINS] Archiving <https://builds.apache.org/job/Struts-JDK7-master/ws/plugins/config-browser/pom.xml>
to org.apache.struts/struts2-config-browser-plugin/2.5.3-SNAPSHOT/struts2-config-browser-plugin-2.5.3-SNAPSHOT.pom
[JENKINS] Archiving <https://builds.apache.org/job/Struts-JDK7-master/ws/bundles/demo/pom.xml>
to org.apache.struts/struts2-osgi-demo-bundle/2.5.3-SNAPSHOT/struts2-osgi-demo-bundle-2.5.3-SNAPSHOT.pom
[JENKINS] Archiving <https://builds.apache.org/job/Struts-JDK7-master/ws/plugins/portlet-tiles/pom.xml>
to org.apache.struts/struts2-portlet-tiles-plugin/2.5.3-SNAPSHOT/struts2-portlet-tiles-plugin-2.5.3-SNAPSHOT.pom
[JENKINS] Archiving <https://builds.apache.org/job/Struts-JDK7-master/ws/plugins/jasperreports/pom.xml>
to org.apache.struts/struts2-jasperreports-plugin/2.5.3-SNAPSHOT/struts2-jasperreports-plugin-2.5.3-SNAPSHOT.pom
[JENKINS] Archiving <https://builds.apache.org/job/Struts-JDK7-master/ws/plugins/oval/pom.xml>
to org.apache.struts/struts2-oval-plugin/2.5.3-SNAPSHOT/struts2-oval-plugin-2.5.3-SNAPSHOT.pom
[JENKINS] Archiving <https://builds.apache.org/job/Struts-JDK7-master/ws/plugins/gxp/pom.xml>
to org.apache.struts/struts2-gxp-plugin/2.5.3-SNAPSHOT/struts2-gxp-plugin-2.5.3-SNAPSHOT.pom
[JENKINS] Archiving <https://builds.apache.org/job/Struts-JDK7-master/ws/plugins/convention/pom.xml>
to org.apache.struts/struts2-convention-plugin/2.5.3-SNAPSHOT/struts2-convention-plugin-2.5.3-SNAPSHOT.pom
[JENKINS] Archiving <https://builds.apache.org/job/Struts-JDK7-master/ws/bundles/pom.xml>
to org.apache.struts/struts2-osgi-bundles/2.5.3-SNAPSHOT/struts2-osgi-bundles-2.5.3-SNAPSHOT.pom
[JENKINS] Archiving <https://builds.apache.org/job/Struts-JDK7-master/ws/pom.xml> to
org.apache.struts/struts2-parent/2.5.3-SNAPSHOT/struts2-parent-2.5.3-SNAPSHOT.pom
[JENKINS] Archiving <https://builds.apache.org/job/Struts-JDK7-master/ws/plugins/osgi/pom.xml>
to org.apache.struts/struts2-osgi-plugin/2.5.3-SNAPSHOT/struts2-osgi-plugin-2.5.3-SNAPSHOT.pom
[JENKINS] Archiving <https://builds.apache.org/job/Struts-JDK7-master/ws/assembly/pom.xml>
to org.apache.struts/struts2-assembly/2.5.3-SNAPSHOT/struts2-assembly-2.5.3-SNAPSHOT.pom
[JENKINS] Archiving <https://builds.apache.org/job/Struts-JDK7-master/ws/apps/showcase/pom.xml>
to org.apache.struts/struts2-showcase/2.5.3-SNAPSHOT/struts2-showcase-2.5.3-SNAPSHOT.pom
[JENKINS] Archiving <https://builds.apache.org/job/Struts-JDK7-master/ws/plugins/cdi/pom.xml>
to org.apache.struts/struts2-cdi-plugin/2.5.3-SNAPSHOT/struts2-cdi-plugin-2.5.3-SNAPSHOT.pom
[JENKINS] Archiving <https://builds.apache.org/job/Struts-JDK7-master/ws/plugins/rest/pom.xml>
to org.apache.struts/struts2-rest-plugin/2.5.3-SNAPSHOT/struts2-rest-plugin-2.5.3-SNAPSHOT.pom
[JENKINS] Archiving <https://builds.apache.org/job/Struts-JDK7-master/ws/core/pom.xml>
to org.apache.struts/struts2-core/2.5.3-SNAPSHOT/struts2-core-2.5.3-SNAPSHOT.pom
[JENKINS] Archiving <https://builds.apache.org/job/Struts-JDK7-master/ws/plugins/tiles/pom.xml>
to org.apache.struts/struts2-tiles-plugin/2.5.3-SNAPSHOT/struts2-tiles-plugin-2.5.3-SNAPSHOT.pom
[JENKINS] Archiving <https://builds.apache.org/job/Struts-JDK7-master/ws/bom/pom.xml>
to org.apache.struts/struts2-bom/2.5.3-SNAPSHOT/struts2-bom-2.5.3-SNAPSHOT.pom
[JENKINS] Archiving <https://builds.apache.org/job/Struts-JDK7-master/ws/plugins/embeddedjsp/pom.xml>
to org.apache.struts/struts2-embeddedjsp-plugin/2.5.3-SNAPSHOT/struts2-embeddedjsp-plugin-2.5.3-SNAPSHOT.pom
[JENKINS] Archiving <https://builds.apache.org/job/Struts-JDK7-master/ws/plugins/pom.xml>
to org.apache.struts/struts2-plugins/2.5.3-SNAPSHOT/struts2-plugins-2.5.3-SNAPSHOT.pom
[JENKINS] Archiving <https://builds.apache.org/job/Struts-JDK7-master/ws/apps/rest-showcase/pom.xml>
to org.apache.struts/struts2-rest-showcase/2.5.3-SNAPSHOT/struts2-rest-showcase-2.5.3-SNAPSHOT.pom
[JENKINS] Archiving <https://builds.apache.org/job/Struts-JDK7-master/ws/plugins/javatemplates/pom.xml>
to org.apache.struts/struts2-javatemplates-plugin/2.5.3-SNAPSHOT/struts2-javatemplates-plugin-2.5.3-SNAPSHOT.pom
[JENKINS] Archiving <https://builds.apache.org/job/Struts-JDK7-master/ws/bundles/admin/pom.xml>
to org.apache.struts/struts2-osgi-admin-bundle/2.5.3-SNAPSHOT/struts2-osgi-admin-bundle-2.5.3-SNAPSHOT.pom
[JENKINS] Archiving <https://builds.apache.org/job/Struts-JDK7-master/ws/apps/pom.xml>
to org.apache.struts/struts2-apps/2.5.3-SNAPSHOT/struts2-apps-2.5.3-SNAPSHOT.pom
[JENKINS] Archiving <https://builds.apache.org/job/Struts-JDK7-master/ws/plugins/sitegraph/pom.xml>
to org.apache.struts/struts2-sitegraph-plugin/2.5.3-SNAPSHOT/struts2-sitegraph-plugin-2.5.3-SNAPSHOT.pom
[JENKINS] Archiving <https://builds.apache.org/job/Struts-JDK7-master/ws/plugins/testng/pom.xml>
to org.apache.struts/struts2-testng-plugin/2.5.3-SNAPSHOT/struts2-testng-plugin-2.5.3-SNAPSHOT.pom
[JENKINS] Archiving <https://builds.apache.org/job/Struts-JDK7-master/ws/plugins/json/pom.xml>
to org.apache.struts/struts2-json-plugin/2.5.3-SNAPSHOT/struts2-json-plugin-2.5.3-SNAPSHOT.pom
[JENKINS] Archiving <https://builds.apache.org/job/Struts-JDK7-master/ws/plugins/junit/pom.xml>
to org.apache.struts/struts2-junit-plugin/2.5.3-SNAPSHOT/struts2-junit-plugin-2.5.3-SNAPSHOT.pom
[JENKINS] Archiving <https://builds.apache.org/job/Struts-JDK7-master/ws/plugins/dwr/pom.xml>
to org.apache.struts/struts2-dwr-plugin/2.5.3-SNAPSHOT/struts2-dwr-plugin-2.5.3-SNAPSHOT.pom
[JENKINS] Archiving <https://builds.apache.org/job/Struts-JDK7-master/ws/plugins/bean-validation/pom.xml>
to org.apache.struts/struts2-bean-validation-plugin/2.5.3-SNAPSHOT/struts2-bean-validation-plugin-2.5.3-SNAPSHOT.pom
[JENKINS] Archiving <https://builds.apache.org/job/Struts-JDK7-master/ws/plugins/portlet/pom.xml>
to org.apache.struts/struts2-portlet-plugin/2.5.3-SNAPSHOT/struts2-portlet-plugin-2.5.3-SNAPSHOT.pom
[JENKINS] Archiving <https://builds.apache.org/job/Struts-JDK7-master/ws/plugins/spring/pom.xml>
to org.apache.struts/struts2-spring-plugin/2.5.3-SNAPSHOT/struts2-spring-plugin-2.5.3-SNAPSHOT.pom
[locks-and-latches] Releasing all the locks
[locks-and-latches] All the locks released
channel stopped

---------------------------------------------------------------------
To unsubscribe, e-mail: dev-unsubscribe@struts.apache.org
For additional commands, e-mail: dev-help@struts.apache.org


Mime
View raw message