struts-dev mailing list archives

Site index · List index
Message view « Date » · « Thread »
Top « Date » · « Thread »
From Apache Jenkins Server <jenk...@builds.apache.org>
Subject Build failed in Jenkins: Struts-JDK7-master #497
Date Wed, 27 Jul 2016 06:18:15 GMT
See <https://builds.apache.org/job/Struts-JDK7-master/497/changes>

Changes:

[github] Change to the documentation

------------------------------------------
[...truncated 7980 lines...]


<!-- javascript that is needed for tooltips -->
<script type="text/javascript" src='/struts/domTT.js'></script>
<link rel="stylesheet" type="text/css" href="/struts/domTT.css"/>
	

2016-07-27 06:17:51,290 WARN  [main] components.UpDownSelect (UpDownSelect.java:152) - no
ancestor form found for updownselect org.apache.struts2.components.UpDownSelect@3fe32146,
therefore autoselect of all elements upon form submission will not work 
2016-07-27 06:17:51,355 WARN  [main] components.UpDownSelect (UpDownSelect.java:152) - no
ancestor form found for updownselect org.apache.struts2.components.UpDownSelect@747fef53,
therefore autoselect of all elements upon form submission will not work 
2016-07-27 06:17:51,414 WARN  [main] components.UpDownSelect (UpDownSelect.java:152) - no
ancestor form found for updownselect org.apache.struts2.components.UpDownSelect@4593e099,
therefore autoselect of all elements upon form submission will not work 
2016-07-27 06:17:51,472 WARN  [main] components.UpDownSelect (UpDownSelect.java:152) - no
ancestor form found for updownselect org.apache.struts2.components.UpDownSelect@1ed90b98,
therefore autoselect of all elements upon form submission will not work 
2016-07-27 06:17:51,541 WARN  [main] components.UpDownSelect (UpDownSelect.java:152) - no
ancestor form found for updownselect org.apache.struts2.components.UpDownSelect@6cad3eca,
therefore autoselect of all elements upon form submission will not work 
2016-07-27 06:17:51,598 WARN  [main] components.UpDownSelect (UpDownSelect.java:152) - no
ancestor form found for updownselect org.apache.struts2.components.UpDownSelect@5414ceb0,
therefore autoselect of all elements upon form submission will not work 
2016-07-27 06:17:51,664 WARN  [main] components.UpDownSelect (UpDownSelect.java:152) - no
ancestor form found for updownselect org.apache.struts2.components.UpDownSelect@6515bc2b,
therefore autoselect of all elements upon form submission will not work 
2016-07-27 06:17:51,712 WARN  [main] components.UpDownSelect (UpDownSelect.java:152) - no
ancestor form found for updownselect org.apache.struts2.components.UpDownSelect@66889d07,
therefore autoselect of all elements upon form submission will not work 
2016-07-27 06:17:51,771 WARN  [main] components.UpDownSelect (UpDownSelect.java:152) - no
ancestor form found for updownselect org.apache.struts2.components.UpDownSelect@3cf49ded,
therefore autoselect of all elements upon form submission will not work 
2016-07-27 06:17:51,833 WARN  [main] components.UpDownSelect (UpDownSelect.java:152) - no
ancestor form found for updownselect org.apache.struts2.components.UpDownSelect@7c2974d, therefore
autoselect of all elements upon form submission will not work 
2016-07-27 06:17:51,901 WARN  [main] components.UpDownSelect (UpDownSelect.java:152) - no
ancestor form found for updownselect org.apache.struts2.components.UpDownSelect@70f4c720,
therefore autoselect of all elements upon form submission will not work 
2016-07-27 06:17:51,956 WARN  [main] components.UpDownSelect (UpDownSelect.java:152) - no
ancestor form found for updownselect org.apache.struts2.components.UpDownSelect@53e67ccf,
therefore autoselect of all elements upon form submission will not work 
2016-07-27 06:17:52,006 WARN  [main] components.UpDownSelect (UpDownSelect.java:152) - no
ancestor form found for updownselect org.apache.struts2.components.UpDownSelect@26ce4eb, therefore
autoselect of all elements upon form submission will not work 
2016-07-27 06:17:53,170 ERROR [main] xslt.XSLTResult (XSLTResult.java:383) - Unable to render
XSLT Template, 'nofile.xsl'
javax.xml.transform.TransformerException: Stylesheet nofile.xsl not found in resources.
	at org.apache.struts2.views.xslt.XSLTResult.getTemplates(XSLTResult.java:418) ~[classes/:?]
	at org.apache.struts2.views.xslt.XSLTResult.execute(XSLTResult.java:327) [classes/:?]
	at org.apache.struts2.views.xslt.XSLTResultTest.testNoFileFound(XSLTResultTest.java:70) [test-classes/:?]
	at sun.reflect.NativeMethodAccessorImpl.invoke0(Native Method) ~[?:1.7.0_80]
	at sun.reflect.NativeMethodAccessorImpl.invoke(NativeMethodAccessorImpl.java:57) ~[?:1.7.0_80]
	at sun.reflect.DelegatingMethodAccessorImpl.invoke(DelegatingMethodAccessorImpl.java:43)
~[?:1.7.0_80]
	at java.lang.reflect.Method.invoke(Method.java:606) ~[?:1.7.0_80]
	at org.testng.internal.MethodHelper.invokeMethod(MethodHelper.java:552) [testng-5.1-jdk15.jar:?]
	at org.testng.internal.Invoker.invokeMethod(Invoker.java:411) [testng-5.1-jdk15.jar:?]
	at org.testng.internal.Invoker.invokeTestMethods(Invoker.java:785) [testng-5.1-jdk15.jar:?]
	at org.testng.internal.TestMethodWorker.run(TestMethodWorker.java:114) [testng-5.1-jdk15.jar:?]
	at org.testng.TestRunner.privateRun(TestRunner.java:693) [testng-5.1-jdk15.jar:?]
	at org.testng.TestRunner.run(TestRunner.java:574) [testng-5.1-jdk15.jar:?]
	at org.testng.SuiteRunner.privateRun(SuiteRunner.java:241) [testng-5.1-jdk15.jar:?]
	at org.testng.SuiteRunner.run(SuiteRunner.java:145) [testng-5.1-jdk15.jar:?]
	at org.testng.TestNG.createAndRunSuiteRunners(TestNG.java:901) [testng-5.1-jdk15.jar:?]
	at org.testng.TestNG.runSuitesLocally(TestNG.java:863) [testng-5.1-jdk15.jar:?]
	at org.testng.TestNG.run(TestNG.java:613) [testng-5.1-jdk15.jar:?]
	at org.apache.maven.surefire.testng.TestNGExecutor.run(TestNGExecutor.java:61) [surefire-testng-2.6.jar:2.6]
	at org.apache.maven.surefire.testng.TestNGDirectoryTestSuite.execute(TestNGDirectoryTestSuite.java:158)
[surefire-testng-2.6.jar:2.6]
	at org.apache.maven.surefire.Surefire.run(Surefire.java:169) [surefire-api-2.6.jar:2.6]
	at sun.reflect.NativeMethodAccessorImpl.invoke0(Native Method) ~[?:1.7.0_80]
	at sun.reflect.NativeMethodAccessorImpl.invoke(NativeMethodAccessorImpl.java:57) ~[?:1.7.0_80]
	at sun.reflect.DelegatingMethodAccessorImpl.invoke(DelegatingMethodAccessorImpl.java:43)
~[?:1.7.0_80]
	at java.lang.reflect.Method.invoke(Method.java:606) ~[?:1.7.0_80]
	at org.apache.maven.surefire.booter.SurefireBooter.runSuitesInProcess(SurefireBooter.java:350)
[surefire-booter-2.6.jar:2.6]
	at org.apache.maven.surefire.booter.SurefireBooter.main(SurefireBooter.java:1021) [surefire-booter-2.6.jar:2.6]
2016-07-27 06:17:53,212 ERROR [main] xslt.XSLTResult (XSLTResult.java:383) - Unable to render
XSLT Template, 'XSLTResultTest4.badinclude.xsl'
org.apache.struts2.StrutsException: Error transforming result
	at org.apache.struts2.views.xslt.XSLTResult$1.error(XSLTResult.java:337) ~[classes/:?]
	at com.sun.org.apache.xalan.internal.xsltc.trax.TransformerImpl.postErrorToListener(TransformerImpl.java:811)
~[?:1.7.0_80]
	at com.sun.org.apache.xalan.internal.xsltc.trax.TransformerImpl.transform(TransformerImpl.java:751)
~[?:1.7.0_80]
	at com.sun.org.apache.xalan.internal.xsltc.trax.TransformerImpl.transform(TransformerImpl.java:359)
~[?:1.7.0_80]
	at org.apache.struts2.views.xslt.XSLTResult.execute(XSLTResult.java:376) [classes/:?]
	at org.apache.struts2.views.xslt.XSLTResultTest.testTransform4WithBadDocumentInclude(XSLTResultTest.java:169)
[test-classes/:?]
	at sun.reflect.NativeMethodAccessorImpl.invoke0(Native Method) ~[?:1.7.0_80]
	at sun.reflect.NativeMethodAccessorImpl.invoke(NativeMethodAccessorImpl.java:57) ~[?:1.7.0_80]
	at sun.reflect.DelegatingMethodAccessorImpl.invoke(DelegatingMethodAccessorImpl.java:43)
~[?:1.7.0_80]
	at java.lang.reflect.Method.invoke(Method.java:606) ~[?:1.7.0_80]
	at org.testng.internal.MethodHelper.invokeMethod(MethodHelper.java:552) [testng-5.1-jdk15.jar:?]
	at org.testng.internal.Invoker.invokeMethod(Invoker.java:411) [testng-5.1-jdk15.jar:?]
	at org.testng.internal.Invoker.invokeTestMethods(Invoker.java:785) [testng-5.1-jdk15.jar:?]
	at org.testng.internal.TestMethodWorker.run(TestMethodWorker.java:114) [testng-5.1-jdk15.jar:?]
	at org.testng.TestRunner.privateRun(TestRunner.java:693) [testng-5.1-jdk15.jar:?]
	at org.testng.TestRunner.run(TestRunner.java:574) [testng-5.1-jdk15.jar:?]
	at org.testng.SuiteRunner.privateRun(SuiteRunner.java:241) [testng-5.1-jdk15.jar:?]
	at org.testng.SuiteRunner.run(SuiteRunner.java:145) [testng-5.1-jdk15.jar:?]
	at org.testng.TestNG.createAndRunSuiteRunners(TestNG.java:901) [testng-5.1-jdk15.jar:?]
	at org.testng.TestNG.runSuitesLocally(TestNG.java:863) [testng-5.1-jdk15.jar:?]
	at org.testng.TestNG.run(TestNG.java:613) [testng-5.1-jdk15.jar:?]
	at org.apache.maven.surefire.testng.TestNGExecutor.run(TestNGExecutor.java:61) [surefire-testng-2.6.jar:2.6]
	at org.apache.maven.surefire.testng.TestNGDirectoryTestSuite.execute(TestNGDirectoryTestSuite.java:158)
[surefire-testng-2.6.jar:2.6]
	at org.apache.maven.surefire.Surefire.run(Surefire.java:169) [surefire-api-2.6.jar:2.6]
	at sun.reflect.NativeMethodAccessorImpl.invoke0(Native Method) ~[?:1.7.0_80]
	at sun.reflect.NativeMethodAccessorImpl.invoke(NativeMethodAccessorImpl.java:57) ~[?:1.7.0_80]
	at sun.reflect.DelegatingMethodAccessorImpl.invoke(DelegatingMethodAccessorImpl.java:43)
~[?:1.7.0_80]
	at java.lang.reflect.Method.invoke(Method.java:606) ~[?:1.7.0_80]
	at org.apache.maven.surefire.booter.SurefireBooter.runSuitesInProcess(SurefireBooter.java:350)
[surefire-booter-2.6.jar:2.6]
	at org.apache.maven.surefire.booter.SurefireBooter.main(SurefireBooter.java:1021) [surefire-booter-2.6.jar:2.6]
Caused by: javax.xml.transform.TransformerException: Error transforming result - [unknown
location]
	... 29 more
2016-07-27 06:17:53,316 ERROR [main] xslt.XSLTResult (XSLTResult.java:383) - Unable to render
XSLT Template, 'XSLTResultTest4.xsl'
org.apache.struts2.StrutsException: Error transforming result
	at org.apache.struts2.views.xslt.XSLTResult$1.error(XSLTResult.java:337) ~[classes/:?]
	at com.sun.org.apache.xalan.internal.xsltc.trax.TransformerImpl.postErrorToListener(TransformerImpl.java:811)
~[?:1.7.0_80]
	at com.sun.org.apache.xalan.internal.xsltc.trax.TransformerImpl.transform(TransformerImpl.java:751)
~[?:1.7.0_80]
	at com.sun.org.apache.xalan.internal.xsltc.trax.TransformerImpl.transform(TransformerImpl.java:359)
~[?:1.7.0_80]
	at org.apache.struts2.views.xslt.XSLTResult.execute(XSLTResult.java:376) [classes/:?]
	at org.apache.struts2.views.xslt.XSLTResultTest.testTransformWithError(XSLTResultTest.java:188)
[test-classes/:?]
	at sun.reflect.NativeMethodAccessorImpl.invoke0(Native Method) ~[?:1.7.0_80]
	at sun.reflect.NativeMethodAccessorImpl.invoke(NativeMethodAccessorImpl.java:57) ~[?:1.7.0_80]
	at sun.reflect.DelegatingMethodAccessorImpl.invoke(DelegatingMethodAccessorImpl.java:43)
~[?:1.7.0_80]
	at java.lang.reflect.Method.invoke(Method.java:606) ~[?:1.7.0_80]
	at org.testng.internal.MethodHelper.invokeMethod(MethodHelper.java:552) [testng-5.1-jdk15.jar:?]
	at org.testng.internal.Invoker.invokeMethod(Invoker.java:411) [testng-5.1-jdk15.jar:?]
	at org.testng.internal.Invoker.invokeTestMethods(Invoker.java:785) [testng-5.1-jdk15.jar:?]
	at org.testng.internal.TestMethodWorker.run(TestMethodWorker.java:114) [testng-5.1-jdk15.jar:?]
	at org.testng.TestRunner.privateRun(TestRunner.java:693) [testng-5.1-jdk15.jar:?]
	at org.testng.TestRunner.run(TestRunner.java:574) [testng-5.1-jdk15.jar:?]
	at org.testng.SuiteRunner.privateRun(SuiteRunner.java:241) [testng-5.1-jdk15.jar:?]
	at org.testng.SuiteRunner.run(SuiteRunner.java:145) [testng-5.1-jdk15.jar:?]
	at org.testng.TestNG.createAndRunSuiteRunners(TestNG.java:901) [testng-5.1-jdk15.jar:?]
	at org.testng.TestNG.runSuitesLocally(TestNG.java:863) [testng-5.1-jdk15.jar:?]
	at org.testng.TestNG.run(TestNG.java:613) [testng-5.1-jdk15.jar:?]
	at org.apache.maven.surefire.testng.TestNGExecutor.run(TestNGExecutor.java:61) [surefire-testng-2.6.jar:2.6]
	at org.apache.maven.surefire.testng.TestNGDirectoryTestSuite.execute(TestNGDirectoryTestSuite.java:158)
[surefire-testng-2.6.jar:2.6]
	at org.apache.maven.surefire.Surefire.run(Surefire.java:169) [surefire-api-2.6.jar:2.6]
	at sun.reflect.NativeMethodAccessorImpl.invoke0(Native Method) ~[?:1.7.0_80]
	at sun.reflect.NativeMethodAccessorImpl.invoke(NativeMethodAccessorImpl.java:57) ~[?:1.7.0_80]
	at sun.reflect.DelegatingMethodAccessorImpl.invoke(DelegatingMethodAccessorImpl.java:43)
~[?:1.7.0_80]
	at java.lang.reflect.Method.invoke(Method.java:606) ~[?:1.7.0_80]
	at org.apache.maven.surefire.booter.SurefireBooter.runSuitesInProcess(SurefireBooter.java:350)
[surefire-booter-2.6.jar:2.6]
	at org.apache.maven.surefire.booter.SurefireBooter.main(SurefireBooter.java:1021) [surefire-booter-2.6.jar:2.6]
Caused by: javax.xml.transform.TransformerException: Error transforming result - [unknown
location]
	... 29 more
Tests run: 1661, Failures: 0, Errors: 0, Skipped: 0, Time elapsed: 55.906 sec

Results :

Tests run: 1661, Failures: 0, Errors: 0, Skipped: 0

[JENKINS] Recording test results
[INFO] 
[INFO] --- maven-jar-plugin:2.5:jar (default-jar) @ struts2-core ---
[INFO] Building jar: <https://builds.apache.org/job/Struts-JDK7-master/ws/core/target/struts2-core-2.5.3-SNAPSHOT.jar>
[INFO] 
[INFO] >>> maven-source-plugin:2.3:jar (attach-sources) > generate-sources @ struts2-core
>>>
[WARNING] Failed to getClass for org.apache.maven.plugin.source.SourceJarMojo
[INFO] 
[INFO] <<< maven-source-plugin:2.3:jar (attach-sources) < generate-sources @ struts2-core
<<<
[INFO] 
[INFO] --- maven-source-plugin:2.3:jar (attach-sources) @ struts2-core ---
[INFO] Building jar: <https://builds.apache.org/job/Struts-JDK7-master/ws/core/target/struts2-core-2.5.3-SNAPSHOT-sources.jar>
[INFO] 
[INFO] --- maven-site-plugin:3.4:attach-descriptor (attach-descriptor) @ struts2-core ---
[INFO] 
[INFO] --- maven-install-plugin:2.5.2:install (default-install) @ struts2-core ---
[INFO] Installing <https://builds.apache.org/job/Struts-JDK7-master/ws/core/target/struts2-core-2.5.3-SNAPSHOT.jar>
to /home/jenkins/jenkins-slave/maven-repositories/2/org/apache/struts/struts2-core/2.5.3-SNAPSHOT/struts2-core-2.5.3-SNAPSHOT.jar
[INFO] Installing <https://builds.apache.org/job/Struts-JDK7-master/ws/core/pom.xml>
to /home/jenkins/jenkins-slave/maven-repositories/2/org/apache/struts/struts2-core/2.5.3-SNAPSHOT/struts2-core-2.5.3-SNAPSHOT.pom
[INFO] Installing <https://builds.apache.org/job/Struts-JDK7-master/ws/core/target/struts2-core-2.5.3-SNAPSHOT-sources.jar>
to /home/jenkins/jenkins-slave/maven-repositories/2/org/apache/struts/struts2-core/2.5.3-SNAPSHOT/struts2-core-2.5.3-SNAPSHOT-sources.jar
[INFO] Installing <https://builds.apache.org/job/Struts-JDK7-master/ws/core/target/struts2-core-2.5.3-SNAPSHOT-javadoc.jar>
to /home/jenkins/jenkins-slave/maven-repositories/2/org/apache/struts/struts2-core/2.5.3-SNAPSHOT/struts2-core-2.5.3-SNAPSHOT-javadoc.jar
[INFO] Installing <https://builds.apache.org/job/Struts-JDK7-master/ws/core/target/struts2-core-2.5.3-SNAPSHOT-sources.jar>
to /home/jenkins/jenkins-slave/maven-repositories/2/org/apache/struts/struts2-core/2.5.3-SNAPSHOT/struts2-core-2.5.3-SNAPSHOT-sources.jar
[INFO] Installing <https://builds.apache.org/job/Struts-JDK7-master/ws/core/target/struts2-core-2.5.3-SNAPSHOT-sources.jar>
to /home/jenkins/jenkins-slave/maven-repositories/2/org/apache/struts/struts2-core/2.5.3-SNAPSHOT/struts2-core-2.5.3-SNAPSHOT-sources.jar
[INFO] 
[INFO] --- maven-deploy-plugin:2.8.2:deploy (default-deploy) @ struts2-core ---
[INFO] Downloading: https://repository.apache.org/content/repositories/snapshots/org/apache/struts/struts2-core/2.5.3-SNAPSHOT/maven-metadata.xml
[INFO] Downloaded: https://repository.apache.org/content/repositories/snapshots/org/apache/struts/struts2-core/2.5.3-SNAPSHOT/maven-metadata.xml
(2 KB at 1.5 KB/sec)
[INFO] Uploading: https://repository.apache.org/content/repositories/snapshots/org/apache/struts/struts2-core/2.5.3-SNAPSHOT/struts2-core-2.5.3-20160727.061756-13.jar
[INFO] Uploading: https://repository.apache.org/content/repositories/snapshots/org/apache/struts/struts2-core/2.5.3-SNAPSHOT/struts2-core-2.5.3-20160727.061756-13.pom
[INFO] Uploaded: https://repository.apache.org/content/repositories/snapshots/org/apache/struts/struts2-core/2.5.3-SNAPSHOT/struts2-core-2.5.3-20160727.061756-13.pom
(17 KB at 18.7 KB/sec)
[INFO] ------------------------------------------------------------------------
[INFO] Reactor Summary:
[INFO] 
[INFO] Struts 2 Bill of Materials ......................... SUCCESS [ 27.900 s]
[INFO] Struts 2 ........................................... SUCCESS [ 11.149 s]
[INFO] Struts 2 Core ...................................... FAILURE [03:10 min]
[INFO] Struts Plugins ..................................... SKIPPED
[INFO] Struts 2 Configuration Browser Plugin .............. SKIPPED
[INFO] Struts 2 Sitemesh Plugin ........................... SKIPPED
[INFO] Struts 2 Tiles Plugin .............................. SKIPPED
[INFO] Struts 2 DWR Plugin ................................ SKIPPED
[INFO] Struts 2 Spring Plugin ............................. SKIPPED
[INFO] Struts 2 Convention Plugin ......................... SKIPPED
[INFO] Struts 2 JUnit Plugin .............................. SKIPPED
[INFO] Struts 2 JSON Plugin ............................... SKIPPED
[INFO] Struts 2 Bean Validation Plugin .................... SKIPPED
[INFO] Struts 2 Webapps ................................... SKIPPED
[INFO] Struts 2 Showcase Webapp ........................... SKIPPED
[INFO] Struts 2 REST Plugin ............................... SKIPPED
[INFO] Struts 2 Rest Showcase Webapp ...................... SKIPPED
[INFO] Struts 2 CDI Plugin ................................ SKIPPED
[INFO] Struts 2 Embedded JSP Plugin ....................... SKIPPED
[INFO] Struts 2 GXP Plugin ................................ SKIPPED
[INFO] Struts 2 Jasper Reports Plugin ..................... SKIPPED
[INFO] Struts 2 Java Templates Plugin ..................... SKIPPED
[INFO] Struts 2 JFreeChart Plugin ......................... SKIPPED
[INFO] Struts 2 OSGi Plugin ............................... SKIPPED
[INFO] Struts 2 OVal Plugin ............................... SKIPPED
[INFO] Struts 2 Pell Multipart Plugin ..................... SKIPPED
[INFO] Struts 2 Plexus Plugin ............................. SKIPPED
[INFO] Struts 2 Portlet Plugin ............................ SKIPPED
[INFO] Struts 2 Portlet Tiles Plugin ...................... SKIPPED
[INFO] Struts 2 Sitegraph Plugin .......................... SKIPPED
[INFO] Struts 2 TestNG Plugin ............................. SKIPPED
[INFO] Struts OSGi Bundles ................................ SKIPPED
[INFO] Struts 2 OSGi Admin Bundle ......................... SKIPPED
[INFO] Struts 2 OSGi Demo Bundle .......................... SKIPPED
[INFO] Struts 2 Assembly .................................. SKIPPED
[INFO] ------------------------------------------------------------------------
[INFO] BUILD FAILURE
[INFO] ------------------------------------------------------------------------
[INFO] Total time: 03:57 min
[INFO] Finished at: 2016-07-27T06:18:06+00:00
[INFO] Final Memory: 70M/425M
[INFO] ------------------------------------------------------------------------
[ERROR] Failed to execute goal org.apache.maven.plugins:maven-deploy-plugin:2.8.2:deploy (default-deploy)
on project struts2-core: Failed to deploy artifacts: Could not transfer artifact org.apache.struts:struts2-core:jar:2.5.3-20160727.061756-13
from/to apache.snapshots.https (https://repository.apache.org/content/repositories/snapshots):
Failed to transfer file: https://repository.apache.org/content/repositories/snapshots/org/apache/struts/struts2-core/2.5.3-SNAPSHOT/struts2-core-2.5.3-20160727.061756-13.jar.
Return code is: 502, ReasonPhrase: Proxy Error. -> [Help 1]
[ERROR] 
[ERROR] To see the full stack trace of the errors, re-run Maven with the -e switch.
[ERROR] Re-run Maven using the -X switch to enable full debug logging.
[ERROR] 
[ERROR] For more information about the errors and possible solutions, please read the following
articles:
[ERROR] [Help 1] http://cwiki.apache.org/confluence/display/MAVEN/MojoExecutionException
[ERROR] 
[ERROR] After correcting the problems, you can resume the build with the command
[ERROR]   mvn <goals> -rf :struts2-core
[JENKINS] Archiving <https://builds.apache.org/job/Struts-JDK7-master/ws/plugins/pell-multipart/pom.xml>
to org.apache.struts/struts2-pell-multipart-plugin/2.5.3-SNAPSHOT/struts2-pell-multipart-plugin-2.5.3-SNAPSHOT.pom
[JENKINS] Archiving <https://builds.apache.org/job/Struts-JDK7-master/ws/plugins/plexus/pom.xml>
to org.apache.struts/struts2-plexus-plugin/2.5.3-SNAPSHOT/struts2-plexus-plugin-2.5.3-SNAPSHOT.pom
[JENKINS] Archiving <https://builds.apache.org/job/Struts-JDK7-master/ws/plugins/jfreechart/pom.xml>
to org.apache.struts/struts2-jfreechart-plugin/2.5.3-SNAPSHOT/struts2-jfreechart-plugin-2.5.3-SNAPSHOT.pom
[JENKINS] Archiving <https://builds.apache.org/job/Struts-JDK7-master/ws/plugins/sitemesh/pom.xml>
to org.apache.struts/struts2-sitemesh-plugin/2.5.3-SNAPSHOT/struts2-sitemesh-plugin-2.5.3-SNAPSHOT.pom
[JENKINS] Archiving <https://builds.apache.org/job/Struts-JDK7-master/ws/plugins/config-browser/pom.xml>
to org.apache.struts/struts2-config-browser-plugin/2.5.3-SNAPSHOT/struts2-config-browser-plugin-2.5.3-SNAPSHOT.pom
[JENKINS] Archiving <https://builds.apache.org/job/Struts-JDK7-master/ws/bundles/demo/pom.xml>
to org.apache.struts/struts2-osgi-demo-bundle/2.5.3-SNAPSHOT/struts2-osgi-demo-bundle-2.5.3-SNAPSHOT.pom
[JENKINS] Archiving <https://builds.apache.org/job/Struts-JDK7-master/ws/plugins/portlet-tiles/pom.xml>
to org.apache.struts/struts2-portlet-tiles-plugin/2.5.3-SNAPSHOT/struts2-portlet-tiles-plugin-2.5.3-SNAPSHOT.pom
[JENKINS] Archiving <https://builds.apache.org/job/Struts-JDK7-master/ws/plugins/jasperreports/pom.xml>
to org.apache.struts/struts2-jasperreports-plugin/2.5.3-SNAPSHOT/struts2-jasperreports-plugin-2.5.3-SNAPSHOT.pom
[JENKINS] Archiving <https://builds.apache.org/job/Struts-JDK7-master/ws/plugins/oval/pom.xml>
to org.apache.struts/struts2-oval-plugin/2.5.3-SNAPSHOT/struts2-oval-plugin-2.5.3-SNAPSHOT.pom
[JENKINS] Archiving <https://builds.apache.org/job/Struts-JDK7-master/ws/plugins/gxp/pom.xml>
to org.apache.struts/struts2-gxp-plugin/2.5.3-SNAPSHOT/struts2-gxp-plugin-2.5.3-SNAPSHOT.pom
[JENKINS] Archiving <https://builds.apache.org/job/Struts-JDK7-master/ws/plugins/convention/pom.xml>
to org.apache.struts/struts2-convention-plugin/2.5.3-SNAPSHOT/struts2-convention-plugin-2.5.3-SNAPSHOT.pom
[JENKINS] Archiving <https://builds.apache.org/job/Struts-JDK7-master/ws/bundles/pom.xml>
to org.apache.struts/struts2-osgi-bundles/2.5.3-SNAPSHOT/struts2-osgi-bundles-2.5.3-SNAPSHOT.pom
[JENKINS] Archiving <https://builds.apache.org/job/Struts-JDK7-master/ws/pom.xml> to
org.apache.struts/struts2-parent/2.5.3-SNAPSHOT/struts2-parent-2.5.3-SNAPSHOT.pom
[JENKINS] Archiving <https://builds.apache.org/job/Struts-JDK7-master/ws/target/struts2-parent-2.5.3-SNAPSHOT-site.xml>
to org.apache.struts/struts2-parent/2.5.3-20160727.061445-13/struts2-parent-2.5.3-20160727.061445-13-site.xml
[JENKINS] Archiving <https://builds.apache.org/job/Struts-JDK7-master/ws/plugins/osgi/pom.xml>
to org.apache.struts/struts2-osgi-plugin/2.5.3-SNAPSHOT/struts2-osgi-plugin-2.5.3-SNAPSHOT.pom
[JENKINS] Archiving <https://builds.apache.org/job/Struts-JDK7-master/ws/assembly/pom.xml>
to org.apache.struts/struts2-assembly/2.5.3-SNAPSHOT/struts2-assembly-2.5.3-SNAPSHOT.pom
[JENKINS] Archiving <https://builds.apache.org/job/Struts-JDK7-master/ws/apps/showcase/pom.xml>
to org.apache.struts/struts2-showcase/2.5.3-SNAPSHOT/struts2-showcase-2.5.3-SNAPSHOT.pom
[JENKINS] Archiving <https://builds.apache.org/job/Struts-JDK7-master/ws/plugins/cdi/pom.xml>
to org.apache.struts/struts2-cdi-plugin/2.5.3-SNAPSHOT/struts2-cdi-plugin-2.5.3-SNAPSHOT.pom
[JENKINS] Archiving <https://builds.apache.org/job/Struts-JDK7-master/ws/plugins/rest/pom.xml>
to org.apache.struts/struts2-rest-plugin/2.5.3-SNAPSHOT/struts2-rest-plugin-2.5.3-SNAPSHOT.pom
[JENKINS] Archiving <https://builds.apache.org/job/Struts-JDK7-master/ws/core/pom.xml>
to org.apache.struts/struts2-core/2.5.3-SNAPSHOT/struts2-core-2.5.3-SNAPSHOT.pom
[JENKINS] Archiving <https://builds.apache.org/job/Struts-JDK7-master/ws/core/target/struts2-core-2.5.3-SNAPSHOT.jar>
to org.apache.struts/struts2-core/2.5.3-SNAPSHOT/struts2-core-2.5.3-SNAPSHOT.jar
[JENKINS] Archiving <https://builds.apache.org/job/Struts-JDK7-master/ws/core/target/struts2-core-2.5.3-SNAPSHOT-sources.jar>
to org.apache.struts/struts2-core/2.5.3-SNAPSHOT/struts2-core-2.5.3-SNAPSHOT-sources.jar
[JENKINS] Archiving <https://builds.apache.org/job/Struts-JDK7-master/ws/core/target/struts2-core-2.5.3-SNAPSHOT-javadoc.jar>
to org.apache.struts/struts2-core/2.5.3-SNAPSHOT/struts2-core-2.5.3-SNAPSHOT-javadoc.jar
[JENKINS] Archiving <https://builds.apache.org/job/Struts-JDK7-master/ws/plugins/tiles/pom.xml>
to org.apache.struts/struts2-tiles-plugin/2.5.3-SNAPSHOT/struts2-tiles-plugin-2.5.3-SNAPSHOT.pom
[JENKINS] Archiving <https://builds.apache.org/job/Struts-JDK7-master/ws/bom/pom.xml>
to org.apache.struts/struts2-bom/2.5.3-SNAPSHOT/struts2-bom-2.5.3-SNAPSHOT.pom
[JENKINS] Archiving <https://builds.apache.org/job/Struts-JDK7-master/ws/plugins/embeddedjsp/pom.xml>
to org.apache.struts/struts2-embeddedjsp-plugin/2.5.3-SNAPSHOT/struts2-embeddedjsp-plugin-2.5.3-SNAPSHOT.pom
[JENKINS] Archiving <https://builds.apache.org/job/Struts-JDK7-master/ws/plugins/pom.xml>
to org.apache.struts/struts2-plugins/2.5.3-SNAPSHOT/struts2-plugins-2.5.3-SNAPSHOT.pom
[JENKINS] Archiving <https://builds.apache.org/job/Struts-JDK7-master/ws/apps/rest-showcase/pom.xml>
to org.apache.struts/struts2-rest-showcase/2.5.3-SNAPSHOT/struts2-rest-showcase-2.5.3-SNAPSHOT.pom
[JENKINS] Archiving <https://builds.apache.org/job/Struts-JDK7-master/ws/plugins/javatemplates/pom.xml>
to org.apache.struts/struts2-javatemplates-plugin/2.5.3-SNAPSHOT/struts2-javatemplates-plugin-2.5.3-SNAPSHOT.pom
[JENKINS] Archiving <https://builds.apache.org/job/Struts-JDK7-master/ws/bundles/admin/pom.xml>
to org.apache.struts/struts2-osgi-admin-bundle/2.5.3-SNAPSHOT/struts2-osgi-admin-bundle-2.5.3-SNAPSHOT.pom
[JENKINS] Archiving <https://builds.apache.org/job/Struts-JDK7-master/ws/apps/pom.xml>
to org.apache.struts/struts2-apps/2.5.3-SNAPSHOT/struts2-apps-2.5.3-SNAPSHOT.pom
[JENKINS] Archiving <https://builds.apache.org/job/Struts-JDK7-master/ws/plugins/sitegraph/pom.xml>
to org.apache.struts/struts2-sitegraph-plugin/2.5.3-SNAPSHOT/struts2-sitegraph-plugin-2.5.3-SNAPSHOT.pom
[JENKINS] Archiving <https://builds.apache.org/job/Struts-JDK7-master/ws/plugins/testng/pom.xml>
to org.apache.struts/struts2-testng-plugin/2.5.3-SNAPSHOT/struts2-testng-plugin-2.5.3-SNAPSHOT.pom
[JENKINS] Archiving <https://builds.apache.org/job/Struts-JDK7-master/ws/plugins/json/pom.xml>
to org.apache.struts/struts2-json-plugin/2.5.3-SNAPSHOT/struts2-json-plugin-2.5.3-SNAPSHOT.pom
[JENKINS] Archiving <https://builds.apache.org/job/Struts-JDK7-master/ws/plugins/junit/pom.xml>
to org.apache.struts/struts2-junit-plugin/2.5.3-SNAPSHOT/struts2-junit-plugin-2.5.3-SNAPSHOT.pom
[JENKINS] Archiving <https://builds.apache.org/job/Struts-JDK7-master/ws/plugins/dwr/pom.xml>
to org.apache.struts/struts2-dwr-plugin/2.5.3-SNAPSHOT/struts2-dwr-plugin-2.5.3-SNAPSHOT.pom
[JENKINS] Archiving <https://builds.apache.org/job/Struts-JDK7-master/ws/plugins/bean-validation/pom.xml>
to org.apache.struts/struts2-bean-validation-plugin/2.5.3-SNAPSHOT/struts2-bean-validation-plugin-2.5.3-SNAPSHOT.pom
[JENKINS] Archiving <https://builds.apache.org/job/Struts-JDK7-master/ws/plugins/portlet/pom.xml>
to org.apache.struts/struts2-portlet-plugin/2.5.3-SNAPSHOT/struts2-portlet-plugin-2.5.3-SNAPSHOT.pom
[JENKINS] Archiving <https://builds.apache.org/job/Struts-JDK7-master/ws/plugins/spring/pom.xml>
to org.apache.struts/struts2-spring-plugin/2.5.3-SNAPSHOT/struts2-spring-plugin-2.5.3-SNAPSHOT.pom
[locks-and-latches] Releasing all the locks
[locks-and-latches] All the locks released
channel stopped

---------------------------------------------------------------------
To unsubscribe, e-mail: dev-unsubscribe@struts.apache.org
For additional commands, e-mail: dev-help@struts.apache.org


Mime
View raw message