struts-dev mailing list archives

Site index · List index
Message view « Date » · « Thread »
Top « Date » · « Thread »
From Apache Jenkins Server <jenk...@builds.apache.org>
Subject Build failed in Jenkins: Struts-examples-JDK8-master #29
Date Sat, 21 May 2016 14:33:39 GMT
See <https://builds.apache.org/job/Struts-examples-JDK8-master/29/changes>

Changes:

[post] Switch to latest stable struts 2.5 release

[post] Update rest angular example

------------------------------------------
[...truncated 2080 lines...]
[INFO] Copying 2 resources
[INFO] 
[INFO] --- maven-compiler-plugin:3.3:compile (default-compile) @ wildcard-method-selection
---
[INFO] Changes detected - recompiling the module!
[INFO] Compiling 3 source files to <https://builds.apache.org/job/Struts-examples-JDK8-master/ws/wildcard-method-selection/target/classes>
[INFO] 
[INFO] --- maven-resources-plugin:2.6:testResources (default-testResources) @ wildcard-method-selection
---
[INFO] Using 'UTF-8' encoding to copy filtered resources.
[INFO] skip non existing resourceDirectory <https://builds.apache.org/job/Struts-examples-JDK8-master/ws/wildcard-method-selection/src/test/resources>
[INFO] 
[INFO] --- maven-compiler-plugin:3.3:testCompile (default-testCompile) @ wildcard-method-selection
---
[INFO] No sources to compile
[INFO] 
[INFO] --- maven-surefire-plugin:2.12.4:test (default-test) @ wildcard-method-selection ---
[INFO] No tests to run.
[JENKINS] Recording test results
[INFO] 
[INFO] --- maven-war-plugin:2.2:war (default-war) @ wildcard-method-selection ---
[INFO] Packaging webapp
[INFO] Assembling webapp [wildcard-method-selection] in [<https://builds.apache.org/job/Struts-examples-JDK8-master/ws/wildcard-method-selection/target/wildcard-method-selection]>
[INFO] Processing war project
[INFO] Copying webapp resources [<https://builds.apache.org/job/Struts-examples-JDK8-master/ws/wildcard-method-selection/src/main/webapp]>
[INFO] Webapp assembled in [19 msecs]
[INFO] Building war: <https://builds.apache.org/job/Struts-examples-JDK8-master/ws/wildcard-method-selection/target/wildcard-method-selection.war>
[INFO] WEB-INF/web.xml already added, skipping
[INFO]                                                                         
[INFO] ------------------------------------------------------------------------
[INFO] Building Message Store 1.0-SNAPSHOT
[INFO] ------------------------------------------------------------------------
[INFO] 
[INFO] --- maven-resources-plugin:2.6:resources (default-resources) @ message-store ---
[INFO] Using 'UTF-8' encoding to copy filtered resources.
[INFO] Copying 3 resources
[INFO] 
[INFO] --- maven-compiler-plugin:3.3:compile (default-compile) @ message-store ---
[INFO] Changes detected - recompiling the module!
[INFO] Compiling 2 source files to <https://builds.apache.org/job/Struts-examples-JDK8-master/ws/message-store/target/classes>
[INFO] 
[INFO] --- maven-resources-plugin:2.6:testResources (default-testResources) @ message-store
---
[INFO] Using 'UTF-8' encoding to copy filtered resources.
[INFO] skip non existing resourceDirectory <https://builds.apache.org/job/Struts-examples-JDK8-master/ws/message-store/src/test/resources>
[INFO] 
[INFO] --- maven-compiler-plugin:3.3:testCompile (default-testCompile) @ message-store ---
[INFO] No sources to compile
[INFO] 
[INFO] --- maven-surefire-plugin:2.12.4:test (default-test) @ message-store ---
[INFO] No tests to run.
[JENKINS] Recording test results
[INFO] 
[INFO] --- maven-war-plugin:2.2:war (default-war) @ message-store ---
[INFO] Packaging webapp
[INFO] Assembling webapp [message-store] in [<https://builds.apache.org/job/Struts-examples-JDK8-master/ws/message-store/target/message-store-1.0-SNAPSHOT]>
[INFO] Processing war project
[INFO] Copying webapp resources [<https://builds.apache.org/job/Struts-examples-JDK8-master/ws/message-store/src/main/webapp]>
[INFO] Webapp assembled in [17 msecs]
[INFO] Building war: <https://builds.apache.org/job/Struts-examples-JDK8-master/ws/message-store/target/message-store-1.0-SNAPSHOT.war>
[INFO] WEB-INF/web.xml already added, skipping
[INFO]                                                                         
[INFO] ------------------------------------------------------------------------
[INFO] Building Custom Type Convertion 1.0.0
[INFO] ------------------------------------------------------------------------
[INFO] 
[INFO] --- maven-resources-plugin:2.6:resources (default-resources) @ type-conversion ---
[INFO] Using 'UTF-8' encoding to copy filtered resources.
[INFO] Copying 5 resources
[INFO] 
[INFO] --- maven-compiler-plugin:3.3:compile (default-compile) @ type-conversion ---
[INFO] Changes detected - recompiling the module!
[INFO] Compiling 4 source files to <https://builds.apache.org/job/Struts-examples-JDK8-master/ws/type-conversion/target/classes>
[INFO] <https://builds.apache.org/job/Struts-examples-JDK8-master/ws/type-conversion/src/main/java/org/apache/struts/example/Theme.java>:
Some input files use or override a deprecated API.
[INFO] <https://builds.apache.org/job/Struts-examples-JDK8-master/ws/type-conversion/src/main/java/org/apache/struts/example/Theme.java>:
Recompile with -Xlint:deprecation for details.
[INFO] 
[INFO] --- maven-resources-plugin:2.6:testResources (default-testResources) @ type-conversion
---
[INFO] Using 'UTF-8' encoding to copy filtered resources.
[INFO] skip non existing resourceDirectory <https://builds.apache.org/job/Struts-examples-JDK8-master/ws/type-conversion/src/test/resources>
[INFO] 
[INFO] --- maven-compiler-plugin:3.3:testCompile (default-testCompile) @ type-conversion ---
[INFO] No sources to compile
[INFO] 
[INFO] --- maven-surefire-plugin:2.12.4:test (default-test) @ type-conversion ---
[INFO] No tests to run.
[JENKINS] Recording test results
[INFO] 
[INFO] --- maven-war-plugin:2.2:war (default-war) @ type-conversion ---
[INFO] Packaging webapp
[INFO] Assembling webapp [type-conversion] in [<https://builds.apache.org/job/Struts-examples-JDK8-master/ws/type-conversion/target/type-conversion-1.0.0]>
[INFO] Processing war project
[INFO] Copying webapp resources [<https://builds.apache.org/job/Struts-examples-JDK8-master/ws/type-conversion/src/main/webapp]>
[INFO] Webapp assembled in [18 msecs]
[INFO] Building war: <https://builds.apache.org/job/Struts-examples-JDK8-master/ws/type-conversion/target/type-conversion-1.0.0.war>
[INFO] WEB-INF/web.xml already added, skipping
[INFO]                                                                         
[INFO] ------------------------------------------------------------------------
[INFO] Building Wildcard RegEx pattern matching 1
[INFO] ------------------------------------------------------------------------
[WARNING] The POM for org.apache.struts:struts2-core:jar:2.3.25-SNAPSHOT is missing, no dependency
information available
[INFO] ------------------------------------------------------------------------
[INFO] Reactor Summary:
[INFO] 
[INFO] Struts 2 Examples ................................. SUCCESS [  0.728 s]
[INFO] Annotations with Convention Plugin ................ SUCCESS [  7.810 s]
[INFO] Basic Struts2 Example ............................. SUCCESS [  1.269 s]
[INFO] Bean Validation ................................... SUCCESS [  2.110 s]
[INFO] Struts 2 Blank Webapp ............................. SUCCESS [ 12.016 s]
[INFO] Coding Struts 2 Action ............................ SUCCESS [  1.455 s]
[INFO] Control Tags ...................................... SUCCESS [  1.465 s]
[INFO] Debugging Struts .................................. SUCCESS [  2.175 s]
[INFO] Exception handling ................................ SUCCESS [  1.257 s]
[INFO] Exclude Parameters ................................ SUCCESS [  1.595 s]
[INFO] Form Processing ................................... SUCCESS [  1.488 s]
[INFO] Form Tags ......................................... SUCCESS [  1.295 s]
[INFO] Form validation ................................... SUCCESS [  1.178 s]
[INFO] XML based form validation ......................... SUCCESS [  1.159 s]
[INFO] Hello World Struts 2 Example Application .......... SUCCESS [  1.232 s]
[INFO] http-session ...................................... SUCCESS [  1.185 s]
[INFO] Struts 2 Interceptors ............................. SUCCESS [  1.257 s]
[INFO] Struts 2 JBoss Blank Webapp ....................... SUCCESS [  3.260 s]
[INFO] Struts 2 Mail Reader Webapp ....................... SUCCESS [  1.621 s]
[INFO] Message resource .................................. SUCCESS [  1.452 s]
[INFO] Preparable Interface .............................. SUCCESS [  1.361 s]
[INFO] REST to Action Mapper Example Application ......... SUCCESS [  1.292 s]
[INFO] REST Plugin based application with AngularJS frontend  SUCCESS [ 10.991 s]
[INFO] Struts2 with Spring Integration ................... SUCCESS [  1.921 s]
[INFO] Struts Tiles Example .............................. SUCCESS [  2.068 s]
[INFO] Struts 2 Themes ................................... SUCCESS [  1.700 s]
[INFO] Struts 2 Themes Override .......................... SUCCESS [  1.460 s]
[INFO] Using Struts 2 Tags ............................... SUCCESS [  1.225 s]
[INFO] Unit Testing ...................................... SUCCESS [  4.690 s]
[INFO] Wildcard Method Selection ......................... SUCCESS [  1.278 s]
[INFO] Message Store ..................................... SUCCESS [  1.188 s]
[INFO] Custom Type Convertion ............................ SUCCESS [  1.253 s]
[INFO] Wildcard RegEx pattern matching ................... FAILURE [  0.333 s]
[INFO] Unknown handler ................................... SKIPPED
[INFO] ------------------------------------------------------------------------
[INFO] BUILD FAILURE
[INFO] ------------------------------------------------------------------------
[INFO] Total time: 02:04 min
[INFO] Finished at: 2016-05-21T14:31:55+00:00
[INFO] Final Memory: 52M/308M
[INFO] ------------------------------------------------------------------------
Waiting for Jenkins to finish collecting data
[ERROR] Failed to execute goal on project wildcard-regex: Could not resolve dependencies for
project org.apache.struts:wildcard-regex:war:1: Could not find artifact org.apache.struts:struts2-core:jar:2.3.25-SNAPSHOT
-> [Help 1]
[ERROR] 
[ERROR] To see the full stack trace of the errors, re-run Maven with the -e switch.
[ERROR] Re-run Maven using the -X switch to enable full debug logging.
[ERROR] 
[ERROR] For more information about the errors and possible solutions, please read the following
articles:
[ERROR] [Help 1] http://cwiki.apache.org/confluence/display/MAVEN/DependencyResolutionException
[ERROR] 
[ERROR] After correcting the problems, you can resume the build with the command
[ERROR]   mvn <goals> -rf :wildcard-regex
[JENKINS] Archiving <https://builds.apache.org/job/Struts-examples-JDK8-master/ws/form-validation/pom.xml>
to org.apache.struts/form-validation/1.0.0/form-validation-1.0.0.pom
[JENKINS] Archiving <https://builds.apache.org/job/Struts-examples-JDK8-master/ws/form-validation/target/form_validation.war>
to org.apache.struts/form-validation/1.0.0/form-validation-1.0.0.war
Compressed 5.13 MB of artifacts by 34.1% relative to #27
[JENKINS] Archiving <https://builds.apache.org/job/Struts-examples-JDK8-master/ws/restful2actionmapper/pom.xml>
to org.apache.struts/restful2actionmapper/1.0.0/restful2actionmapper-1.0.0.pom
[JENKINS] Archiving <https://builds.apache.org/job/Struts-examples-JDK8-master/ws/restful2actionmapper/target/reststyleactionmapper.war>
to org.apache.struts/restful2actionmapper/1.0.0/restful2actionmapper-1.0.0.war
Compressed 5.12 MB of artifacts by 33.6% relative to #27
[JENKINS] Archiving <https://builds.apache.org/job/Struts-examples-JDK8-master/ws/spring-struts/pom.xml>
to org.apache.struts/spring-struts/1.0.0/spring-struts-1.0.0.pom
[JENKINS] Archiving <https://builds.apache.org/job/Struts-examples-JDK8-master/ws/spring-struts/target/spring-struts.war>
to org.apache.struts/spring-struts/1.0.0/spring-struts-1.0.0.war
Compressed 8.65 MB of artifacts by 58.9% relative to #27
[JENKINS] Archiving <https://builds.apache.org/job/Struts-examples-JDK8-master/ws/basic-struts/pom.xml>
to org.apache.struts/basic-struts/1.0.0/basic-struts-1.0.0.pom
[JENKINS] Archiving <https://builds.apache.org/job/Struts-examples-JDK8-master/ws/basic-struts/target/basic-struts.war>
to org.apache.struts/basic-struts/1.0.0/basic-struts-1.0.0.war
Compressed 5.12 MB of artifacts by 33.6% relative to #27
[JENKINS] Archiving <https://builds.apache.org/job/Struts-examples-JDK8-master/ws/themes-override/pom.xml>
to org.apache.struts/themes-override/1.0.0/themes-override-1.0.0.pom
[JENKINS] Archiving <https://builds.apache.org/job/Struts-examples-JDK8-master/ws/themes-override/target/themes-override.war>
to org.apache.struts/themes-override/1.0.0/themes-override-1.0.0.war
Compressed 5.19 MB of artifacts by 33.1% relative to #27
[JENKINS] Archiving <https://builds.apache.org/job/Struts-examples-JDK8-master/ws/http-session/pom.xml>
to org.apache.struts/http-session/1.0.0/http-session-1.0.0.pom
[JENKINS] Archiving <https://builds.apache.org/job/Struts-examples-JDK8-master/ws/http-session/target/http-session.war>
to org.apache.struts/http-session/1.0.0/http-session-1.0.0.war
Compressed 5.12 MB of artifacts by 34.2% relative to #27
[JENKINS] Archiving <https://builds.apache.org/job/Struts-examples-JDK8-master/ws/form-tags/pom.xml>
to org.apache.struts/form-tags/1.0.0/form-tags-1.0.0.pom
[JENKINS] Archiving <https://builds.apache.org/job/Struts-examples-JDK8-master/ws/form-tags/target/form-tags.war>
to org.apache.struts/form-tags/1.0.0/form-tags-1.0.0.war
Compressed 5.13 MB of artifacts by 34.1% relative to #27
[JENKINS] Archiving <https://builds.apache.org/job/Struts-examples-JDK8-master/ws/wildcard-method-selection/pom.xml>
to org.apache.struts/wildcard-method-selection/1.0.0/wildcard-method-selection-1.0.0.pom
[JENKINS] Archiving <https://builds.apache.org/job/Struts-examples-JDK8-master/ws/wildcard-method-selection/target/wildcard-method-selection.war>
to org.apache.struts/wildcard-method-selection/1.0.0/wildcard-method-selection-1.0.0.war
Compressed 5.13 MB of artifacts by 34.1% relative to #27
[JENKINS] Archiving <https://builds.apache.org/job/Struts-examples-JDK8-master/ws/message-store/pom.xml>
to org.apache.struts/message-store/1.0-SNAPSHOT/message-store-1.0-SNAPSHOT.pom
[JENKINS] Archiving <https://builds.apache.org/job/Struts-examples-JDK8-master/ws/message-store/target/message-store-1.0-SNAPSHOT.war>
to org.apache.struts/message-store/1.0-SNAPSHOT/message-store-1.0-SNAPSHOT.war
Compressed 5.12 MB of artifacts by 33.6% relative to #27
[JENKINS] Archiving <https://builds.apache.org/job/Struts-examples-JDK8-master/ws/form-xml-validation/pom.xml>
to org.apache.struts/form-xml-validation/1.0.0/form-xml-validation-1.0.0.pom
[JENKINS] Archiving <https://builds.apache.org/job/Struts-examples-JDK8-master/ws/form-xml-validation/target/form-xml-validation.war>
to org.apache.struts/form-xml-validation/1.0.0/form-xml-validation-1.0.0.war
Compressed 5.13 MB of artifacts by 34.1% relative to #27
[JENKINS] Archiving <https://builds.apache.org/job/Struts-examples-JDK8-master/ws/exception-handling/pom.xml>
to org.apache.struts/exception-handling/1.0.0/exception-handling-1.0.0.pom
[JENKINS] Archiving <https://builds.apache.org/job/Struts-examples-JDK8-master/ws/exception-handling/target/exception-handling.war>
to org.apache.struts/exception-handling/1.0.0/exception-handling-1.0.0.war
Compressed 5.13 MB of artifacts by 34.1% relative to #27
[JENKINS] Archiving <https://builds.apache.org/job/Struts-examples-JDK8-master/ws/using-tags/pom.xml>
to org.apache.struts/using-tags/1.0.0/using-tags-1.0.0.pom
[JENKINS] Archiving <https://builds.apache.org/job/Struts-examples-JDK8-master/ws/using-tags/target/using-tags.war>
to org.apache.struts/using-tags/1.0.0/using-tags-1.0.0.war
Compressed 5.12 MB of artifacts by 34.2% relative to #27
[JENKINS] Archiving <https://builds.apache.org/job/Struts-examples-JDK8-master/ws/annotations/pom.xml>
to org.apache.struts/annotations/1.0.0/annotations-1.0.0.pom
[JENKINS] Archiving <https://builds.apache.org/job/Struts-examples-JDK8-master/ws/annotations/target/annotations.war>
to org.apache.struts/annotations/1.0.0/annotations-1.0.0.war
Compressed 5.19 MB of artifacts by 33.8% relative to #27
[JENKINS] Archiving <https://builds.apache.org/job/Struts-examples-JDK8-master/ws/helloworld/pom.xml>
to org.apache.struts/helloworld/1.0.0/helloworld-1.0.0.pom
[JENKINS] Archiving <https://builds.apache.org/job/Struts-examples-JDK8-master/ws/helloworld/target/hello-world.war>
to org.apache.struts/helloworld/1.0.0/helloworld-1.0.0.war
Compressed 5.12 MB of artifacts by 33.6% relative to #27
[JENKINS] Archiving <https://builds.apache.org/job/Struts-examples-JDK8-master/ws/tiles/pom.xml>
to org.apache.struts/tiles/1.0.0/tiles-1.0.0.pom
[JENKINS] Archiving <https://builds.apache.org/job/Struts-examples-JDK8-master/ws/tiles/target/tiles-1.0.0.war>
to org.apache.struts/tiles/1.0.0/tiles-1.0.0.war
Compressed 5.92 MB of artifacts by 34.8% relative to #27
[JENKINS] Archiving <https://builds.apache.org/job/Struts-examples-JDK8-master/ws/wildcard-regex/pom.xml>
to org.apache.struts/wildcard-regex/1/wildcard-regex-1.pom
[JENKINS] Archiving <https://builds.apache.org/job/Struts-examples-JDK8-master/ws/message-resource/pom.xml>
to org.apache.struts/message-resource/1.0.0/message-resource-1.0.0.pom
[JENKINS] Archiving <https://builds.apache.org/job/Struts-examples-JDK8-master/ws/message-resource/target/message-resource.war>
to org.apache.struts/message-resource/1.0.0/message-resource-1.0.0.war
Compressed 5.13 MB of artifacts by 34.1% relative to #27
[JENKINS] Archiving <https://builds.apache.org/job/Struts-examples-JDK8-master/ws/jboss-blank/pom.xml>
to org.apache.struts/struts2-jboss-blank/1.0.0/struts2-jboss-blank-1.0.0.pom
[JENKINS] Archiving <https://builds.apache.org/job/Struts-examples-JDK8-master/ws/jboss-blank/target/struts2-jboss-blank-1.0.0.war>
to org.apache.struts/struts2-jboss-blank/1.0.0/struts2-jboss-blank-1.0.0.war
Compressed 5.13 MB of artifacts by 34.1% relative to #27
[JENKINS] Archiving <https://builds.apache.org/job/Struts-examples-JDK8-master/ws/interceptors/pom.xml>
to org.apache.struts/interceptors/1.0.0/interceptors-1.0.0.pom
[JENKINS] Archiving <https://builds.apache.org/job/Struts-examples-JDK8-master/ws/interceptors/target/interceptors.war>
to org.apache.struts/interceptors/1.0.0/interceptors-1.0.0.war
Compressed 5.12 MB of artifacts by 34.2% relative to #27
[JENKINS] Archiving <https://builds.apache.org/job/Struts-examples-JDK8-master/ws/preparable-interface/pom.xml>
to org.apache.struts/preparable-interface/1.0.0/preparable-interface-1.0.0.pom
[JENKINS] Archiving <https://builds.apache.org/job/Struts-examples-JDK8-master/ws/preparable-interface/target/preparable-interface.war>
to org.apache.struts/preparable-interface/1.0.0/preparable-interface-1.0.0.war
Compressed 5.13 MB of artifacts by 34.1% relative to #27
[JENKINS] Archiving <https://builds.apache.org/job/Struts-examples-JDK8-master/ws/unit-testing/pom.xml>
to org.apache.struts/unit-testing/1.0.0/unit-testing-1.0.0.pom
[JENKINS] Archiving <https://builds.apache.org/job/Struts-examples-JDK8-master/ws/unit-testing/target/unit-testing.war>
to org.apache.struts/unit-testing/1.0.0/unit-testing-1.0.0.war
Compressed 5.17 MB of artifacts by 33.9% relative to #27
[JENKINS] Archiving <https://builds.apache.org/job/Struts-examples-JDK8-master/ws/unknown-handler/pom.xml>
to org.apache.org/unknown-handler/1.0.0/unknown-handler-1.0.0.pom
[JENKINS] Archiving <https://builds.apache.org/job/Struts-examples-JDK8-master/ws/control-tags/pom.xml>
to org.apache.struts/control-tags/1.0.0/control-tags-1.0.0.pom
[JENKINS] Archiving <https://builds.apache.org/job/Struts-examples-JDK8-master/ws/control-tags/target/control-tags.war>
to org.apache.struts/control-tags/1.0.0/control-tags-1.0.0.war
Compressed 5.13 MB of artifacts by 34.1% relative to #27
[JENKINS] Archiving <https://builds.apache.org/job/Struts-examples-JDK8-master/ws/type-conversion/pom.xml>
to org.apache.struts/type-conversion/1.0.0/type-conversion-1.0.0.pom
[JENKINS] Archiving <https://builds.apache.org/job/Struts-examples-JDK8-master/ws/type-conversion/target/type-conversion-1.0.0.war>
to org.apache.struts/type-conversion/1.0.0/type-conversion-1.0.0.war
Compressed 5.13 MB of artifacts by 34.1% relative to #27
[JENKINS] Archiving <https://builds.apache.org/job/Struts-examples-JDK8-master/ws/bean-validation/pom.xml>
to org.apache.struts/bean-validation/1.0.0/bean-validation-1.0.0.pom
[JENKINS] Archiving <https://builds.apache.org/job/Struts-examples-JDK8-master/ws/bean-validation/target/bean-validation.war>
to org.apache.struts/bean-validation/1.0.0/bean-validation-1.0.0.war
Compressed 6.37 MB of artifacts by 43.7% relative to #27
[JENKINS] Archiving <https://builds.apache.org/job/Struts-examples-JDK8-master/ws/coding-actions/pom.xml>
to org.apache.struts/coding-actions/1.0.0/coding-actions-1.0.0.pom
[JENKINS] Archiving <https://builds.apache.org/job/Struts-examples-JDK8-master/ws/coding-actions/target/coding-actions.war>
to org.apache.struts/coding-actions/1.0.0/coding-actions-1.0.0.war
Compressed 5.12 MB of artifacts by 34.2% relative to #27
[JENKINS] Archiving <https://builds.apache.org/job/Struts-examples-JDK8-master/ws/rest-angular/pom.xml>
to org.apache.struts/rest-angular/1.0.0/rest-angular-1.0.0.pom
[JENKINS] Archiving <https://builds.apache.org/job/Struts-examples-JDK8-master/ws/rest-angular/target/rest-angular-1.0.0.jar>
to org.apache.struts/rest-angular/1.0.0/rest-angular-1.0.0.jar
[JENKINS] Archiving <https://builds.apache.org/job/Struts-examples-JDK8-master/ws/mailreader/pom.xml>
to org.apache.struts/mailreader/1.0.0/mailreader-1.0.0.pom
[JENKINS] Archiving <https://builds.apache.org/job/Struts-examples-JDK8-master/ws/mailreader/target/mailreader-1.0.0.war>
to org.apache.struts/mailreader/1.0.0/mailreader-1.0.0.war
Compressed 5.68 MB of artifacts by 34.6% relative to #27
[JENKINS] Archiving <https://builds.apache.org/job/Struts-examples-JDK8-master/ws/themes/pom.xml>
to org.apache.struts/themes/1.0.0/themes-1.0.0.pom
[JENKINS] Archiving <https://builds.apache.org/job/Struts-examples-JDK8-master/ws/themes/target/themes.war>
to org.apache.struts/themes/1.0.0/themes-1.0.0.war
Compressed 5.13 MB of artifacts by 34.1% relative to #27
[JENKINS] Archiving <https://builds.apache.org/job/Struts-examples-JDK8-master/ws/debugging-struts/pom.xml>
to org.apache.struts/debugging-struts/1.0.0/debugging-struts-1.0.0.pom
[JENKINS] Archiving <https://builds.apache.org/job/Struts-examples-JDK8-master/ws/debugging-struts/target/debugging-struts.war>
to org.apache.struts/debugging-struts/1.0.0/debugging-struts-1.0.0.war
Compressed 5.17 MB of artifacts by 33.9% relative to #27
[JENKINS] Archiving <https://builds.apache.org/job/Struts-examples-JDK8-master/ws/pom.xml>
to org.apache.struts/struts-examples/1.0.0/struts-examples-1.0.0.pom
[JENKINS] Archiving <https://builds.apache.org/job/Struts-examples-JDK8-master/ws/form-processing/pom.xml>
to org.apache.struts/form-processing/1.0.0/form-processing-1.0.0.pom
[JENKINS] Archiving <https://builds.apache.org/job/Struts-examples-JDK8-master/ws/form-processing/target/form-processing.war>
to org.apache.struts/form-processing/1.0.0/form-processing-1.0.0.war
Compressed 5.13 MB of artifacts by 34.1% relative to #27
[JENKINS] Archiving <https://builds.apache.org/job/Struts-examples-JDK8-master/ws/blank/pom.xml>
to org.apache.struts/struts2-blank/1.0.0/struts2-blank-1.0.0.pom
[JENKINS] Archiving <https://builds.apache.org/job/Struts-examples-JDK8-master/ws/blank/target/struts2-blank-1.0.0.war>
to org.apache.struts/struts2-blank/1.0.0/struts2-blank-1.0.0.war
Compressed 5.13 MB of artifacts by 34.1% relative to #27
[JENKINS] Archiving <https://builds.apache.org/job/Struts-examples-JDK8-master/ws/exclude-parameters/pom.xml>
to org.apache.struts/exclude-parameters/1.0.0/exclude-parameters-1.0.0.pom
[JENKINS] Archiving <https://builds.apache.org/job/Struts-examples-JDK8-master/ws/exclude-parameters/target/exclude-parameters.war>
to org.apache.struts/exclude-parameters/1.0.0/exclude-parameters-1.0.0.war
Compressed 5.13 MB of artifacts by 34.1% relative to #27
[locks-and-latches] Releasing all the locks
[locks-and-latches] All the locks released
channel stopped

---------------------------------------------------------------------
To unsubscribe, e-mail: dev-unsubscribe@struts.apache.org
For additional commands, e-mail: dev-help@struts.apache.org


Mime
View raw message