struts-dev mailing list archives

Site index · List index
Message view « Date » · « Thread »
Top « Date » · « Thread »
From Apache Jenkins Server <jenk...@builds.apache.org>
Subject Build failed in Jenkins: Struts-JDK7-pull-request #135
Date Wed, 20 Jan 2016 21:47:23 GMT
See <https://builds.apache.org/job/Struts-JDK7-pull-request/135/changes>

Changes:

[victornsosa] WW-3940 Upgrade to Velocity Tools 2.0

[victornsosa] WW-3940 Upgrade to Velocity Tools 2.0

------------------------------------------
[...truncated 46007 lines...]
[INFO] 
[INFO] --- maven-bundle-plugin:2.1.0:manifest (bundle-manifest) @ struts2-config-browser-plugin
---
[WARNING] Warning in manifest for org.apache.struts:struts2-config-browser-plugin:jar:2.5-SNAPSHOT
: Superfluous export-package instructions: [org.apache, org.apache.struts2, org]
[INFO] 
[INFO] --- maven-resources-plugin:2.6:testResources (default-testResources) @ struts2-config-browser-plugin
---
[INFO] Using 'UTF-8' encoding to copy filtered resources.
[INFO] skip non existing resourceDirectory <https://builds.apache.org/job/Struts-JDK7-pull-request/ws/plugins/config-browser/src/test/resources>
[INFO] Copying 3 resources
[INFO] 
[INFO] --- maven-compiler-plugin:3.3:testCompile (default-testCompile) @ struts2-config-browser-plugin
---
[INFO] No sources to compile
[INFO] 
[INFO] --- maven-surefire-plugin:2.3.1:test (default-test) @ struts2-config-browser-plugin
---
[INFO] Surefire report directory: <https://builds.apache.org/job/Struts-JDK7-pull-request/ws/plugins/config-browser/target/surefire-reports>

-------------------------------------------------------
 T E S T S
-------------------------------------------------------
There are no tests to run.

Results :

Tests run: 0, Failures: 0, Errors: 0, Skipped: 0

[JENKINS] Recording test results
[INFO] 
[INFO] --- maven-jar-plugin:2.5:jar (default-jar) @ struts2-config-browser-plugin ---
[INFO] Building jar: <https://builds.apache.org/job/Struts-JDK7-pull-request/ws/plugins/config-browser/target/struts2-config-browser-plugin-2.5-SNAPSHOT.jar>
[INFO] 
[INFO] >>> maven-source-plugin:2.3:jar (attach-source) @ struts2-config-browser-plugin
>>>
[WARNING] Failed to getClass for org.apache.maven.plugin.source.SourceJarMojo
[INFO] 
[INFO] <<< maven-source-plugin:2.3:jar (attach-source) @ struts2-config-browser-plugin
<<<
[INFO] 
[INFO] --- maven-source-plugin:2.3:jar (attach-source) @ struts2-config-browser-plugin ---
[INFO] Building jar: <https://builds.apache.org/job/Struts-JDK7-pull-request/ws/plugins/config-browser/target/struts2-config-browser-plugin-2.5-SNAPSHOT-sources.jar>
[INFO] 
[INFO] --- maven-site-plugin:3.4:attach-descriptor (attach-descriptor) @ struts2-config-browser-plugin
---
[INFO]                                                                         
[INFO] ------------------------------------------------------------------------
[INFO] Building Struts 2 Sitemesh Plugin 2.5-SNAPSHOT
[INFO] ------------------------------------------------------------------------
[INFO] 
[INFO] --- maven-remote-resources-plugin:1.5:process (default) @ struts2-sitemesh-plugin ---
[INFO] 
[INFO] --- maven-resources-plugin:2.6:resources (default-resources) @ struts2-sitemesh-plugin
---
[INFO] Using 'UTF-8' encoding to copy filtered resources.
[INFO] Copying 4 resources
[INFO] Copying 3 resources
[INFO] 
[INFO] --- maven-compiler-plugin:3.3:compile (default-compile) @ struts2-sitemesh-plugin ---
[INFO] Changes detected - recompiling the module!
[INFO] Compiling 11 source files to <https://builds.apache.org/job/Struts-JDK7-pull-request/ws/plugins/sitemesh/target/classes>
[INFO] <https://builds.apache.org/job/Struts-JDK7-pull-request/ws/plugins/sitemesh/src/main/java/org/apache/struts2/sitemesh/VelocityDecoratorServlet.java>:
Some input files use or override a deprecated API.
[INFO] <https://builds.apache.org/job/Struts-JDK7-pull-request/ws/plugins/sitemesh/src/main/java/org/apache/struts2/sitemesh/VelocityDecoratorServlet.java>:
Recompile with -Xlint:deprecation for details.
[INFO] -------------------------------------------------------------
[ERROR] COMPILATION ERROR : 
[INFO] -------------------------------------------------------------
[ERROR] <https://builds.apache.org/job/Struts-JDK7-pull-request/ws/plugins/sitemesh/src/main/java/org/apache/struts2/sitemesh/VelocityDecoratorServlet.java>:[81,9]
cannot find symbol
  symbol:   method setVelocityEngine(org.apache.velocity.app.VelocityEngine)
  location: class org.apache.struts2.sitemesh.VelocityDecoratorServlet
[ERROR] <https://builds.apache.org/job/Struts-JDK7-pull-request/ws/plugins/sitemesh/src/main/java/org/apache/struts2/sitemesh/VelocityDecoratorServlet.java>:[82,9]
cannot find symbol
  symbol:   variable toolboxManager
  location: class org.apache.struts2.sitemesh.VelocityDecoratorServlet
[ERROR] <https://builds.apache.org/job/Struts-JDK7-pull-request/ws/plugins/sitemesh/src/main/java/org/apache/struts2/sitemesh/VelocityDecoratorServlet.java>:[85,50]
cannot find symbol
  symbol:   variable CONTENT_TYPE
  location: class org.apache.struts2.sitemesh.VelocityDecoratorServlet
[ERROR] <https://builds.apache.org/job/Struts-JDK7-pull-request/ws/plugins/sitemesh/src/main/java/org/apache/struts2/sitemesh/VelocityDecoratorServlet.java>:[85,64]
cannot find symbol
  symbol:   variable DEFAULT_CONTENT_TYPE
  location: class org.apache.struts2.sitemesh.VelocityDecoratorServlet
[ERROR] <https://builds.apache.org/job/Struts-JDK7-pull-request/ws/plugins/sitemesh/src/main/java/org/apache/struts2/sitemesh/VelocityDecoratorServlet.java>:[87,81]
cannot find symbol
  symbol:   variable DEFAULT_OUTPUT_ENCODING
  location: class org.apache.struts2.sitemesh.VelocityDecoratorServlet
[ERROR] <https://builds.apache.org/job/Struts-JDK7-pull-request/ws/plugins/sitemesh/src/main/java/org/apache/struts2/sitemesh/VelocityDecoratorServlet.java>:[91,14]
cannot find symbol
  symbol:   variable DEFAULT_OUTPUT_ENCODING
  location: class org.apache.struts2.sitemesh.VelocityDecoratorServlet
[ERROR] <https://builds.apache.org/job/Struts-JDK7-pull-request/ws/plugins/sitemesh/src/main/java/org/apache/struts2/sitemesh/VelocityDecoratorServlet.java>:[99,17]
cannot find symbol
  symbol:   method getVelocityEngine()
  location: class org.apache.struts2.sitemesh.VelocityDecoratorServlet
[ERROR] <https://builds.apache.org/job/Struts-JDK7-pull-request/ws/plugins/sitemesh/src/main/java/org/apache/struts2/sitemesh/VelocityDecoratorServlet.java>:[103,9]
cannot find symbol
  symbol:   method getVelocityEngine()
  location: class org.apache.struts2.sitemesh.VelocityDecoratorServlet
[ERROR] <https://builds.apache.org/job/Struts-JDK7-pull-request/ws/plugins/sitemesh/src/main/java/org/apache/struts2/sitemesh/VelocityDecoratorServlet.java>:[106,21]
handleRequest(javax.servlet.http.HttpServletRequest,javax.servlet.http.HttpServletResponse,org.apache.velocity.context.Context)
in org.apache.struts2.sitemesh.VelocityDecoratorServlet cannot override handleRequest(javax.servlet.http.HttpServletRequest,javax.servlet.http.HttpServletResponse,org.apache.velocity.context.Context)
in org.apache.velocity.tools.view.VelocityViewServlet
  overridden method does not throw java.lang.Exception
[INFO] 9 errors 
[INFO] -------------------------------------------------------------
[INFO] ------------------------------------------------------------------------
[INFO] Reactor Summary:
[INFO] 
[INFO] Struts 2 Bill of Materials ........................ SUCCESS [  1.798 s]
[INFO] Struts 2 .......................................... SUCCESS [  1.736 s]
[INFO] Struts 2 Core ..................................... SUCCESS [01:33 min]
[INFO] Struts Plugins .................................... SUCCESS [  0.485 s]
[INFO] Struts 2 Spring Plugin ............................ SUCCESS [  2.317 s]
[INFO] Struts 2 Convention Plugin ........................ SUCCESS [  4.548 s]
[INFO] Struts 2 JUnit Plugin ............................. SUCCESS [  5.792 s]
[INFO] Struts 2 Portlet Plugin ........................... SUCCESS [  6.218 s]
[INFO] Struts 2 DWR Plugin ............................... SUCCESS [  1.139 s]
[INFO] Struts 2 Tiles Plugin ............................. SUCCESS [  1.538 s]
[INFO] Struts 2 Portlet Tiles Plugin ..................... SUCCESS [  1.350 s]
[INFO] Struts 2 Webapps .................................. SUCCESS [  0.779 s]
[INFO] Struts 2 Portlet Webapp ........................... SUCCESS [ 23.188 s]
[INFO] Struts 2 Configuration Browser Plugin ............. SUCCESS [  1.214 s]
[INFO] Struts 2 Sitemesh Plugin .......................... FAILURE [  0.473 s]
[INFO] Struts 2 JSON Plugin .............................. SKIPPED
[INFO] Struts 2 Bean Validation Plugin ................... SKIPPED
[INFO] Struts 2 Showcase Webapp .......................... SKIPPED
[INFO] Struts 2 REST Plugin .............................. SKIPPED
[INFO] Struts 2 Rest Showcase Webapp ..................... SKIPPED
[INFO] Struts 2 CDI Plugin ............................... SKIPPED
[INFO] Struts 2 Embedded JSP Plugin ...................... SKIPPED
[INFO] Struts 2 GXP Plugin ............................... SKIPPED
[INFO] Struts 2 Jasper Reports Plugin .................... SKIPPED
[INFO] Struts 2 Java 8 support plugin .................... SKIPPED
[INFO] Struts 2 Java Templates Plugin .................... SKIPPED
[INFO] Struts 2 JFreeChart Plugin ........................ SKIPPED
[INFO] Struts 2 OSGi Plugin .............................. SKIPPED
[INFO] Struts 2 OVal Plugin .............................. SKIPPED
[INFO] Struts 2 Pell Multipart Plugin .................... SKIPPED
[INFO] Struts 2 Plexus Plugin ............................ SKIPPED
[INFO] Struts 2 Sitegraph Plugin ......................... SKIPPED
[INFO] Struts 2 TestNG Plugin ............................ SKIPPED
[INFO] Struts OSGi Bundles ............................... SKIPPED
[INFO] Struts 2 OSGi Admin Bundle ........................ SKIPPED
[INFO] Struts 2 OSGi Demo Bundle ......................... SKIPPED
[INFO] Struts 2 Maven Archetypes ......................... SKIPPED
[INFO] Struts 2 Archetypes - Angular JS .................. SKIPPED
[INFO] Struts 2 Archetypes - Blank ....................... SKIPPED
[INFO] Struts 2 Archetypes - Blank Convention ............ SKIPPED
[INFO] Struts 2 Archetypes - Database Portlet ............ SKIPPED
[INFO] Struts 2 Archetypes - Plugin ...................... SKIPPED
[INFO] Struts 2 Archetypes - Portlet ..................... SKIPPED
[INFO] Struts 2 Archetypes - Starter ..................... SKIPPED
[INFO] ------------------------------------------------------------------------
[INFO] BUILD FAILURE
[INFO] ------------------------------------------------------------------------
[INFO] Total time: 02:41 min
[INFO] Finished at: 2016-01-20T21:47:26+00:00
[INFO] Final Memory: 71M/411M
[INFO] ------------------------------------------------------------------------
[ERROR] Failed to execute goal org.apache.maven.plugins:maven-compiler-plugin:3.3:compile
(default-compile) on project struts2-sitemesh-plugin: Compilation failure: Compilation failure:
[ERROR] <https://builds.apache.org/job/Struts-JDK7-pull-request/ws/plugins/sitemesh/src/main/java/org/apache/struts2/sitemesh/VelocityDecoratorServlet.java>:[81,9]
cannot find symbol
[ERROR] symbol:   method setVelocityEngine(org.apache.velocity.app.VelocityEngine)
[ERROR] location: class org.apache.struts2.sitemesh.VelocityDecoratorServlet
[ERROR] <https://builds.apache.org/job/Struts-JDK7-pull-request/ws/plugins/sitemesh/src/main/java/org/apache/struts2/sitemesh/VelocityDecoratorServlet.java>:[82,9]
cannot find symbol
[ERROR] symbol:   variable toolboxManager
[ERROR] location: class org.apache.struts2.sitemesh.VelocityDecoratorServlet
[ERROR] <https://builds.apache.org/job/Struts-JDK7-pull-request/ws/plugins/sitemesh/src/main/java/org/apache/struts2/sitemesh/VelocityDecoratorServlet.java>:[85,50]
cannot find symbol
[ERROR] symbol:   variable CONTENT_TYPE
[ERROR] location: class org.apache.struts2.sitemesh.VelocityDecoratorServlet
[ERROR] <https://builds.apache.org/job/Struts-JDK7-pull-request/ws/plugins/sitemesh/src/main/java/org/apache/struts2/sitemesh/VelocityDecoratorServlet.java>:[85,64]
cannot find symbol
[ERROR] symbol:   variable DEFAULT_CONTENT_TYPE
[ERROR] location: class org.apache.struts2.sitemesh.VelocityDecoratorServlet
[ERROR] <https://builds.apache.org/job/Struts-JDK7-pull-request/ws/plugins/sitemesh/src/main/java/org/apache/struts2/sitemesh/VelocityDecoratorServlet.java>:[87,81]
cannot find symbol
[ERROR] symbol:   variable DEFAULT_OUTPUT_ENCODING
[ERROR] location: class org.apache.struts2.sitemesh.VelocityDecoratorServlet
[ERROR] <https://builds.apache.org/job/Struts-JDK7-pull-request/ws/plugins/sitemesh/src/main/java/org/apache/struts2/sitemesh/VelocityDecoratorServlet.java>:[91,14]
cannot find symbol
[ERROR] symbol:   variable DEFAULT_OUTPUT_ENCODING
[ERROR] location: class org.apache.struts2.sitemesh.VelocityDecoratorServlet
[ERROR] <https://builds.apache.org/job/Struts-JDK7-pull-request/ws/plugins/sitemesh/src/main/java/org/apache/struts2/sitemesh/VelocityDecoratorServlet.java>:[99,17]
cannot find symbol
[ERROR] symbol:   method getVelocityEngine()
[ERROR] location: class org.apache.struts2.sitemesh.VelocityDecoratorServlet
[ERROR] <https://builds.apache.org/job/Struts-JDK7-pull-request/ws/plugins/sitemesh/src/main/java/org/apache/struts2/sitemesh/VelocityDecoratorServlet.java>:[103,9]
cannot find symbol
[ERROR] symbol:   method getVelocityEngine()
[ERROR] location: class org.apache.struts2.sitemesh.VelocityDecoratorServlet
[ERROR] <https://builds.apache.org/job/Struts-JDK7-pull-request/ws/plugins/sitemesh/src/main/java/org/apache/struts2/sitemesh/VelocityDecoratorServlet.java>:[106,21]
handleRequest(javax.servlet.http.HttpServletRequest,javax.servlet.http.HttpServletResponse,org.apache.velocity.context.Context)
in org.apache.struts2.sitemesh.VelocityDecoratorServlet cannot override handleRequest(javax.servlet.http.HttpServletRequest,javax.servlet.http.HttpServletResponse,org.apache.velocity.context.Context)
in org.apache.velocity.tools.view.VelocityViewServlet
[ERROR] overridden method does not throw java.lang.Exception
[ERROR] -> [Help 1]
[ERROR] 
[ERROR] To see the full stack trace of the errors, re-run Maven with the -e switch.
[ERROR] Re-run Maven using the -X switch to enable full debug logging.
[ERROR] 
[ERROR] For more information about the errors and possible solutions, please read the following
articles:
[ERROR] [Help 1] http://cwiki.apache.org/confluence/display/MAVEN/MojoFailureException
[ERROR] 
[ERROR] After correcting the problems, you can resume the build with the command
[ERROR]   mvn <goals> -rf :struts2-sitemesh-plugin
[JENKINS] Archiving <https://builds.apache.org/job/Struts-JDK7-pull-request/ws/plugins/plexus/pom.xml>
to org.apache.struts/struts2-plexus-plugin/2.5-SNAPSHOT/struts2-plexus-plugin-2.5-SNAPSHOT.pom
[JENKINS] Archiving <https://builds.apache.org/job/Struts-JDK7-pull-request/ws/plugins/pell-multipart/pom.xml>
to org.apache.struts/struts2-pell-multipart-plugin/2.5-SNAPSHOT/struts2-pell-multipart-plugin-2.5-SNAPSHOT.pom
[JENKINS] Archiving <https://builds.apache.org/job/Struts-JDK7-pull-request/ws/plugins/java8-support/pom.xml>
to org.apache.struts/struts2-java8-support-plugin/2.5-SNAPSHOT/struts2-java8-support-plugin-2.5-SNAPSHOT.pom
[JENKINS] Archiving <https://builds.apache.org/job/Struts-JDK7-pull-request/ws/plugins/jfreechart/pom.xml>
to org.apache.struts/struts2-jfreechart-plugin/2.5-SNAPSHOT/struts2-jfreechart-plugin-2.5-SNAPSHOT.pom
[JENKINS] Archiving <https://builds.apache.org/job/Struts-JDK7-pull-request/ws/plugins/sitemesh/pom.xml>
to org.apache.struts/struts2-sitemesh-plugin/2.5-SNAPSHOT/struts2-sitemesh-plugin-2.5-SNAPSHOT.pom
[JENKINS] Archiving <https://builds.apache.org/job/Struts-JDK7-pull-request/ws/plugins/config-browser/pom.xml>
to org.apache.struts/struts2-config-browser-plugin/2.5-SNAPSHOT/struts2-config-browser-plugin-2.5-SNAPSHOT.pom
[JENKINS] Archiving <https://builds.apache.org/job/Struts-JDK7-pull-request/ws/plugins/config-browser/target/struts2-config-browser-plugin-2.5-SNAPSHOT.jar>
to org.apache.struts/struts2-config-browser-plugin/2.5-SNAPSHOT/struts2-config-browser-plugin-2.5-SNAPSHOT.jar
[JENKINS] Archiving <https://builds.apache.org/job/Struts-JDK7-pull-request/ws/plugins/config-browser/target/struts2-config-browser-plugin-2.5-SNAPSHOT-sources.jar>
to org.apache.struts/struts2-config-browser-plugin/2.5-SNAPSHOT/struts2-config-browser-plugin-2.5-SNAPSHOT-sources.jar
[JENKINS] Archiving <https://builds.apache.org/job/Struts-JDK7-pull-request/ws/archetypes/struts2-archetype-portlet/pom.xml>
to org.apache.struts/struts2-archetype-portlet/2.5-SNAPSHOT/struts2-archetype-portlet-2.5-SNAPSHOT.pom
[JENKINS] Archiving <https://builds.apache.org/job/Struts-JDK7-pull-request/ws/bundles/demo/pom.xml>
to org.apache.struts/struts2-osgi-demo-bundle/2.5-SNAPSHOT/struts2-osgi-demo-bundle-2.5-SNAPSHOT.pom
[JENKINS] Archiving <https://builds.apache.org/job/Struts-JDK7-pull-request/ws/plugins/portlet-tiles/pom.xml>
to org.apache.struts/struts2-portlet-tiles-plugin/2.5-SNAPSHOT/struts2-portlet-tiles-plugin-2.5-SNAPSHOT.pom
[JENKINS] Archiving <https://builds.apache.org/job/Struts-JDK7-pull-request/ws/plugins/portlet-tiles/target/struts2-portlet-tiles-plugin-2.5-SNAPSHOT.jar>
to org.apache.struts/struts2-portlet-tiles-plugin/2.5-SNAPSHOT/struts2-portlet-tiles-plugin-2.5-SNAPSHOT.jar
[JENKINS] Archiving <https://builds.apache.org/job/Struts-JDK7-pull-request/ws/plugins/portlet-tiles/target/struts2-portlet-tiles-plugin-2.5-SNAPSHOT-sources.jar>
to org.apache.struts/struts2-portlet-tiles-plugin/2.5-SNAPSHOT/struts2-portlet-tiles-plugin-2.5-SNAPSHOT-sources.jar
[JENKINS] Archiving <https://builds.apache.org/job/Struts-JDK7-pull-request/ws/plugins/jasperreports/pom.xml>
to org.apache.struts/struts2-jasperreports-plugin/2.5-SNAPSHOT/struts2-jasperreports-plugin-2.5-SNAPSHOT.pom
[JENKINS] Archiving <https://builds.apache.org/job/Struts-JDK7-pull-request/ws/archetypes/struts2-archetype-blank/pom.xml>
to org.apache.struts/struts2-archetype-blank/2.5-SNAPSHOT/struts2-archetype-blank-2.5-SNAPSHOT.pom
[JENKINS] Archiving <https://builds.apache.org/job/Struts-JDK7-pull-request/ws/plugins/oval/pom.xml>
to org.apache.struts/struts2-oval-plugin/2.5-SNAPSHOT/struts2-oval-plugin-2.5-SNAPSHOT.pom
[JENKINS] Archiving <https://builds.apache.org/job/Struts-JDK7-pull-request/ws/plugins/gxp/pom.xml>
to org.apache.struts/struts2-gxp-plugin/2.5-SNAPSHOT/struts2-gxp-plugin-2.5-SNAPSHOT.pom
[JENKINS] Archiving <https://builds.apache.org/job/Struts-JDK7-pull-request/ws/plugins/convention/pom.xml>
to org.apache.struts/struts2-convention-plugin/2.5-SNAPSHOT/struts2-convention-plugin-2.5-SNAPSHOT.pom
[JENKINS] Archiving <https://builds.apache.org/job/Struts-JDK7-pull-request/ws/plugins/convention/target/struts2-convention-plugin-2.5-SNAPSHOT.jar>
to org.apache.struts/struts2-convention-plugin/2.5-SNAPSHOT/struts2-convention-plugin-2.5-SNAPSHOT.jar
[JENKINS] Archiving <https://builds.apache.org/job/Struts-JDK7-pull-request/ws/plugins/convention/target/struts2-convention-plugin-2.5-SNAPSHOT-sources.jar>
to org.apache.struts/struts2-convention-plugin/2.5-SNAPSHOT/struts2-convention-plugin-2.5-SNAPSHOT-sources.jar
[JENKINS] Archiving <https://builds.apache.org/job/Struts-JDK7-pull-request/ws/bundles/pom.xml>
to org.apache.struts/struts2-osgi-bundles/2.5-SNAPSHOT/struts2-osgi-bundles-2.5-SNAPSHOT.pom
[JENKINS] Archiving <https://builds.apache.org/job/Struts-JDK7-pull-request/ws/pom.xml>
to org.apache.struts/struts2-parent/2.5-SNAPSHOT/struts2-parent-2.5-SNAPSHOT.pom
[JENKINS] Archiving <https://builds.apache.org/job/Struts-JDK7-pull-request/ws/target/struts2-parent-2.5-SNAPSHOT-site.xml>
to org.apache.struts/struts2-parent/2.5-SNAPSHOT/struts2-parent-2.5-SNAPSHOT-site.xml
Compressed 39.47 KB of artifacts by 81.1% relative to #134
[JENKINS] Archiving <https://builds.apache.org/job/Struts-JDK7-pull-request/ws/plugins/osgi/pom.xml>
to org.apache.struts/struts2-osgi-plugin/2.5-SNAPSHOT/struts2-osgi-plugin-2.5-SNAPSHOT.pom
[JENKINS] Archiving <https://builds.apache.org/job/Struts-JDK7-pull-request/ws/apps/showcase/pom.xml>
to org.apache.struts/struts2-showcase/2.5-SNAPSHOT/struts2-showcase-2.5-SNAPSHOT.pom
[JENKINS] Archiving <https://builds.apache.org/job/Struts-JDK7-pull-request/ws/plugins/cdi/pom.xml>
to org.apache.struts/struts2-cdi-plugin/2.5-SNAPSHOT/struts2-cdi-plugin-2.5-SNAPSHOT.pom
[JENKINS] Archiving <https://builds.apache.org/job/Struts-JDK7-pull-request/ws/plugins/rest/pom.xml>
to org.apache.struts/struts2-rest-plugin/2.5-SNAPSHOT/struts2-rest-plugin-2.5-SNAPSHOT.pom
[JENKINS] Archiving <https://builds.apache.org/job/Struts-JDK7-pull-request/ws/core/pom.xml>
to org.apache.struts/struts2-core/2.5-SNAPSHOT/struts2-core-2.5-SNAPSHOT.pom
[JENKINS] Archiving <https://builds.apache.org/job/Struts-JDK7-pull-request/ws/core/target/struts2-core-2.5-SNAPSHOT.jar>
to org.apache.struts/struts2-core/2.5-SNAPSHOT/struts2-core-2.5-SNAPSHOT.jar
[JENKINS] Archiving <https://builds.apache.org/job/Struts-JDK7-pull-request/ws/core/target/struts2-core-2.5-SNAPSHOT-sources.jar>
to org.apache.struts/struts2-core/2.5-SNAPSHOT/struts2-core-2.5-SNAPSHOT-sources.jar
[JENKINS] Archiving <https://builds.apache.org/job/Struts-JDK7-pull-request/ws/plugins/tiles/pom.xml>
to org.apache.struts/struts2-tiles-plugin/2.5-SNAPSHOT/struts2-tiles-plugin-2.5-SNAPSHOT.pom
[JENKINS] Archiving <https://builds.apache.org/job/Struts-JDK7-pull-request/ws/plugins/tiles/target/struts2-tiles-plugin-2.5-SNAPSHOT.jar>
to org.apache.struts/struts2-tiles-plugin/2.5-SNAPSHOT/struts2-tiles-plugin-2.5-SNAPSHOT.jar
[JENKINS] Archiving <https://builds.apache.org/job/Struts-JDK7-pull-request/ws/plugins/tiles/target/struts2-tiles-plugin-2.5-SNAPSHOT-sources.jar>
to org.apache.struts/struts2-tiles-plugin/2.5-SNAPSHOT/struts2-tiles-plugin-2.5-SNAPSHOT-sources.jar
[JENKINS] Archiving <https://builds.apache.org/job/Struts-JDK7-pull-request/ws/archetypes/struts2-archetype-dbportlet/pom.xml>
to org.apache.struts/struts2-archetype-dbportlet/2.5-SNAPSHOT/struts2-archetype-dbportlet-2.5-SNAPSHOT.pom
[JENKINS] Archiving <https://builds.apache.org/job/Struts-JDK7-pull-request/ws/archetypes/struts2-archetype-convention/pom.xml>
to org.apache.struts/struts2-archetype-convention/2.5-SNAPSHOT/struts2-archetype-convention-2.5-SNAPSHOT.pom
[JENKINS] Archiving <https://builds.apache.org/job/Struts-JDK7-pull-request/ws/archetypes/pom.xml>
to org.apache.struts/struts2-archetypes/2.5-SNAPSHOT/struts2-archetypes-2.5-SNAPSHOT.pom
[JENKINS] Archiving <https://builds.apache.org/job/Struts-JDK7-pull-request/ws/bom/pom.xml>
to org.apache.struts/struts2-bom/2.5-SNAPSHOT/struts2-bom-2.5-SNAPSHOT.pom
[JENKINS] Archiving <https://builds.apache.org/job/Struts-JDK7-pull-request/ws/plugins/embeddedjsp/pom.xml>
to org.apache.struts/struts2-embeddedjsp-plugin/2.5-SNAPSHOT/struts2-embeddedjsp-plugin-2.5-SNAPSHOT.pom
[JENKINS] Archiving <https://builds.apache.org/job/Struts-JDK7-pull-request/ws/plugins/pom.xml>
to org.apache.struts/struts2-plugins/2.5-SNAPSHOT/struts2-plugins-2.5-SNAPSHOT.pom
[JENKINS] Archiving <https://builds.apache.org/job/Struts-JDK7-pull-request/ws/plugins/target/struts2-plugins-2.5-SNAPSHOT-site.xml>
to org.apache.struts/struts2-plugins/2.5-SNAPSHOT/struts2-plugins-2.5-SNAPSHOT-site.xml
[JENKINS] Archiving <https://builds.apache.org/job/Struts-JDK7-pull-request/ws/apps/rest-showcase/pom.xml>
to org.apache.struts/struts2-rest-showcase/2.5-SNAPSHOT/struts2-rest-showcase-2.5-SNAPSHOT.pom
[JENKINS] Archiving <https://builds.apache.org/job/Struts-JDK7-pull-request/ws/plugins/javatemplates/pom.xml>
to org.apache.struts/struts2-javatemplates-plugin/2.5-SNAPSHOT/struts2-javatemplates-plugin-2.5-SNAPSHOT.pom
[JENKINS] Archiving <https://builds.apache.org/job/Struts-JDK7-pull-request/ws/bundles/admin/pom.xml>
to org.apache.struts/struts2-osgi-admin-bundle/2.5-SNAPSHOT/struts2-osgi-admin-bundle-2.5-SNAPSHOT.pom
[JENKINS] Archiving <https://builds.apache.org/job/Struts-JDK7-pull-request/ws/apps/pom.xml>
to org.apache.struts/struts2-apps/2.5-SNAPSHOT/struts2-apps-2.5-SNAPSHOT.pom
[JENKINS] Archiving <https://builds.apache.org/job/Struts-JDK7-pull-request/ws/plugins/sitegraph/pom.xml>
to org.apache.struts/struts2-sitegraph-plugin/2.5-SNAPSHOT/struts2-sitegraph-plugin-2.5-SNAPSHOT.pom
[JENKINS] Archiving <https://builds.apache.org/job/Struts-JDK7-pull-request/ws/plugins/testng/pom.xml>
to org.apache.struts/struts2-testng-plugin/2.5-SNAPSHOT/struts2-testng-plugin-2.5-SNAPSHOT.pom
[JENKINS] Archiving <https://builds.apache.org/job/Struts-JDK7-pull-request/ws/apps/portlet/pom.xml>
to org.apache.struts/struts2-portlet/2.5-SNAPSHOT/struts2-portlet-2.5-SNAPSHOT.pom
[JENKINS] Archiving <https://builds.apache.org/job/Struts-JDK7-pull-request/ws/apps/portlet/target/struts2-portlet.war>
to org.apache.struts/struts2-portlet/2.5-SNAPSHOT/struts2-portlet-2.5-SNAPSHOT.war
[JENKINS] Archiving <https://builds.apache.org/job/Struts-JDK7-pull-request/ws/apps/portlet/target/struts2-portlet-sources.jar>
to org.apache.struts/struts2-portlet/2.5-SNAPSHOT/struts2-portlet-2.5-SNAPSHOT-sources.jar
Compressed 12.69 MB of artifacts by 61.8% relative to #133
[JENKINS] Archiving <https://builds.apache.org/job/Struts-JDK7-pull-request/ws/plugins/json/pom.xml>
to org.apache.struts/struts2-json-plugin/2.5-SNAPSHOT/struts2-json-plugin-2.5-SNAPSHOT.pom
[JENKINS] Archiving <https://builds.apache.org/job/Struts-JDK7-pull-request/ws/plugins/junit/pom.xml>
to org.apache.struts/struts2-junit-plugin/2.5-SNAPSHOT/struts2-junit-plugin-2.5-SNAPSHOT.pom
[JENKINS] Archiving <https://builds.apache.org/job/Struts-JDK7-pull-request/ws/plugins/junit/target/struts2-junit-plugin-2.5-SNAPSHOT.jar>
to org.apache.struts/struts2-junit-plugin/2.5-SNAPSHOT/struts2-junit-plugin-2.5-SNAPSHOT.jar
[JENKINS] Archiving <https://builds.apache.org/job/Struts-JDK7-pull-request/ws/plugins/junit/target/struts2-junit-plugin-2.5-SNAPSHOT-sources.jar>
to org.apache.struts/struts2-junit-plugin/2.5-SNAPSHOT/struts2-junit-plugin-2.5-SNAPSHOT-sources.jar
[JENKINS] Archiving <https://builds.apache.org/job/Struts-JDK7-pull-request/ws/plugins/dwr/pom.xml>
to org.apache.struts/struts2-dwr-plugin/2.5-SNAPSHOT/struts2-dwr-plugin-2.5-SNAPSHOT.pom
[JENKINS] Archiving <https://builds.apache.org/job/Struts-JDK7-pull-request/ws/plugins/dwr/target/struts2-dwr-plugin-2.5-SNAPSHOT.jar>
to org.apache.struts/struts2-dwr-plugin/2.5-SNAPSHOT/struts2-dwr-plugin-2.5-SNAPSHOT.jar
[JENKINS] Archiving <https://builds.apache.org/job/Struts-JDK7-pull-request/ws/plugins/dwr/target/struts2-dwr-plugin-2.5-SNAPSHOT-sources.jar>
to org.apache.struts/struts2-dwr-plugin/2.5-SNAPSHOT/struts2-dwr-plugin-2.5-SNAPSHOT-sources.jar
[JENKINS] Archiving <https://builds.apache.org/job/Struts-JDK7-pull-request/ws/archetypes/struts2-archetype-plugin/pom.xml>
to org.apache.struts/struts2-archetype-plugin/2.5-SNAPSHOT/struts2-archetype-plugin-2.5-SNAPSHOT.pom
[JENKINS] Archiving <https://builds.apache.org/job/Struts-JDK7-pull-request/ws/plugins/bean-validation/pom.xml>
to org.apache.struts/struts2-bean-validation-plugin/2.5-SNAPSHOT/struts2-bean-validation-plugin-2.5-SNAPSHOT.pom
[JENKINS] Archiving <https://builds.apache.org/job/Struts-JDK7-pull-request/ws/archetypes/struts2-archetype-angularjs/pom.xml>
to org.apache.struts/struts2-archetype-angularjs/2.5-SNAPSHOT/struts2-archetype-angularjs-2.5-SNAPSHOT.pom
[JENKINS] Archiving <https://builds.apache.org/job/Struts-JDK7-pull-request/ws/plugins/portlet/pom.xml>
to org.apache.struts/struts2-portlet-plugin/2.5-SNAPSHOT/struts2-portlet-plugin-2.5-SNAPSHOT.pom
[JENKINS] Archiving <https://builds.apache.org/job/Struts-JDK7-pull-request/ws/plugins/portlet/target/struts2-portlet-plugin-2.5-SNAPSHOT.jar>
to org.apache.struts/struts2-portlet-plugin/2.5-SNAPSHOT/struts2-portlet-plugin-2.5-SNAPSHOT.jar
[JENKINS] Archiving <https://builds.apache.org/job/Struts-JDK7-pull-request/ws/plugins/portlet/target/struts2-portlet-plugin-2.5-SNAPSHOT-sources.jar>
to org.apache.struts/struts2-portlet-plugin/2.5-SNAPSHOT/struts2-portlet-plugin-2.5-SNAPSHOT-sources.jar
[JENKINS] Archiving <https://builds.apache.org/job/Struts-JDK7-pull-request/ws/plugins/spring/pom.xml>
to org.apache.struts/struts2-spring-plugin/2.5-SNAPSHOT/struts2-spring-plugin-2.5-SNAPSHOT.pom
[JENKINS] Archiving <https://builds.apache.org/job/Struts-JDK7-pull-request/ws/plugins/spring/target/struts2-spring-plugin-2.5-SNAPSHOT.jar>
to org.apache.struts/struts2-spring-plugin/2.5-SNAPSHOT/struts2-spring-plugin-2.5-SNAPSHOT.jar
[JENKINS] Archiving <https://builds.apache.org/job/Struts-JDK7-pull-request/ws/plugins/spring/target/struts2-spring-plugin-2.5-SNAPSHOT-sources.jar>
to org.apache.struts/struts2-spring-plugin/2.5-SNAPSHOT/struts2-spring-plugin-2.5-SNAPSHOT-sources.jar
[JENKINS] Archiving <https://builds.apache.org/job/Struts-JDK7-pull-request/ws/archetypes/struts2-archetype-starter/pom.xml>
to org.apache.struts/struts2-archetype-starter/2.5-SNAPSHOT/struts2-archetype-starter-2.5-SNAPSHOT.pom
[locks-and-latches] Releasing all the locks
[locks-and-latches] All the locks released
channel stopped
Putting comment on the pull request

---------------------------------------------------------------------
To unsubscribe, e-mail: dev-unsubscribe@struts.apache.org
For additional commands, e-mail: dev-help@struts.apache.org


Mime
View raw message