struts-dev mailing list archives

Site index · List index
Message view « Date » · « Thread »
Top « Date » · « Thread »
From Apache Jenkins Server <jenk...@builds.apache.org>
Subject Build failed in Jenkins: Struts-examples-JDK7-master #18
Date Sun, 10 Jan 2016 18:36:11 GMT
See <https://builds.apache.org/job/Struts-examples-JDK7-master/18/changes>

Changes:

[Lukasz Lenart] Uses proper groupId

[Lukasz Lenart] Uses proper groupId

[Lukasz Lenart] Adds tiles example

[Lukasz Lenart] Adds missing versions

[Lukasz Lenart] Fixes issue with JavaDocs

[Lukasz Lenart] Drops unrelated tests

[Lukasz Lenart] Updates readme

------------------------------------------
[...truncated 106 lines...]
[WARNING] Some problems were encountered while building the effective model for org.apache.struts:form-xml-validation:war:1.0.0
[WARNING] 'build.plugins.plugin.version' for org.apache.maven.plugins:maven-javadoc-plugin
is missing. @ org.apache.struts:struts-examples:1.0.0, <https://builds.apache.org/job/Struts-examples-JDK7-master/ws/pom.xml,>
line 107, column 21
[WARNING] The expression ${artifactId} is deprecated. Please use ${project.artifactId} instead.
[WARNING] 
[WARNING] Some problems were encountered while building the effective model for org.apache.struts:helloworld:war:1.0.0
[WARNING] 'build.plugins.plugin.version' for org.apache.maven.plugins:maven-javadoc-plugin
is missing. @ org.apache.struts:struts-examples:1.0.0, <https://builds.apache.org/job/Struts-examples-JDK7-master/ws/pom.xml,>
line 107, column 21
[WARNING] The expression ${artifactId} is deprecated. Please use ${project.artifactId} instead.
[WARNING] 
[WARNING] Some problems were encountered while building the effective model for org.apache.struts:http-session:war:1.0.0
[WARNING] 'build.plugins.plugin.version' for org.apache.maven.plugins:maven-javadoc-plugin
is missing. @ org.apache.struts:struts-examples:1.0.0, <https://builds.apache.org/job/Struts-examples-JDK7-master/ws/pom.xml,>
line 107, column 21
[WARNING] The expression ${artifactId} is deprecated. Please use ${project.artifactId} instead.
[WARNING] 
[WARNING] Some problems were encountered while building the effective model for org.apache.struts:interceptors:war:1.0.0
[WARNING] 'build.plugins.plugin.version' for org.apache.maven.plugins:maven-javadoc-plugin
is missing. @ org.apache.struts:struts-examples:1.0.0, <https://builds.apache.org/job/Struts-examples-JDK7-master/ws/pom.xml,>
line 107, column 21
[WARNING] The expression ${artifactId} is deprecated. Please use ${project.artifactId} instead.
[WARNING] 
[WARNING] Some problems were encountered while building the effective model for org.apache.struts:struts2-jboss-blank:war:1.0.0
[WARNING] 'build.plugins.plugin.version' for org.apache.maven.plugins:maven-javadoc-plugin
is missing. @ org.apache.struts:struts-examples:1.0.0, <https://builds.apache.org/job/Struts-examples-JDK7-master/ws/pom.xml,>
line 107, column 21
[WARNING] 
[WARNING] Some problems were encountered while building the effective model for org.apache.struts:mailreader:war:1.0.0
[WARNING] 'build.plugins.plugin.version' for org.apache.maven.plugins:maven-javadoc-plugin
is missing. @ org.apache.struts:struts-examples:1.0.0, <https://builds.apache.org/job/Struts-examples-JDK7-master/ws/pom.xml,>
line 107, column 21
[WARNING] The expression ${artifactId} is deprecated. Please use ${project.artifactId} instead.
[WARNING] 
[WARNING] Some problems were encountered while building the effective model for org.apache.struts:message-resource:war:1.0.0
[WARNING] 'build.plugins.plugin.version' for org.apache.maven.plugins:maven-javadoc-plugin
is missing. @ org.apache.struts:struts-examples:1.0.0, <https://builds.apache.org/job/Struts-examples-JDK7-master/ws/pom.xml,>
line 107, column 21
[WARNING] The expression ${artifactId} is deprecated. Please use ${project.artifactId} instead.
[WARNING] 
[WARNING] Some problems were encountered while building the effective model for org.apache.struts:preparable-interface:war:1.0.0
[WARNING] 'build.plugins.plugin.version' for org.apache.maven.plugins:maven-javadoc-plugin
is missing. @ org.apache.struts:struts-examples:1.0.0, <https://builds.apache.org/job/Struts-examples-JDK7-master/ws/pom.xml,>
line 107, column 21
[WARNING] The expression ${artifactId} is deprecated. Please use ${project.artifactId} instead.
[WARNING] 
[WARNING] Some problems were encountered while building the effective model for org.apache.struts:restful2actionmapper:war:1.0.0
[WARNING] 'build.plugins.plugin.version' for org.apache.maven.plugins:maven-javadoc-plugin
is missing. @ org.apache.struts:struts-examples:1.0.0, <https://builds.apache.org/job/Struts-examples-JDK7-master/ws/pom.xml,>
line 107, column 21
[WARNING] The expression ${artifactId} is deprecated. Please use ${project.artifactId} instead.
[WARNING] 
[WARNING] Some problems were encountered while building the effective model for org.apache.struts:rest-angular:jar:1.0.0
[WARNING] 'build.plugins.plugin.version' for org.apache.maven.plugins:maven-javadoc-plugin
is missing. @ org.apache.struts:struts-examples:1.0.0, <https://builds.apache.org/job/Struts-examples-JDK7-master/ws/pom.xml,>
line 107, column 21
[WARNING] 'build.plugins.plugin.version' for com.cj.jshintmojo:jshint-maven-plugin is missing.
@ line 137, column 21
[WARNING] The expression ${artifactId} is deprecated. Please use ${project.artifactId} instead.
[WARNING] 
[WARNING] Some problems were encountered while building the effective model for org.apache.struts:spring-struts:war:1.0.0
[WARNING] 'build.plugins.plugin.version' for org.apache.maven.plugins:maven-javadoc-plugin
is missing. @ org.apache.struts:struts-examples:1.0.0, <https://builds.apache.org/job/Struts-examples-JDK7-master/ws/pom.xml,>
line 107, column 21
[WARNING] The expression ${artifactId} is deprecated. Please use ${project.artifactId} instead.
[WARNING] 
[WARNING] Some problems were encountered while building the effective model for org.apache.struts:tiles:war:1.0.0
[WARNING] 'build.plugins.plugin.version' for org.apache.maven.plugins:maven-javadoc-plugin
is missing. @ org.apache.struts:struts-examples:1.0.0, <https://builds.apache.org/job/Struts-examples-JDK7-master/ws/pom.xml,>
line 107, column 21
[WARNING] 
[WARNING] Some problems were encountered while building the effective model for org.apache.struts:themes:war:1.0.0
[WARNING] 'build.plugins.plugin.version' for org.apache.maven.plugins:maven-javadoc-plugin
is missing. @ org.apache.struts:struts-examples:1.0.0, <https://builds.apache.org/job/Struts-examples-JDK7-master/ws/pom.xml,>
line 107, column 21
[WARNING] The expression ${artifactId} is deprecated. Please use ${project.artifactId} instead.
[WARNING] 
[WARNING] Some problems were encountered while building the effective model for org.apache.struts:themes-override:war:1.0.0
[WARNING] 'build.plugins.plugin.version' for org.apache.maven.plugins:maven-javadoc-plugin
is missing. @ org.apache.struts:struts-examples:1.0.0, <https://builds.apache.org/job/Struts-examples-JDK7-master/ws/pom.xml,>
line 107, column 21
[WARNING] 
[WARNING] Some problems were encountered while building the effective model for org.apache.struts:using-tags:war:1.0.0
[WARNING] 'build.plugins.plugin.version' for org.apache.maven.plugins:maven-javadoc-plugin
is missing. @ org.apache.struts:struts-examples:1.0.0, <https://builds.apache.org/job/Struts-examples-JDK7-master/ws/pom.xml,>
line 107, column 21
[WARNING] The expression ${artifactId} is deprecated. Please use ${project.artifactId} instead.
[WARNING] 
[WARNING] Some problems were encountered while building the effective model for org.apache.struts:unit-testing:war:1.0.0
[WARNING] 'build.plugins.plugin.version' for org.apache.maven.plugins:maven-javadoc-plugin
is missing. @ org.apache.struts:struts-examples:1.0.0, <https://builds.apache.org/job/Struts-examples-JDK7-master/ws/pom.xml,>
line 107, column 21
[WARNING] The expression ${artifactId} is deprecated. Please use ${project.artifactId} instead.
[WARNING] 
[WARNING] Some problems were encountered while building the effective model for org.apache.struts:wildcard-method-selection:war:1.0.0
[WARNING] 'build.plugins.plugin.version' for org.apache.maven.plugins:maven-javadoc-plugin
is missing. @ org.apache.struts:struts-examples:1.0.0, <https://builds.apache.org/job/Struts-examples-JDK7-master/ws/pom.xml,>
line 107, column 21
[WARNING] The expression ${artifactId} is deprecated. Please use ${project.artifactId} instead.
[WARNING] 
[WARNING] Some problems were encountered while building the effective model for org.apache.struts:struts-examples:pom:1.0.0
[WARNING] 'build.plugins.plugin.version' for org.apache.maven.plugins:maven-javadoc-plugin
is missing. @ line 107, column 21
[WARNING] 
[WARNING] It is highly recommended to fix these problems because they threaten the stability
of your build.
[WARNING] 
[WARNING] For this reason, future Maven versions might no longer support building such malformed
projects.
[WARNING] 
[INFO] ------------------------------------------------------------------------
[INFO] Reactor Build Order:
[INFO] 
[INFO] Struts 2 Examples
[INFO] Annotations with Convention Plugin
[INFO] Basic Struts2 Example
[INFO] Bean Validation
[INFO] Struts 2 Blank Webapp
[INFO] Coding Struts 2 Action
[INFO] Control Tags
[INFO] Debugging Struts
[INFO] Exception handling
[INFO] exclude-parameters
[INFO] Form Processing
[INFO] Form Tags
[INFO] Form validation
[INFO] XML based form validation
[INFO] Hello World Struts 2 Example Application
[INFO] http-session
[INFO] Struts 2 Interceptors
[INFO] Struts 2 JBoss Blank Webapp
[INFO] Struts 2 Mail Reader Webapp
[INFO] Message resource
[INFO] Preparable Interface
[INFO] REST to Action Mapper Example Application
[INFO] REST Plugin based application with AngularJS frontend
[INFO] Struts2 with Spring Integration
[INFO] Struts Tiles Example
[INFO] Struts 2 Themes
[INFO] Struts 2 Themes Override
[INFO] Using Struts 2 Tags
[INFO] Unit Testing
[INFO] Wildcard Method Selection
[INFO] 
[INFO] Using the builder org.apache.maven.lifecycle.internal.builder.singlethreaded.SingleThreadedBuilder
with a thread count of 1
[INFO]                                                                         
[INFO] ------------------------------------------------------------------------
[INFO] Building Struts 2 Examples 1.0.0
[INFO] ------------------------------------------------------------------------
[INFO]                                                                         
[INFO] ------------------------------------------------------------------------
[INFO] Building Annotations with Convention Plugin 1.0.0
[INFO] ------------------------------------------------------------------------
[INFO] Downloading: http://repo.maven.apache.org/maven2/org/apache/struts/struts2-convention-plugin/2.5-BETA2/struts2-convention-plugin-2.5-BETA2.pom
[INFO] Downloaded: http://repo.maven.apache.org/maven2/org/apache/struts/struts2-convention-plugin/2.5-BETA2/struts2-convention-plugin-2.5-BETA2.pom
(2 KB at 9.1 KB/sec)
[INFO] Downloading: http://repo.maven.apache.org/maven2/org/apache/struts/struts2-plugins/2.5-BETA2/struts2-plugins-2.5-BETA2.pom
[INFO] Downloaded: http://repo.maven.apache.org/maven2/org/apache/struts/struts2-plugins/2.5-BETA2/struts2-plugins-2.5-BETA2.pom
(3 KB at 50.6 KB/sec)
[INFO] Downloading: http://repo.maven.apache.org/maven2/org/apache/struts/struts2-parent/2.5-BETA2/struts2-parent-2.5-BETA2.pom
[INFO] Downloaded: http://repo.maven.apache.org/maven2/org/apache/struts/struts2-parent/2.5-BETA2/struts2-parent-2.5-BETA2.pom
(36 KB at 423.4 KB/sec)
[INFO] Downloading: http://repo.maven.apache.org/maven2/org/apache/struts/struts2-core/2.5-BETA2/struts2-core-2.5-BETA2.pom
[INFO] Downloaded: http://repo.maven.apache.org/maven2/org/apache/struts/struts2-core/2.5-BETA2/struts2-core-2.5-BETA2.pom
(17 KB at 260.4 KB/sec)
[INFO] Downloading: http://repo.maven.apache.org/maven2/org/apache/struts/struts2-convention-plugin/2.5-BETA2/struts2-convention-plugin-2.5-BETA2.jar
[INFO] Downloading: http://repo.maven.apache.org/maven2/org/apache/struts/struts2-core/2.5-BETA2/struts2-core-2.5-BETA2.jar
[INFO] Downloaded: http://repo.maven.apache.org/maven2/org/apache/struts/struts2-convention-plugin/2.5-BETA2/struts2-convention-plugin-2.5-BETA2.jar
(69 KB at 805.1 KB/sec)
[INFO] Downloaded: http://repo.maven.apache.org/maven2/org/apache/struts/struts2-core/2.5-BETA2/struts2-core-2.5-BETA2.jar
(1490 KB at 5117.7 KB/sec)
[INFO] 
[INFO] --- maven-resources-plugin:2.6:resources (default-resources) @ annotations ---
[INFO] Using 'UTF-8' encoding to copy filtered resources.
[INFO] Copying 1 resource
[INFO] 
[INFO] --- maven-compiler-plugin:3.3:compile (default-compile) @ annotations ---
[INFO] Changes detected - recompiling the module!
[INFO] Compiling 3 source files to <https://builds.apache.org/job/Struts-examples-JDK7-master/ws/annotations/target/classes>
[INFO] ------------------------------------------------------------------------
[INFO] Reactor Summary:
[INFO] 
[INFO] Struts 2 Examples ................................. SUCCESS [  0.650 s]
[INFO] Annotations with Convention Plugin ................ FAILURE [  3.064 s]
[INFO] Basic Struts2 Example ............................. SKIPPED
[INFO] Bean Validation ................................... SKIPPED
[INFO] Struts 2 Blank Webapp ............................. SKIPPED
[INFO] Coding Struts 2 Action ............................ SKIPPED
[INFO] Control Tags ...................................... SKIPPED
[INFO] Debugging Struts .................................. SKIPPED
[INFO] Exception handling ................................ SKIPPED
[INFO] exclude-parameters ................................ SKIPPED
[INFO] Form Processing ................................... SKIPPED
[INFO] Form Tags ......................................... SKIPPED
[INFO] Form validation ................................... SKIPPED
[INFO] XML based form validation ......................... SKIPPED
[INFO] Hello World Struts 2 Example Application .......... SKIPPED
[INFO] http-session ...................................... SKIPPED
[INFO] Struts 2 Interceptors ............................. SKIPPED
[INFO] Struts 2 JBoss Blank Webapp ....................... SKIPPED
[INFO] Struts 2 Mail Reader Webapp ....................... SKIPPED
[INFO] Message resource .................................. SKIPPED
[INFO] Preparable Interface .............................. SKIPPED
[INFO] REST to Action Mapper Example Application ......... SKIPPED
[INFO] REST Plugin based application with AngularJS frontend  SKIPPED
[INFO] Struts2 with Spring Integration ................... SKIPPED
[INFO] Struts Tiles Example .............................. SKIPPED
[INFO] Struts 2 Themes ................................... SKIPPED
[INFO] Struts 2 Themes Override .......................... SKIPPED
[INFO] Using Struts 2 Tags ............................... SKIPPED
[INFO] Unit Testing ...................................... SKIPPED
[INFO] Wildcard Method Selection ......................... SKIPPED
[INFO] ------------------------------------------------------------------------
[INFO] BUILD FAILURE
[INFO] ------------------------------------------------------------------------
[INFO] Total time: 7.457 s
[INFO] Finished at: 2016-01-10T18:36:07+00:00
[INFO] Final Memory: 18M/230M
[INFO] ------------------------------------------------------------------------
[ERROR] Failed to execute goal org.apache.maven.plugins:maven-compiler-plugin:3.3:compile
(default-compile) on project annotations: Fatal error compiling: invalid target release: 1.8
-> [Help 1]
[ERROR] 
[ERROR] To see the full stack trace of the errors, re-run Maven with the -e switch.
[ERROR] Re-run Maven using the -X switch to enable full debug logging.
[ERROR] 
[ERROR] For more information about the errors and possible solutions, please read the following
articles:
[ERROR] [Help 1] http://cwiki.apache.org/confluence/display/MAVEN/MojoExecutionException
[ERROR] 
[ERROR] After correcting the problems, you can resume the build with the command
[ERROR]   mvn <goals> -rf :annotations
[JENKINS] Archiving <https://builds.apache.org/job/Struts-examples-JDK7-master/ws/form-validation/pom.xml>
to org.apache.struts/form-validation/1.0.0/form-validation-1.0.0.pom
No prior successful build to compare, so performing full copy of artifacts
[JENKINS] Archiving <https://builds.apache.org/job/Struts-examples-JDK7-master/ws/restful2actionmapper/pom.xml>
to org.apache.struts/restful2actionmapper/1.0.0/restful2actionmapper-1.0.0.pom
No prior successful build to compare, so performing full copy of artifacts
[JENKINS] Archiving <https://builds.apache.org/job/Struts-examples-JDK7-master/ws/spring-struts/pom.xml>
to org.apache.struts/spring-struts/1.0.0/spring-struts-1.0.0.pom
No prior successful build to compare, so performing full copy of artifacts
[JENKINS] Archiving <https://builds.apache.org/job/Struts-examples-JDK7-master/ws/basic-struts/pom.xml>
to org.apache.struts/basic-struts/1.0.0/basic-struts-1.0.0.pom
No prior successful build to compare, so performing full copy of artifacts
[JENKINS] Archiving <https://builds.apache.org/job/Struts-examples-JDK7-master/ws/themes-override/pom.xml>
to org.apache.struts/themes-override/1.0.0/themes-override-1.0.0.pom
No prior successful build to compare, so performing full copy of artifacts
[JENKINS] Archiving <https://builds.apache.org/job/Struts-examples-JDK7-master/ws/http-session/pom.xml>
to org.apache.struts/http-session/1.0.0/http-session-1.0.0.pom
No prior successful build to compare, so performing full copy of artifacts
[JENKINS] Archiving <https://builds.apache.org/job/Struts-examples-JDK7-master/ws/form-tags/pom.xml>
to org.apache.struts/form-tags/1.0.0/form-tags-1.0.0.pom
No prior successful build to compare, so performing full copy of artifacts
[JENKINS] Archiving <https://builds.apache.org/job/Struts-examples-JDK7-master/ws/wildcard-method-selection/pom.xml>
to org.apache.struts/wildcard-method-selection/1.0.0/wildcard-method-selection-1.0.0.pom
No prior successful build to compare, so performing full copy of artifacts
[JENKINS] Archiving <https://builds.apache.org/job/Struts-examples-JDK7-master/ws/form-xml-validation/pom.xml>
to org.apache.struts/form-xml-validation/1.0.0/form-xml-validation-1.0.0.pom
No prior successful build to compare, so performing full copy of artifacts
[JENKINS] Archiving <https://builds.apache.org/job/Struts-examples-JDK7-master/ws/exception-handling/pom.xml>
to org.apache.struts/exception-handling/1.0.0/exception-handling-1.0.0.pom
No prior successful build to compare, so performing full copy of artifacts
[JENKINS] Archiving <https://builds.apache.org/job/Struts-examples-JDK7-master/ws/using-tags/pom.xml>
to org.apache.struts/using-tags/1.0.0/using-tags-1.0.0.pom
No prior successful build to compare, so performing full copy of artifacts
[JENKINS] Archiving <https://builds.apache.org/job/Struts-examples-JDK7-master/ws/annotations/pom.xml>
to org.apache.struts/annotations/1.0.0/annotations-1.0.0.pom
No prior successful build to compare, so performing full copy of artifacts
[JENKINS] Archiving <https://builds.apache.org/job/Struts-examples-JDK7-master/ws/helloworld/pom.xml>
to org.apache.struts/helloworld/1.0.0/helloworld-1.0.0.pom
No prior successful build to compare, so performing full copy of artifacts
[JENKINS] Archiving <https://builds.apache.org/job/Struts-examples-JDK7-master/ws/tiles/pom.xml>
to org.apache.struts/tiles/1.0.0/tiles-1.0.0.pom
No prior successful build to compare, so performing full copy of artifacts
[JENKINS] Archiving <https://builds.apache.org/job/Struts-examples-JDK7-master/ws/message-resource/pom.xml>
to org.apache.struts/message-resource/1.0.0/message-resource-1.0.0.pom
No prior successful build to compare, so performing full copy of artifacts
[JENKINS] Archiving <https://builds.apache.org/job/Struts-examples-JDK7-master/ws/jboss-blank/pom.xml>
to org.apache.struts/struts2-jboss-blank/1.0.0/struts2-jboss-blank-1.0.0.pom
No prior successful build to compare, so performing full copy of artifacts
[JENKINS] Archiving <https://builds.apache.org/job/Struts-examples-JDK7-master/ws/interceptors/pom.xml>
to org.apache.struts/interceptors/1.0.0/interceptors-1.0.0.pom
No prior successful build to compare, so performing full copy of artifacts
[JENKINS] Archiving <https://builds.apache.org/job/Struts-examples-JDK7-master/ws/preparable-interface/pom.xml>
to org.apache.struts/preparable-interface/1.0.0/preparable-interface-1.0.0.pom
No prior successful build to compare, so performing full copy of artifacts
[JENKINS] Archiving <https://builds.apache.org/job/Struts-examples-JDK7-master/ws/unit-testing/pom.xml>
to org.apache.struts/unit-testing/1.0.0/unit-testing-1.0.0.pom
No prior successful build to compare, so performing full copy of artifacts
[JENKINS] Archiving <https://builds.apache.org/job/Struts-examples-JDK7-master/ws/control-tags/pom.xml>
to org.apache.struts/control-tags/1.0.0/control-tags-1.0.0.pom
No prior successful build to compare, so performing full copy of artifacts
[JENKINS] Archiving <https://builds.apache.org/job/Struts-examples-JDK7-master/ws/bean-validation/pom.xml>
to org.apache.struts/bean-validation/1.0.0/bean-validation-1.0.0.pom
No prior successful build to compare, so performing full copy of artifacts
[JENKINS] Archiving <https://builds.apache.org/job/Struts-examples-JDK7-master/ws/coding-actions/pom.xml>
to org.apache.struts/coding-actions/1.0.0/coding-actions-1.0.0.pom
No prior successful build to compare, so performing full copy of artifacts
[JENKINS] Archiving <https://builds.apache.org/job/Struts-examples-JDK7-master/ws/rest-angular/pom.xml>
to org.apache.struts/rest-angular/1.0.0/rest-angular-1.0.0.pom
No prior successful build to compare, so performing full copy of artifacts
[JENKINS] Archiving <https://builds.apache.org/job/Struts-examples-JDK7-master/ws/mailreader/pom.xml>
to org.apache.struts/mailreader/1.0.0/mailreader-1.0.0.pom
No prior successful build to compare, so performing full copy of artifacts
[JENKINS] Archiving <https://builds.apache.org/job/Struts-examples-JDK7-master/ws/themes/pom.xml>
to org.apache.struts/themes/1.0.0/themes-1.0.0.pom
No prior successful build to compare, so performing full copy of artifacts
[JENKINS] Archiving <https://builds.apache.org/job/Struts-examples-JDK7-master/ws/debugging-struts/pom.xml>
to org.apache.struts/debugging-struts/1.0.0/debugging-struts-1.0.0.pom
No prior successful build to compare, so performing full copy of artifacts
[JENKINS] Archiving <https://builds.apache.org/job/Struts-examples-JDK7-master/ws/pom.xml>
to org.apache.struts/struts-examples/1.0.0/struts-examples-1.0.0.pom
No prior successful build to compare, so performing full copy of artifacts
[JENKINS] Archiving <https://builds.apache.org/job/Struts-examples-JDK7-master/ws/form-processing/pom.xml>
to org.apache.struts/form-processing/1.0.0/form-processing-1.0.0.pom
No prior successful build to compare, so performing full copy of artifacts
[JENKINS] Archiving <https://builds.apache.org/job/Struts-examples-JDK7-master/ws/blank/pom.xml>
to org.apache.struts/struts2-blank/1.0.0/struts2-blank-1.0.0.pom
No prior successful build to compare, so performing full copy of artifacts
[JENKINS] Archiving <https://builds.apache.org/job/Struts-examples-JDK7-master/ws/exclude-parameters/pom.xml>
to org.apache.struts/exclude-parameters/1.0.0/exclude-parameters-1.0.0.pom
No prior successful build to compare, so performing full copy of artifacts
[locks-and-latches] Releasing all the locks
[locks-and-latches] All the locks released
channel stopped

---------------------------------------------------------------------
To unsubscribe, e-mail: dev-unsubscribe@struts.apache.org
For additional commands, e-mail: dev-help@struts.apache.org


Mime
View raw message