struts-dev mailing list archives

Site index · List index
Message view « Date » · « Thread »
Top « Date » · « Thread »
From Apache Jenkins Server <jenk...@builds.apache.org>
Subject Build failed in Jenkins: Struts-examples-JDK8-master #21
Date Wed, 13 Jan 2016 16:30:05 GMT
See <https://builds.apache.org/job/Struts-examples-JDK8-master/21/changes>

Changes:

[Lukasz Lenart] Switches to Log4j2

[Lukasz Lenart] Cleans up pom

[Lukasz Lenart] Uses proper filter

[Lukasz Lenart] Switches to snapshot version

------------------------------------------
[...truncated 2290 lines...]
[WARNING] Excluding <https://builds.apache.org/job/Struts-examples-JDK8-master/ws/rest-angular/src/main/webapp/js/lib/angular/i18n/angular-locale_pt-br.js>
[WARNING] Excluding <https://builds.apache.org/job/Struts-examples-JDK8-master/ws/rest-angular/src/main/webapp/js/lib/angular/i18n/angular-locale_lu-cd.js>
[WARNING] Excluding <https://builds.apache.org/job/Struts-examples-JDK8-master/ws/rest-angular/src/main/webapp/js/lib/angular/i18n/angular-locale_ca-it.js>
[WARNING] Excluding <https://builds.apache.org/job/Struts-examples-JDK8-master/ws/rest-angular/src/main/webapp/js/lib/angular/i18n/angular-locale_agq.js>
[WARNING] Excluding <https://builds.apache.org/job/Struts-examples-JDK8-master/ws/rest-angular/src/main/webapp/js/lib/angular/i18n/angular-locale_es-cl.js>
[WARNING] Excluding <https://builds.apache.org/job/Struts-examples-JDK8-master/ws/rest-angular/src/main/webapp/js/lib/angular/i18n/angular-locale_en-mh.js>
[WARNING] Excluding <https://builds.apache.org/job/Struts-examples-JDK8-master/ws/rest-angular/src/main/webapp/js/lib/angular/i18n/angular-locale_zh-tw.js>
[WARNING] Excluding <https://builds.apache.org/job/Struts-examples-JDK8-master/ws/rest-angular/src/main/webapp/js/lib/angular/i18n/angular-locale_af-za.js>
[WARNING] Excluding <https://builds.apache.org/job/Struts-examples-JDK8-master/ws/rest-angular/src/main/webapp/js/lib/angular/i18n/angular-locale_ar-mr.js>
[WARNING] Excluding <https://builds.apache.org/job/Struts-examples-JDK8-master/ws/rest-angular/src/main/webapp/js/lib/angular/i18n/angular-locale_ha-latn-ne.js>
[WARNING] Excluding <https://builds.apache.org/job/Struts-examples-JDK8-master/ws/rest-angular/src/main/webapp/js/lib/angular/i18n/angular-locale_es-ic.js>
[WARNING] Excluding <https://builds.apache.org/job/Struts-examples-JDK8-master/ws/rest-angular/src/main/webapp/js/lib/angular/i18n/angular-locale_az-latn.js>
[WARNING] Excluding <https://builds.apache.org/job/Struts-examples-JDK8-master/ws/rest-angular/src/main/webapp/js/lib/angular/i18n/angular-locale_swc.js>
[WARNING] Excluding <https://builds.apache.org/job/Struts-examples-JDK8-master/ws/rest-angular/src/main/webapp/js/lib/angular/i18n/angular-locale_en-pr.js>
[WARNING] Excluding <https://builds.apache.org/job/Struts-examples-JDK8-master/ws/rest-angular/src/main/webapp/js/lib/angular/angular-sanitize.js>
[WARNING] Excluding <https://builds.apache.org/job/Struts-examples-JDK8-master/ws/rest-angular/src/main/webapp/js/lib/angular/angular-touch.min.js>
[WARNING] Excluding <https://builds.apache.org/job/Struts-examples-JDK8-master/ws/rest-angular/src/main/webapp/js/lib/angular/angular-resource.min.js>
[WARNING] Excluding <https://builds.apache.org/job/Struts-examples-JDK8-master/ws/rest-angular/src/main/webapp/js/lib/ui-bootstrap-tpls-0.13.3.min.js>
[WARNING] Excluding <https://builds.apache.org/job/Struts-examples-JDK8-master/ws/rest-angular/src/main/webapp/js/lib/angular-translate-loader-url.min.js>
[INFO]   <https://builds.apache.org/job/Struts-examples-JDK8-master/ws/rest-angular/src/main/webapp/js/services/DataService.js>
[no change]
[INFO]   <https://builds.apache.org/job/Struts-examples-JDK8-master/ws/rest-angular/src/main/webapp/js/config.js>
[no change]
[INFO]   <https://builds.apache.org/job/Struts-examples-JDK8-master/ws/rest-angular/src/main/webapp/js/app.js>
[no change]
[INFO]   <https://builds.apache.org/job/Struts-examples-JDK8-master/ws/rest-angular/src/main/webapp/js/controllers/OrderAddController.js>
[no change]
[INFO]   <https://builds.apache.org/job/Struts-examples-JDK8-master/ws/rest-angular/src/main/webapp/js/controllers/AppController.js>
[no change]
[INFO]   <https://builds.apache.org/job/Struts-examples-JDK8-master/ws/rest-angular/src/main/webapp/js/controllers/OrderEditController.js>
[no change]
[INFO]   <https://builds.apache.org/job/Struts-examples-JDK8-master/ws/rest-angular/src/main/webapp/js/controllers/OrdersController.js>
[no change]
[INFO]   <https://builds.apache.org/job/Struts-examples-JDK8-master/ws/rest-angular/src/main/webapp/js/controllers/OrderDetailController.js>
[no change]
[INFO] 
[INFO] --- maven-resources-plugin:2.6:testResources (default-testResources) @ rest-angular
---
[INFO] Using 'UTF-8' encoding to copy filtered resources.
[INFO] Copying 1 resource
[INFO] 
[INFO] --- maven-compiler-plugin:3.3:testCompile (default-testCompile) @ rest-angular ---
[INFO] Nothing to compile - all classes are up to date
[INFO] 
[INFO] --- maven-surefire-plugin:2.12.4:test (default-test) @ rest-angular ---
[INFO] Surefire report directory: <https://builds.apache.org/job/Struts-examples-JDK8-master/ws/rest-angular/target/surefire-reports>

-------------------------------------------------------
 T E S T S
-------------------------------------------------------
org.apache.maven.surefire.util.SurefireReflectionException: java.lang.reflect.InvocationTargetException;
nested exception is java.lang.reflect.InvocationTargetException: null
java.lang.reflect.InvocationTargetException
	at sun.reflect.NativeMethodAccessorImpl.invoke0(Native Method)
	at sun.reflect.NativeMethodAccessorImpl.invoke(NativeMethodAccessorImpl.java:62)
	at sun.reflect.DelegatingMethodAccessorImpl.invoke(DelegatingMethodAccessorImpl.java:43)
	at java.lang.reflect.Method.invoke(Method.java:497)
	at org.apache.maven.surefire.util.ReflectionUtils.invokeMethodWithArray(ReflectionUtils.java:189)
	at org.apache.maven.surefire.booter.ProviderFactory$ProviderProxy.invoke(ProviderFactory.java:165)
	at org.apache.maven.surefire.booter.ProviderFactory.invokeProvider(ProviderFactory.java:85)
	at org.apache.maven.surefire.booter.ForkedBooter.runSuitesInProcess(ForkedBooter.java:115)
	at org.apache.maven.surefire.booter.ForkedBooter.main(ForkedBooter.java:75)
Caused by: java.lang.NoClassDefFoundError: org/apache/struts2/StrutsRestTestCase
	at java.lang.ClassLoader.defineClass1(Native Method)
	at java.lang.ClassLoader.defineClass(ClassLoader.java:760)
	at java.security.SecureClassLoader.defineClass(SecureClassLoader.java:142)
	at java.net.URLClassLoader.defineClass(URLClassLoader.java:467)
	at java.net.URLClassLoader.access$100(URLClassLoader.java:73)
	at java.net.URLClassLoader$1.run(URLClassLoader.java:368)
	at java.net.URLClassLoader$1.run(URLClassLoader.java:362)
	at java.security.AccessController.doPrivileged(Native Method)
	at java.net.URLClassLoader.findClass(URLClassLoader.java:361)
	at java.lang.ClassLoader.loadClass(ClassLoader.java:424)
	at sun.misc.Launcher$AppClassLoader.loadClass(Launcher.java:331)
	at java.lang.ClassLoader.loadClass(ClassLoader.java:357)
	at org.apache.maven.surefire.util.DefaultScanResult.loadClass(DefaultScanResult.java:131)
	at org.apache.maven.surefire.util.DefaultScanResult.applyFilter(DefaultScanResult.java:95)
	at org.apache.maven.surefire.junit4.JUnit4Provider.scanClassPath(JUnit4Provider.java:194)
	at org.apache.maven.surefire.junit4.JUnit4Provider.invoke(JUnit4Provider.java:92)
	... 9 more
Caused by: java.lang.ClassNotFoundException: org.apache.struts2.StrutsRestTestCase
	at java.net.URLClassLoader.findClass(URLClassLoader.java:381)
	at java.lang.ClassLoader.loadClass(ClassLoader.java:424)
	at sun.misc.Launcher$AppClassLoader.loadClass(Launcher.java:331)
	at java.lang.ClassLoader.loadClass(ClassLoader.java:357)
	... 25 more

Results :

Tests run: 0, Failures: 0, Errors: 0, Skipped: 0

[JENKINS] Recording test results
hudson.AbortException: Test reports were found but none of them are new. Did tests run? 
For example, <https://builds.apache.org/job/Struts-examples-JDK8-master/ws/rest-angular/target/surefire-reports/TEST-org.apache.examples.struts.actions.IndexControllerTest.xml>
is 2 days 1 hr old

	at hudson.tasks.junit.TestResult.parse(TestResult.java:212)
	at hudson.maven.reporters.SurefireArchiver.postExecute(SurefireArchiver.java:148)
	at hudson.maven.Maven3Builder$MavenExecutionListener.recordMojoEnded(Maven3Builder.java:634)
	at hudson.maven.Maven3Builder$MavenExecutionListener.mojoFailed(Maven3Builder.java:667)
	at hudson.maven.Maven3Builder$JenkinsEventSpy.onEvent(Maven3Builder.java:311)
	at org.apache.maven.eventspy.internal.EventSpyDispatcher.onEvent(EventSpyDispatcher.java:108)
	at org.apache.maven.eventspy.internal.EventSpyExecutionListener.mojoFailed(EventSpyExecutionListener.java:138)
	at org.apache.maven.lifecycle.internal.DefaultExecutionEventCatapult.fire(DefaultExecutionEventCatapult.java:90)
	at org.apache.maven.lifecycle.internal.MojoExecutor.execute(MojoExecutor.java:231)
	at org.apache.maven.lifecycle.internal.MojoExecutor.execute(MojoExecutor.java:153)
	at org.apache.maven.lifecycle.internal.MojoExecutor.execute(MojoExecutor.java:145)
	at org.apache.maven.lifecycle.internal.LifecycleModuleBuilder.buildProject(LifecycleModuleBuilder.java:108)
	at org.apache.maven.lifecycle.internal.LifecycleModuleBuilder.buildProject(LifecycleModuleBuilder.java:76)
	at org.apache.maven.lifecycle.internal.builder.singlethreaded.SingleThreadedBuilder.build(SingleThreadedBuilder.java:51)
	at org.apache.maven.lifecycle.internal.LifecycleStarter.execute(LifecycleStarter.java:116)
	at org.apache.maven.DefaultMaven.doExecute(DefaultMaven.java:361)
	at org.apache.maven.DefaultMaven.execute(DefaultMaven.java:155)
	at org.jvnet.hudson.maven3.launcher.Maven32Launcher.main(Maven32Launcher.java:132)
	at sun.reflect.NativeMethodAccessorImpl.invoke0(Native Method)
	at sun.reflect.NativeMethodAccessorImpl.invoke(NativeMethodAccessorImpl.java:62)
	at sun.reflect.DelegatingMethodAccessorImpl.invoke(DelegatingMethodAccessorImpl.java:43)
	at java.lang.reflect.Method.invoke(Method.java:497)
	at org.codehaus.plexus.classworlds.launcher.Launcher.launchStandard(Launcher.java:330)
	at org.codehaus.plexus.classworlds.launcher.Launcher.launch(Launcher.java:238)
	at jenkins.maven3.agent.Maven32Main.launch(Maven32Main.java:186)
	at sun.reflect.NativeMethodAccessorImpl.invoke0(Native Method)
	at sun.reflect.NativeMethodAccessorImpl.invoke(NativeMethodAccessorImpl.java:62)
	at sun.reflect.DelegatingMethodAccessorImpl.invoke(DelegatingMethodAccessorImpl.java:43)
	at java.lang.reflect.Method.invoke(Method.java:497)
	at hudson.maven.Maven3Builder.call(Maven3Builder.java:136)
	at hudson.maven.Maven3Builder.call(Maven3Builder.java:71)
	at hudson.remoting.UserRequest.perform(UserRequest.java:121)
	at hudson.remoting.UserRequest.perform(UserRequest.java:49)
	at hudson.remoting.Request$2.run(Request.java:326)
	at hudson.remoting.InterceptingExecutorService$1.call(InterceptingExecutorService.java:68)
	at java.util.concurrent.FutureTask.run(FutureTask.java:266)
	at java.util.concurrent.ThreadPoolExecutor.runWorker(ThreadPoolExecutor.java:1142)
	at java.util.concurrent.ThreadPoolExecutor$Worker.run(ThreadPoolExecutor.java:617)
	at java.lang.Thread.run(Thread.java:745)
[INFO] ------------------------------------------------------------------------
[INFO] Reactor Summary:
[INFO] 
[INFO] Struts 2 Examples ................................. SUCCESS [  0.454 s]
[INFO] Annotations with Convention Plugin ................ SUCCESS [  5.445 s]
[INFO] Basic Struts2 Example ............................. SUCCESS [  1.270 s]
[INFO] Bean Validation ................................... SUCCESS [  1.697 s]
[INFO] Struts 2 Blank Webapp ............................. SUCCESS [ 12.229 s]
[INFO] Coding Struts 2 Action ............................ SUCCESS [  1.131 s]
[INFO] Control Tags ...................................... SUCCESS [  1.245 s]
[INFO] Debugging Struts .................................. SUCCESS [  1.363 s]
[INFO] Exception handling ................................ SUCCESS [  1.240 s]
[INFO] exclude-parameters ................................ SUCCESS [  1.195 s]
[INFO] Form Processing ................................... SUCCESS [  1.173 s]
[INFO] Form Tags ......................................... SUCCESS [  1.189 s]
[INFO] Form validation ................................... SUCCESS [  1.232 s]
[INFO] XML based form validation ......................... SUCCESS [  1.227 s]
[INFO] Hello World Struts 2 Example Application .......... SUCCESS [  1.171 s]
[INFO] http-session ...................................... SUCCESS [  1.125 s]
[INFO] Struts 2 Interceptors ............................. SUCCESS [  1.208 s]
[INFO] Struts 2 JBoss Blank Webapp ....................... SUCCESS [  3.258 s]
[INFO] Struts 2 Mail Reader Webapp ....................... SUCCESS [  1.505 s]
[INFO] Message resource .................................. SUCCESS [  1.144 s]
[INFO] Preparable Interface .............................. SUCCESS [  1.218 s]
[INFO] REST to Action Mapper Example Application ......... SUCCESS [  1.116 s]
[INFO] REST Plugin based application with AngularJS frontend  FAILURE [  4.381 s]
[INFO] Struts2 with Spring Integration ................... SKIPPED
[INFO] Struts Tiles Example .............................. SKIPPED
[INFO] Struts 2 Themes ................................... SKIPPED
[INFO] Struts 2 Themes Override .......................... SKIPPED
[INFO] Using Struts 2 Tags ............................... SKIPPED
[INFO] Unit Testing ...................................... SKIPPED
[INFO] Wildcard Method Selection ......................... SKIPPED
[INFO] ------------------------------------------------------------------------
[INFO] BUILD FAILURE
[INFO] ------------------------------------------------------------------------
[INFO] Total time: 01:04 min
[INFO] Finished at: 2016-01-13T16:29:51+00:00
[INFO] Final Memory: 25M/268M
[INFO] ------------------------------------------------------------------------
[ERROR] Failed to execute goal org.apache.maven.plugins:maven-surefire-plugin:2.12.4:test
(default-test) on project rest-angular: Execution default-test of goal org.apache.maven.plugins:maven-surefire-plugin:2.12.4:test
failed: The forked VM terminated without saying properly goodbye. VM crash or System.exit
called ? -> [Help 1]
[ERROR] 
[ERROR] To see the full stack trace of the errors, re-run Maven with the -e switch.
[ERROR] Re-run Maven using the -X switch to enable full debug logging.
[ERROR] 
[ERROR] For more information about the errors and possible solutions, please read the following
articles:
[ERROR] [Help 1] http://cwiki.apache.org/confluence/display/MAVEN/PluginExecutionException
[ERROR] 
[ERROR] After correcting the problems, you can resume the build with the command
[ERROR]   mvn <goals> -rf :rest-angular
[JENKINS] Archiving <https://builds.apache.org/job/Struts-examples-JDK8-master/ws/form-validation/pom.xml>
to org.apache.struts/form-validation/1.0.0/form-validation-1.0.0.pom
[JENKINS] Archiving <https://builds.apache.org/job/Struts-examples-JDK8-master/ws/form-validation/target/form_validation.war>
to org.apache.struts/form-validation/1.0.0/form-validation-1.0.0.war
Compressed 5.97 MB of artifacts by 77.0% relative to #20
[JENKINS] Archiving <https://builds.apache.org/job/Struts-examples-JDK8-master/ws/restful2actionmapper/pom.xml>
to org.apache.struts/restful2actionmapper/1.0.0/restful2actionmapper-1.0.0.pom
[JENKINS] Archiving <https://builds.apache.org/job/Struts-examples-JDK8-master/ws/restful2actionmapper/target/reststyleactionmapper.war>
to org.apache.struts/restful2actionmapper/1.0.0/restful2actionmapper-1.0.0.war
Compressed 5.96 MB of artifacts by 77.0% relative to #20
[JENKINS] Archiving <https://builds.apache.org/job/Struts-examples-JDK8-master/ws/spring-struts/pom.xml>
to org.apache.struts/spring-struts/1.0.0/spring-struts-1.0.0.pom
[JENKINS] Archiving <https://builds.apache.org/job/Struts-examples-JDK8-master/ws/basic-struts/pom.xml>
to org.apache.struts/basic-struts/1.0.0/basic-struts-1.0.0.pom
[JENKINS] Archiving <https://builds.apache.org/job/Struts-examples-JDK8-master/ws/basic-struts/target/basic-struts.war>
to org.apache.struts/basic-struts/1.0.0/basic-struts-1.0.0.war
Compressed 5.96 MB of artifacts by 77.1% relative to #20
[JENKINS] Archiving <https://builds.apache.org/job/Struts-examples-JDK8-master/ws/themes-override/pom.xml>
to org.apache.struts/themes-override/1.0.0/themes-override-1.0.0.pom
[JENKINS] Archiving <https://builds.apache.org/job/Struts-examples-JDK8-master/ws/http-session/pom.xml>
to org.apache.struts/http-session/1.0.0/http-session-1.0.0.pom
[JENKINS] Archiving <https://builds.apache.org/job/Struts-examples-JDK8-master/ws/http-session/target/http-session.war>
to org.apache.struts/http-session/1.0.0/http-session-1.0.0.war
Compressed 5.97 MB of artifacts by 77.0% relative to #20
[JENKINS] Archiving <https://builds.apache.org/job/Struts-examples-JDK8-master/ws/form-tags/pom.xml>
to org.apache.struts/form-tags/1.0.0/form-tags-1.0.0.pom
[JENKINS] Archiving <https://builds.apache.org/job/Struts-examples-JDK8-master/ws/form-tags/target/form-tags.war>
to org.apache.struts/form-tags/1.0.0/form-tags-1.0.0.war
Compressed 5.97 MB of artifacts by 77.0% relative to #20
[JENKINS] Archiving <https://builds.apache.org/job/Struts-examples-JDK8-master/ws/wildcard-method-selection/pom.xml>
to org.apache.struts/wildcard-method-selection/1.0.0/wildcard-method-selection-1.0.0.pom
[JENKINS] Archiving <https://builds.apache.org/job/Struts-examples-JDK8-master/ws/form-xml-validation/pom.xml>
to org.apache.struts/form-xml-validation/1.0.0/form-xml-validation-1.0.0.pom
[JENKINS] Archiving <https://builds.apache.org/job/Struts-examples-JDK8-master/ws/form-xml-validation/target/form-xml-validation.war>
to org.apache.struts/form-xml-validation/1.0.0/form-xml-validation-1.0.0.war
Compressed 5.97 MB of artifacts by 77.0% relative to #20
[JENKINS] Archiving <https://builds.apache.org/job/Struts-examples-JDK8-master/ws/exception-handling/pom.xml>
to org.apache.struts/exception-handling/1.0.0/exception-handling-1.0.0.pom
[JENKINS] Archiving <https://builds.apache.org/job/Struts-examples-JDK8-master/ws/exception-handling/target/exception-handling.war>
to org.apache.struts/exception-handling/1.0.0/exception-handling-1.0.0.war
Compressed 5.97 MB of artifacts by 76.9% relative to #20
[JENKINS] Archiving <https://builds.apache.org/job/Struts-examples-JDK8-master/ws/using-tags/pom.xml>
to org.apache.struts/using-tags/1.0.0/using-tags-1.0.0.pom
[JENKINS] Archiving <https://builds.apache.org/job/Struts-examples-JDK8-master/ws/annotations/pom.xml>
to org.apache.struts/annotations/1.0.0/annotations-1.0.0.pom
[JENKINS] Archiving <https://builds.apache.org/job/Struts-examples-JDK8-master/ws/annotations/target/annotations.war>
to org.apache.struts/annotations/1.0.0/annotations-1.0.0.war
Compressed 6.09 MB of artifacts by 76.0% relative to #20
[JENKINS] Archiving <https://builds.apache.org/job/Struts-examples-JDK8-master/ws/helloworld/pom.xml>
to org.apache.struts/helloworld/1.0.0/helloworld-1.0.0.pom
[JENKINS] Archiving <https://builds.apache.org/job/Struts-examples-JDK8-master/ws/helloworld/target/hello-world.war>
to org.apache.struts/helloworld/1.0.0/helloworld-1.0.0.war
Compressed 5.96 MB of artifacts by 77.0% relative to #20
[JENKINS] Archiving <https://builds.apache.org/job/Struts-examples-JDK8-master/ws/tiles/pom.xml>
to org.apache.struts/tiles/1.0.0/tiles-1.0.0.pom
[JENKINS] Archiving <https://builds.apache.org/job/Struts-examples-JDK8-master/ws/message-resource/pom.xml>
to org.apache.struts/message-resource/1.0.0/message-resource-1.0.0.pom
[JENKINS] Archiving <https://builds.apache.org/job/Struts-examples-JDK8-master/ws/message-resource/target/message-resource.war>
to org.apache.struts/message-resource/1.0.0/message-resource-1.0.0.war
Compressed 5.97 MB of artifacts by 77.0% relative to #20
[JENKINS] Archiving <https://builds.apache.org/job/Struts-examples-JDK8-master/ws/jboss-blank/pom.xml>
to org.apache.struts/struts2-jboss-blank/1.0.0/struts2-jboss-blank-1.0.0.pom
[JENKINS] Archiving <https://builds.apache.org/job/Struts-examples-JDK8-master/ws/jboss-blank/target/struts2-jboss-blank-1.0.0.war>
to org.apache.struts/struts2-jboss-blank/1.0.0/struts2-jboss-blank-1.0.0.war
Compressed 5.97 MB of artifacts by 76.9% relative to #20
[JENKINS] Archiving <https://builds.apache.org/job/Struts-examples-JDK8-master/ws/interceptors/pom.xml>
to org.apache.struts/interceptors/1.0.0/interceptors-1.0.0.pom
[JENKINS] Archiving <https://builds.apache.org/job/Struts-examples-JDK8-master/ws/interceptors/target/interceptors.war>
to org.apache.struts/interceptors/1.0.0/interceptors-1.0.0.war
Compressed 5.97 MB of artifacts by 77.0% relative to #20
[JENKINS] Archiving <https://builds.apache.org/job/Struts-examples-JDK8-master/ws/preparable-interface/pom.xml>
to org.apache.struts/preparable-interface/1.0.0/preparable-interface-1.0.0.pom
[JENKINS] Archiving <https://builds.apache.org/job/Struts-examples-JDK8-master/ws/preparable-interface/target/preparable-interface.war>
to org.apache.struts/preparable-interface/1.0.0/preparable-interface-1.0.0.war
Compressed 5.97 MB of artifacts by 76.9% relative to #20
[JENKINS] Archiving <https://builds.apache.org/job/Struts-examples-JDK8-master/ws/unit-testing/pom.xml>
to org.apache.struts/unit-testing/1.0.0/unit-testing-1.0.0.pom
[JENKINS] Archiving <https://builds.apache.org/job/Struts-examples-JDK8-master/ws/control-tags/pom.xml>
to org.apache.struts/control-tags/1.0.0/control-tags-1.0.0.pom
[JENKINS] Archiving <https://builds.apache.org/job/Struts-examples-JDK8-master/ws/control-tags/target/control-tags.war>
to org.apache.struts/control-tags/1.0.0/control-tags-1.0.0.war
Compressed 5.97 MB of artifacts by 77.0% relative to #20
[JENKINS] Archiving <https://builds.apache.org/job/Struts-examples-JDK8-master/ws/bean-validation/pom.xml>
to org.apache.struts/bean-validation/1.0.0/bean-validation-1.0.0.pom
[JENKINS] Archiving <https://builds.apache.org/job/Struts-examples-JDK8-master/ws/bean-validation/target/bean-validation.war>
to org.apache.struts/bean-validation/1.0.0/bean-validation-1.0.0.war
Compressed 7.23 MB of artifacts by 80.4% relative to #20
[JENKINS] Archiving <https://builds.apache.org/job/Struts-examples-JDK8-master/ws/coding-actions/pom.xml>
to org.apache.struts/coding-actions/1.0.0/coding-actions-1.0.0.pom
[JENKINS] Archiving <https://builds.apache.org/job/Struts-examples-JDK8-master/ws/coding-actions/target/coding-actions.war>
to org.apache.struts/coding-actions/1.0.0/coding-actions-1.0.0.war
Compressed 5.96 MB of artifacts by 77.0% relative to #20
[JENKINS] Archiving <https://builds.apache.org/job/Struts-examples-JDK8-master/ws/rest-angular/pom.xml>
to org.apache.struts/rest-angular/1.0.0/rest-angular-1.0.0.pom
[JENKINS] Archiving <https://builds.apache.org/job/Struts-examples-JDK8-master/ws/mailreader/pom.xml>
to org.apache.struts/mailreader/1.0.0/mailreader-1.0.0.pom
[JENKINS] Archiving <https://builds.apache.org/job/Struts-examples-JDK8-master/ws/mailreader/target/mailreader-1.0.0.war>
to org.apache.struts/mailreader/1.0.0/mailreader-1.0.0.war
Compressed 6.52 MB of artifacts by 79.0% relative to #20
[JENKINS] Archiving <https://builds.apache.org/job/Struts-examples-JDK8-master/ws/themes/pom.xml>
to org.apache.struts/themes/1.0.0/themes-1.0.0.pom
[JENKINS] Archiving <https://builds.apache.org/job/Struts-examples-JDK8-master/ws/debugging-struts/pom.xml>
to org.apache.struts/debugging-struts/1.0.0/debugging-struts-1.0.0.pom
[JENKINS] Archiving <https://builds.apache.org/job/Struts-examples-JDK8-master/ws/debugging-struts/target/debugging-struts.war>
to org.apache.struts/debugging-struts/1.0.0/debugging-struts-1.0.0.war
Compressed 6.05 MB of artifacts by 76.0% relative to #20
[JENKINS] Archiving <https://builds.apache.org/job/Struts-examples-JDK8-master/ws/pom.xml>
to org.apache.struts/struts-examples/1.0.0/struts-examples-1.0.0.pom
[JENKINS] Archiving <https://builds.apache.org/job/Struts-examples-JDK8-master/ws/form-processing/pom.xml>
to org.apache.struts/form-processing/1.0.0/form-processing-1.0.0.pom
[JENKINS] Archiving <https://builds.apache.org/job/Struts-examples-JDK8-master/ws/form-processing/target/form-processing.war>
to org.apache.struts/form-processing/1.0.0/form-processing-1.0.0.war
Compressed 5.97 MB of artifacts by 77.0% relative to #20
[JENKINS] Archiving <https://builds.apache.org/job/Struts-examples-JDK8-master/ws/blank/pom.xml>
to org.apache.struts/struts2-blank/1.0.0/struts2-blank-1.0.0.pom
[JENKINS] Archiving <https://builds.apache.org/job/Struts-examples-JDK8-master/ws/blank/target/struts2-blank-1.0.0.war>
to org.apache.struts/struts2-blank/1.0.0/struts2-blank-1.0.0.war
Compressed 5.97 MB of artifacts by 76.9% relative to #20
[JENKINS] Archiving <https://builds.apache.org/job/Struts-examples-JDK8-master/ws/exclude-parameters/pom.xml>
to org.apache.struts/exclude-parameters/1.0.0/exclude-parameters-1.0.0.pom
[JENKINS] Archiving <https://builds.apache.org/job/Struts-examples-JDK8-master/ws/exclude-parameters/target/exclude-parameters.war>
to org.apache.struts/exclude-parameters/1.0.0/exclude-parameters-1.0.0.war
Compressed 5.97 MB of artifacts by 76.9% relative to #20
[locks-and-latches] Releasing all the locks
[locks-and-latches] All the locks released
channel stopped

---------------------------------------------------------------------
To unsubscribe, e-mail: dev-unsubscribe@struts.apache.org
For additional commands, e-mail: dev-help@struts.apache.org


Mime
View raw message