struts-dev mailing list archives

Site index · List index
Message view « Date » · « Thread »
Top « Date » · « Thread »
From Apache Jenkins Server <jenk...@builds.apache.org>
Subject Build failed in Jenkins: Struts-JDK8-master #78
Date Tue, 19 Jan 2016 22:56:48 GMT
See <https://builds.apache.org/job/Struts-JDK8-master/78/changes>

Changes:

[cnenning] Adds new result 'JSONActionRedirectResult' to json-plugin. Contains

[cnenning] made methods non static and private, javadoc updates

[cnenning] increased visibilty of methods and constants for better extensibility

------------------------------------------
[...truncated 90694 lines...]
[INFO] Uploaded: https://repository.apache.org/content/repositories/snapshots/org/apache/struts/struts2-dwr-plugin/2.5-SNAPSHOT/struts2-dwr-plugin-2.5-20160119.225058-131.jar
(11 KB at 71.8 KB/sec)
[INFO] Uploading: https://repository.apache.org/content/repositories/snapshots/org/apache/struts/struts2-dwr-plugin/2.5-SNAPSHOT/struts2-dwr-plugin-2.5-20160119.225058-131.pom
[INFO] Uploaded: https://repository.apache.org/content/repositories/snapshots/org/apache/struts/struts2-dwr-plugin/2.5-SNAPSHOT/struts2-dwr-plugin-2.5-20160119.225058-131.pom
(2 KB at 11.9 KB/sec)
[INFO] Downloading: https://repository.apache.org/content/repositories/snapshots/org/apache/struts/struts2-dwr-plugin/maven-metadata.xml
[INFO] Downloaded: https://repository.apache.org/content/repositories/snapshots/org/apache/struts/struts2-dwr-plugin/maven-metadata.xml
(2 KB at 8.3 KB/sec)
[INFO] Uploading: https://repository.apache.org/content/repositories/snapshots/org/apache/struts/struts2-dwr-plugin/2.5-SNAPSHOT/maven-metadata.xml
[INFO] Uploaded: https://repository.apache.org/content/repositories/snapshots/org/apache/struts/struts2-dwr-plugin/2.5-SNAPSHOT/maven-metadata.xml
(2 KB at 7.3 KB/sec)
[INFO] Uploading: https://repository.apache.org/content/repositories/snapshots/org/apache/struts/struts2-dwr-plugin/maven-metadata.xml
[INFO] Uploaded: https://repository.apache.org/content/repositories/snapshots/org/apache/struts/struts2-dwr-plugin/maven-metadata.xml
(2 KB at 6.6 KB/sec)
[INFO] Uploading: https://repository.apache.org/content/repositories/snapshots/org/apache/struts/struts2-dwr-plugin/2.5-SNAPSHOT/struts2-dwr-plugin-2.5-20160119.225058-131-sources.jar
[INFO] Uploaded: https://repository.apache.org/content/repositories/snapshots/org/apache/struts/struts2-dwr-plugin/2.5-SNAPSHOT/struts2-dwr-plugin-2.5-20160119.225058-131-sources.jar
(8 KB at 48.3 KB/sec)
[INFO] Uploading: https://repository.apache.org/content/repositories/snapshots/org/apache/struts/struts2-dwr-plugin/2.5-SNAPSHOT/maven-metadata.xml
[INFO] Uploaded: https://repository.apache.org/content/repositories/snapshots/org/apache/struts/struts2-dwr-plugin/2.5-SNAPSHOT/maven-metadata.xml
(2 KB at 9.2 KB/sec)
[INFO] Uploading: https://repository.apache.org/content/repositories/snapshots/org/apache/struts/struts2-dwr-plugin/2.5-SNAPSHOT/struts2-dwr-plugin-2.5-20160119.225058-131-javadoc.jar
[INFO] Uploaded: https://repository.apache.org/content/repositories/snapshots/org/apache/struts/struts2-dwr-plugin/2.5-SNAPSHOT/struts2-dwr-plugin-2.5-20160119.225058-131-javadoc.jar
(32 KB at 200.4 KB/sec)
[INFO] Uploading: https://repository.apache.org/content/repositories/snapshots/org/apache/struts/struts2-dwr-plugin/2.5-SNAPSHOT/maven-metadata.xml
[INFO] Uploaded: https://repository.apache.org/content/repositories/snapshots/org/apache/struts/struts2-dwr-plugin/2.5-SNAPSHOT/maven-metadata.xml
(2 KB at 8.8 KB/sec)
[INFO]                                                                         
[INFO] ------------------------------------------------------------------------
[INFO] Building Struts 2 Tiles Plugin 2.5-SNAPSHOT
[INFO] ------------------------------------------------------------------------
[INFO] 
[INFO] >>> maven-source-plugin:2.3:jar (default-cli) @ struts2-tiles-plugin >>>
[WARNING] Failed to notify spy hudson.maven.Maven3Builder$JenkinsEventSpy: null
[INFO] 
[INFO] <<< maven-source-plugin:2.3:jar (default-cli) @ struts2-tiles-plugin <<<
[INFO] Downloading: http://repo.maven.apache.org/maven2/org/apache/tiles/tiles-api/3.0.5/tiles-api-3.0.5.pom
[INFO] Downloaded: http://repo.maven.apache.org/maven2/org/apache/tiles/tiles-api/3.0.5/tiles-api-3.0.5.pom
(4 KB at 24.1 KB/sec)
[INFO] Downloading: http://repo.maven.apache.org/maven2/org/apache/tiles/tiles-parent/3.0.5/tiles-parent-3.0.5.pom
[INFO] Downloaded: http://repo.maven.apache.org/maven2/org/apache/tiles/tiles-parent/3.0.5/tiles-parent-3.0.5.pom
(16 KB at 210.1 KB/sec)
[INFO] Downloading: http://repo.maven.apache.org/maven2/org/apache/tiles/tiles-master/6/tiles-master-6.pom
[INFO] Downloaded: http://repo.maven.apache.org/maven2/org/apache/tiles/tiles-master/6/tiles-master-6.pom
(12 KB at 210.6 KB/sec)
[INFO] Downloading: http://repo.maven.apache.org/maven2/org/apache/tiles/tiles-request-api/1.0.6/tiles-request-api-1.0.6.pom
[INFO] Downloaded: http://repo.maven.apache.org/maven2/org/apache/tiles/tiles-request-api/1.0.6/tiles-request-api-1.0.6.pom
(2 KB at 29.5 KB/sec)
[INFO] Downloading: http://repo.maven.apache.org/maven2/org/apache/tiles/tiles-request/1.0.6/tiles-request-1.0.6.pom
[INFO] Downloaded: http://repo.maven.apache.org/maven2/org/apache/tiles/tiles-request/1.0.6/tiles-request-1.0.6.pom
(16 KB at 294.3 KB/sec)
[INFO] Downloading: http://repo.maven.apache.org/maven2/org/apache/tiles/tiles-core/3.0.5/tiles-core-3.0.5.pom
[INFO] Downloaded: http://repo.maven.apache.org/maven2/org/apache/tiles/tiles-core/3.0.5/tiles-core-3.0.5.pom
(4 KB at 61.3 KB/sec)
[INFO] Downloading: http://repo.maven.apache.org/maven2/org/apache/tiles/tiles-servlet/3.0.5/tiles-servlet-3.0.5.pom
[INFO] Downloaded: http://repo.maven.apache.org/maven2/org/apache/tiles/tiles-servlet/3.0.5/tiles-servlet-3.0.5.pom
(4 KB at 68.4 KB/sec)
[INFO] Downloading: http://repo.maven.apache.org/maven2/org/apache/tiles/tiles-request-servlet/1.0.6/tiles-request-servlet-1.0.6.pom
[INFO] Downloaded: http://repo.maven.apache.org/maven2/org/apache/tiles/tiles-request-servlet/1.0.6/tiles-request-servlet-1.0.6.pom
(3 KB at 43.0 KB/sec)
[INFO] Downloading: http://repo.maven.apache.org/maven2/org/apache/tiles/tiles-request-jsp/1.0.6/tiles-request-jsp-1.0.6.pom
[INFO] Downloaded: http://repo.maven.apache.org/maven2/org/apache/tiles/tiles-request-jsp/1.0.6/tiles-request-jsp-1.0.6.pom
(3 KB at 51.6 KB/sec)
[INFO] Downloading: http://repo.maven.apache.org/maven2/org/apache/tiles/tiles-jsp/3.0.5/tiles-jsp-3.0.5.pom
[INFO] Downloaded: http://repo.maven.apache.org/maven2/org/apache/tiles/tiles-jsp/3.0.5/tiles-jsp-3.0.5.pom
(6 KB at 99.6 KB/sec)
[INFO] Downloading: http://repo.maven.apache.org/maven2/org/apache/tiles/tiles-template/3.0.5/tiles-template-3.0.5.pom
[INFO] Downloaded: http://repo.maven.apache.org/maven2/org/apache/tiles/tiles-template/3.0.5/tiles-template-3.0.5.pom
(3 KB at 56.7 KB/sec)
[INFO] Downloading: http://repo.maven.apache.org/maven2/org/apache/tiles/tiles-freemarker/3.0.5/tiles-freemarker-3.0.5.pom
[INFO] Downloaded: http://repo.maven.apache.org/maven2/org/apache/tiles/tiles-freemarker/3.0.5/tiles-freemarker-3.0.5.pom
(4 KB at 61.4 KB/sec)
[INFO] Downloading: http://repo.maven.apache.org/maven2/org/apache/tiles/tiles-request-freemarker/1.0.6/tiles-request-freemarker-1.0.6.pom
[INFO] Downloaded: http://repo.maven.apache.org/maven2/org/apache/tiles/tiles-request-freemarker/1.0.6/tiles-request-freemarker-1.0.6.pom
(3 KB at 48.7 KB/sec)
[INFO] Downloading: http://repo.maven.apache.org/maven2/org/apache/tiles/tiles-ognl/3.0.5/tiles-ognl-3.0.5.pom
[INFO] Downloaded: http://repo.maven.apache.org/maven2/org/apache/tiles/tiles-ognl/3.0.5/tiles-ognl-3.0.5.pom
(4 KB at 59.7 KB/sec)
[INFO] Downloading: http://repo.maven.apache.org/maven2/org/apache/tiles/tiles-el/3.0.5/tiles-el-3.0.5.pom
[INFO] Downloaded: http://repo.maven.apache.org/maven2/org/apache/tiles/tiles-el/3.0.5/tiles-el-3.0.5.pom
(5 KB at 78.4 KB/sec)
[INFO] Downloading: http://repo.maven.apache.org/maven2/org/apache/tiles/tiles-api/3.0.5/tiles-api-3.0.5.jar
[INFO] Downloading: http://repo.maven.apache.org/maven2/org/apache/tiles/tiles-core/3.0.5/tiles-core-3.0.5.jar
[INFO] Downloading: http://repo.maven.apache.org/maven2/org/apache/tiles/tiles-servlet/3.0.5/tiles-servlet-3.0.5.jar
[INFO] Downloading: http://repo.maven.apache.org/maven2/org/apache/tiles/tiles-request-api/1.0.6/tiles-request-api-1.0.6.jar
[INFO] Downloading: http://repo.maven.apache.org/maven2/org/apache/tiles/tiles-request-jsp/1.0.6/tiles-request-jsp-1.0.6.jar
[INFO] Downloaded: http://repo.maven.apache.org/maven2/org/apache/tiles/tiles-api/3.0.5/tiles-api-3.0.5.jar
(30 KB at 377.2 KB/sec)
[INFO] Downloading: http://repo.maven.apache.org/maven2/org/apache/tiles/tiles-request-servlet/1.0.6/tiles-request-servlet-1.0.6.jar
[INFO] Downloaded: http://repo.maven.apache.org/maven2/org/apache/tiles/tiles-request-jsp/1.0.6/tiles-request-jsp-1.0.6.jar
(17 KB at 169.9 KB/sec)
[INFO] Downloaded: http://repo.maven.apache.org/maven2/org/apache/tiles/tiles-servlet/3.0.5/tiles-servlet-3.0.5.jar
(25 KB at 244.5 KB/sec)
[INFO] Downloading: http://repo.maven.apache.org/maven2/org/apache/tiles/tiles-jsp/3.0.5/tiles-jsp-3.0.5.jar
[INFO] Downloading: http://repo.maven.apache.org/maven2/org/apache/tiles/tiles-template/3.0.5/tiles-template-3.0.5.jar
[INFO] Downloaded: http://repo.maven.apache.org/maven2/org/apache/tiles/tiles-request-api/1.0.6/tiles-request-api-1.0.6.jar
(72 KB at 593.0 KB/sec)
[INFO] Downloading: http://repo.maven.apache.org/maven2/org/apache/tiles/tiles-freemarker/3.0.5/tiles-freemarker-3.0.5.jar
[INFO] Downloaded: http://repo.maven.apache.org/maven2/org/apache/tiles/tiles-core/3.0.5/tiles-core-3.0.5.jar
(80 KB at 642.2 KB/sec)
[INFO] Downloading: http://repo.maven.apache.org/maven2/org/apache/tiles/tiles-request-freemarker/1.0.6/tiles-request-freemarker-1.0.6.jar
[INFO] Downloaded: http://repo.maven.apache.org/maven2/org/apache/tiles/tiles-request-servlet/1.0.6/tiles-request-servlet-1.0.6.jar
(20 KB at 377.5 KB/sec)
[INFO] Downloading: http://repo.maven.apache.org/maven2/org/apache/tiles/tiles-ognl/3.0.5/tiles-ognl-3.0.5.jar
[INFO] Downloaded: http://repo.maven.apache.org/maven2/org/apache/tiles/tiles-freemarker/3.0.5/tiles-freemarker-3.0.5.jar
(24 KB at 435.6 KB/sec)
[INFO] Downloading: http://repo.maven.apache.org/maven2/org/apache/tiles/tiles-el/3.0.5/tiles-el-3.0.5.jar
[INFO] Downloaded: http://repo.maven.apache.org/maven2/org/apache/tiles/tiles-template/3.0.5/tiles-template-3.0.5.jar
(32 KB at 417.1 KB/sec)
[INFO] Downloaded: http://repo.maven.apache.org/maven2/org/apache/tiles/tiles-jsp/3.0.5/tiles-jsp-3.0.5.jar
(35 KB at 454.6 KB/sec)
[INFO] Downloaded: http://repo.maven.apache.org/maven2/org/apache/tiles/tiles-request-freemarker/1.0.6/tiles-request-freemarker-1.0.6.jar
(28 KB at 517.3 KB/sec)
[INFO] Downloaded: http://repo.maven.apache.org/maven2/org/apache/tiles/tiles-ognl/3.0.5/tiles-ognl-3.0.5.jar
(16 KB at 313.3 KB/sec)
[INFO] Downloaded: http://repo.maven.apache.org/maven2/org/apache/tiles/tiles-el/3.0.5/tiles-el-3.0.5.jar
(19 KB at 346.8 KB/sec)
[INFO] 
[INFO] --- maven-source-plugin:2.3:jar (default-cli) @ struts2-tiles-plugin ---
[INFO] Building jar: <https://builds.apache.org/job/Struts-JDK8-master/ws/plugins/tiles/target/struts2-tiles-plugin-2.5-SNAPSHOT-sources.jar>
[INFO] 
[INFO] --- maven-javadoc-plugin:2.9.1:jar (default-cli) @ struts2-tiles-plugin ---
[INFO] 
Loading source files for package org.apache.struts2.views.tiles...
Loading source files for package org.apache.struts2.tiles...
Constructing Javadoc information...
Standard Doclet version 1.8.0_66
Building tree for all the packages and classes...
Generating <https://builds.apache.org/job/Struts-JDK8-master/ws/plugins/tiles/target/apidocs/org/apache/struts2/views/tiles/TilesResult.html...>
Generating <https://builds.apache.org/job/Struts-JDK8-master/ws/plugins/tiles/target/apidocs/org/apache/struts2/tiles/StrutsApplicationResource.html...>
Generating <https://builds.apache.org/job/Struts-JDK8-master/ws/plugins/tiles/target/apidocs/org/apache/struts2/tiles/StrutsFreeMarkerAttributeRenderer.html...>
Generating <https://builds.apache.org/job/Struts-JDK8-master/ws/plugins/tiles/target/apidocs/org/apache/struts2/tiles/StrutsTilesContainerFactory.html...>
Generating <https://builds.apache.org/job/Struts-JDK8-master/ws/plugins/tiles/target/apidocs/org/apache/struts2/tiles/StrutsTilesInitializer.html...>
Generating <https://builds.apache.org/job/Struts-JDK8-master/ws/plugins/tiles/target/apidocs/org/apache/struts2/tiles/StrutsTilesListener.html...>
Generating <https://builds.apache.org/job/Struts-JDK8-master/ws/plugins/tiles/target/apidocs/org/apache/struts2/tiles/StrutsTilesLocaleResolver.html...>
Generating <https://builds.apache.org/job/Struts-JDK8-master/ws/plugins/tiles/target/apidocs/org/apache/struts2/tiles/StrutsWildcardServletApplicationContext.html...>
Generating <https://builds.apache.org/job/Struts-JDK8-master/ws/plugins/tiles/target/apidocs/overview-frame.html...>
Generating <https://builds.apache.org/job/Struts-JDK8-master/ws/plugins/tiles/target/apidocs/org/apache/struts2/tiles/package-frame.html...>
Generating <https://builds.apache.org/job/Struts-JDK8-master/ws/plugins/tiles/target/apidocs/org/apache/struts2/tiles/package-summary.html...>
Generating <https://builds.apache.org/job/Struts-JDK8-master/ws/plugins/tiles/target/apidocs/org/apache/struts2/tiles/package-tree.html...>
Generating <https://builds.apache.org/job/Struts-JDK8-master/ws/plugins/tiles/target/apidocs/org/apache/struts2/views/tiles/package-frame.html...>
Generating <https://builds.apache.org/job/Struts-JDK8-master/ws/plugins/tiles/target/apidocs/org/apache/struts2/views/tiles/package-summary.html...>
Generating <https://builds.apache.org/job/Struts-JDK8-master/ws/plugins/tiles/target/apidocs/org/apache/struts2/views/tiles/package-tree.html...>
Generating <https://builds.apache.org/job/Struts-JDK8-master/ws/plugins/tiles/target/apidocs/constant-values.html...>
Generating <https://builds.apache.org/job/Struts-JDK8-master/ws/plugins/tiles/target/apidocs/serialized-form.html...>
1 error
[INFO] ------------------------------------------------------------------------
[INFO] Reactor Summary:
[INFO] 
[INFO] Struts 2 Bill of Materials ........................ SUCCESS [  5.685 s]
[INFO] Struts 2 .......................................... SUCCESS [  5.841 s]
[INFO] Struts 2 Core ..................................... SUCCESS [02:59 min]
[INFO] Struts Plugins .................................... SUCCESS [  2.748 s]
[INFO] Struts 2 Spring Plugin ............................ SUCCESS [  7.716 s]
[INFO] Struts 2 Convention Plugin ........................ SUCCESS [ 10.029 s]
[INFO] Struts 2 JUnit Plugin ............................. SUCCESS [ 13.980 s]
[INFO] Struts 2 Portlet Plugin ........................... SUCCESS [ 14.272 s]
[INFO] Struts 2 DWR Plugin ............................... SUCCESS [  5.371 s]
[INFO] Struts 2 Tiles Plugin ............................. FAILURE [  3.118 s]
[INFO] Struts 2 Portlet Tiles Plugin ..................... SKIPPED
[INFO] Struts 2 Webapps .................................. SKIPPED
[INFO] Struts 2 Portlet Webapp ........................... SKIPPED
[INFO] Struts 2 Configuration Browser Plugin ............. SKIPPED
[INFO] Struts 2 Sitemesh Plugin .......................... SKIPPED
[INFO] Struts 2 JSON Plugin .............................. SKIPPED
[INFO] Struts 2 Bean Validation Plugin ................... SKIPPED
[INFO] Struts 2 Showcase Webapp .......................... SKIPPED
[INFO] Struts 2 REST Plugin .............................. SKIPPED
[INFO] Struts 2 Rest Showcase Webapp ..................... SKIPPED
[INFO] Struts 2 CDI Plugin ............................... SKIPPED
[INFO] Struts 2 Embedded JSP Plugin ...................... SKIPPED
[INFO] Struts 2 GXP Plugin ............................... SKIPPED
[INFO] Struts 2 Jasper Reports Plugin .................... SKIPPED
[INFO] Struts 2 Java 8 support plugin .................... SKIPPED
[INFO] Struts 2 Java Templates Plugin .................... SKIPPED
[INFO] Struts 2 JFreeChart Plugin ........................ SKIPPED
[INFO] Struts 2 OSGi Plugin .............................. SKIPPED
[INFO] Struts 2 OVal Plugin .............................. SKIPPED
[INFO] Struts 2 Pell Multipart Plugin .................... SKIPPED
[INFO] Struts 2 Plexus Plugin ............................ SKIPPED
[INFO] Struts 2 Sitegraph Plugin ......................... SKIPPED
[INFO] Struts 2 TestNG Plugin ............................ SKIPPED
[INFO] Struts OSGi Bundles ............................... SKIPPED
[INFO] Struts 2 OSGi Admin Bundle ........................ SKIPPED
[INFO] Struts 2 OSGi Demo Bundle ......................... SKIPPED
[INFO] Struts 2 Maven Archetypes ......................... SKIPPED
[INFO] Struts 2 Archetypes - Angular JS .................. SKIPPED
[INFO] Struts 2 Archetypes - Blank ....................... SKIPPED
[INFO] Struts 2 Archetypes - Blank Convention ............ SKIPPED
[INFO] Struts 2 Archetypes - Database Portlet ............ SKIPPED
[INFO] Struts 2 Archetypes - Plugin ...................... SKIPPED
[INFO] Struts 2 Archetypes - Portlet ..................... SKIPPED
[INFO] Struts 2 Archetypes - Starter ..................... SKIPPED
[INFO] Struts 2 Assembly ................................. SKIPPED
[INFO] ------------------------------------------------------------------------
[INFO] BUILD FAILURE
[INFO] ------------------------------------------------------------------------
[INFO] Total time: 04:24 min
[INFO] Finished at: 2016-01-19T22:51:11+00:00
[INFO] Final Memory: 84M/484M
[INFO] ------------------------------------------------------------------------
[ERROR] Failed to execute goal org.apache.maven.plugins:maven-javadoc-plugin:2.9.1:jar (default-cli)
on project struts2-tiles-plugin: MavenReportException: Error while creating archive:
[ERROR] Exit code: 1 - javadoc: error - com.sun.tools.doclets.internal.toolkit.util.DocletAbortException:
com.sun.tools.javac.code.Symbol$CompletionFailure: class file for org.apache.tiles.context.TilesRequestContextWrapper
not found
[ERROR] 
[ERROR] Command line was: /home/jenkins/jenkins-slave/tools/hudson.model.JDK/latest1.8/jre/../bin/javadoc
@options @packages
[ERROR] 
[ERROR] Refer to the generated Javadoc files in '<https://builds.apache.org/job/Struts-JDK8-master/ws/plugins/tiles/target/apidocs'>
dir.
[ERROR] -> [Help 1]
[ERROR] 
[ERROR] To see the full stack trace of the errors, re-run Maven with the -e switch.
[ERROR] Re-run Maven using the -X switch to enable full debug logging.
[ERROR] 
[ERROR] For more information about the errors and possible solutions, please read the following
articles:
[ERROR] [Help 1] http://cwiki.apache.org/confluence/display/MAVEN/MojoExecutionException
[ERROR] 
[ERROR] After correcting the problems, you can resume the build with the command
[ERROR]   mvn <goals> -rf :struts2-tiles-plugin
[JENKINS] Archiving <https://builds.apache.org/job/Struts-JDK8-master/ws/plugins/plexus/pom.xml>
to org.apache.struts/struts2-plexus-plugin/2.5-SNAPSHOT/struts2-plexus-plugin-2.5-SNAPSHOT.pom
[JENKINS] Archiving <https://builds.apache.org/job/Struts-JDK8-master/ws/plugins/pell-multipart/pom.xml>
to org.apache.struts/struts2-pell-multipart-plugin/2.5-SNAPSHOT/struts2-pell-multipart-plugin-2.5-SNAPSHOT.pom
[JENKINS] Archiving <https://builds.apache.org/job/Struts-JDK8-master/ws/plugins/java8-support/pom.xml>
to org.apache.struts/struts2-java8-support-plugin/2.5-SNAPSHOT/struts2-java8-support-plugin-2.5-SNAPSHOT.pom
[JENKINS] Archiving <https://builds.apache.org/job/Struts-JDK8-master/ws/plugins/jfreechart/pom.xml>
to org.apache.struts/struts2-jfreechart-plugin/2.5-SNAPSHOT/struts2-jfreechart-plugin-2.5-SNAPSHOT.pom
[JENKINS] Archiving <https://builds.apache.org/job/Struts-JDK8-master/ws/plugins/sitemesh/pom.xml>
to org.apache.struts/struts2-sitemesh-plugin/2.5-SNAPSHOT/struts2-sitemesh-plugin-2.5-SNAPSHOT.pom
[JENKINS] Archiving <https://builds.apache.org/job/Struts-JDK8-master/ws/plugins/config-browser/pom.xml>
to org.apache.struts/struts2-config-browser-plugin/2.5-SNAPSHOT/struts2-config-browser-plugin-2.5-SNAPSHOT.pom
[JENKINS] Archiving <https://builds.apache.org/job/Struts-JDK8-master/ws/archetypes/struts2-archetype-portlet/pom.xml>
to org.apache.struts/struts2-archetype-portlet/2.5-SNAPSHOT/struts2-archetype-portlet-2.5-SNAPSHOT.pom
[JENKINS] Archiving <https://builds.apache.org/job/Struts-JDK8-master/ws/bundles/demo/pom.xml>
to org.apache.struts/struts2-osgi-demo-bundle/2.5-SNAPSHOT/struts2-osgi-demo-bundle-2.5-SNAPSHOT.pom
[JENKINS] Archiving <https://builds.apache.org/job/Struts-JDK8-master/ws/plugins/portlet-tiles/pom.xml>
to org.apache.struts/struts2-portlet-tiles-plugin/2.5-SNAPSHOT/struts2-portlet-tiles-plugin-2.5-SNAPSHOT.pom
[JENKINS] Archiving <https://builds.apache.org/job/Struts-JDK8-master/ws/plugins/jasperreports/pom.xml>
to org.apache.struts/struts2-jasperreports-plugin/2.5-SNAPSHOT/struts2-jasperreports-plugin-2.5-SNAPSHOT.pom
[JENKINS] Archiving <https://builds.apache.org/job/Struts-JDK8-master/ws/archetypes/struts2-archetype-blank/pom.xml>
to org.apache.struts/struts2-archetype-blank/2.5-SNAPSHOT/struts2-archetype-blank-2.5-SNAPSHOT.pom
[JENKINS] Archiving <https://builds.apache.org/job/Struts-JDK8-master/ws/plugins/oval/pom.xml>
to org.apache.struts/struts2-oval-plugin/2.5-SNAPSHOT/struts2-oval-plugin-2.5-SNAPSHOT.pom
[JENKINS] Archiving <https://builds.apache.org/job/Struts-JDK8-master/ws/plugins/gxp/pom.xml>
to org.apache.struts/struts2-gxp-plugin/2.5-SNAPSHOT/struts2-gxp-plugin-2.5-SNAPSHOT.pom
[JENKINS] Archiving <https://builds.apache.org/job/Struts-JDK8-master/ws/plugins/convention/pom.xml>
to org.apache.struts/struts2-convention-plugin/2.5-SNAPSHOT/struts2-convention-plugin-2.5-SNAPSHOT.pom
[JENKINS] Archiving <https://builds.apache.org/job/Struts-JDK8-master/ws/plugins/convention/target/struts2-convention-plugin-2.5-SNAPSHOT.jar>
to org.apache.struts/struts2-convention-plugin/2.5-20160119.225022-138/struts2-convention-plugin-2.5-20160119.225022-138.jar
[JENKINS] Archiving <https://builds.apache.org/job/Struts-JDK8-master/ws/plugins/convention/target/struts2-convention-plugin-2.5-SNAPSHOT-sources.jar>
to org.apache.struts/struts2-convention-plugin/2.5-20160119.225022-138/struts2-convention-plugin-2.5-20160119.225022-138-sources.jar
[JENKINS] Archiving <https://builds.apache.org/job/Struts-JDK8-master/ws/plugins/convention/target/struts2-convention-plugin-2.5-SNAPSHOT-javadoc.jar>
to org.apache.struts/struts2-convention-plugin/2.5-20160119.225022-138/struts2-convention-plugin-2.5-20160119.225022-138-javadoc.jar
[JENKINS] Archiving <https://builds.apache.org/job/Struts-JDK8-master/ws/bundles/pom.xml>
to org.apache.struts/struts2-osgi-bundles/2.5-SNAPSHOT/struts2-osgi-bundles-2.5-SNAPSHOT.pom
[JENKINS] Archiving <https://builds.apache.org/job/Struts-JDK8-master/ws/pom.xml> to
org.apache.struts/struts2-parent/2.5-SNAPSHOT/struts2-parent-2.5-SNAPSHOT.pom
[JENKINS] Archiving <https://builds.apache.org/job/Struts-JDK8-master/ws/target/struts2-parent-2.5-SNAPSHOT-site.xml>
to org.apache.struts/struts2-parent/2.5-20160119.224658-179/struts2-parent-2.5-20160119.224658-179-site.xml
[JENKINS] Archiving <https://builds.apache.org/job/Struts-JDK8-master/ws/plugins/osgi/pom.xml>
to org.apache.struts/struts2-osgi-plugin/2.5-SNAPSHOT/struts2-osgi-plugin-2.5-SNAPSHOT.pom
[JENKINS] Archiving <https://builds.apache.org/job/Struts-JDK8-master/ws/assembly/pom.xml>
to org.apache.struts/struts2-assembly/2.5-SNAPSHOT/struts2-assembly-2.5-SNAPSHOT.pom
[JENKINS] Archiving <https://builds.apache.org/job/Struts-JDK8-master/ws/apps/showcase/pom.xml>
to org.apache.struts/struts2-showcase/2.5-SNAPSHOT/struts2-showcase-2.5-SNAPSHOT.pom
[JENKINS] Archiving <https://builds.apache.org/job/Struts-JDK8-master/ws/plugins/cdi/pom.xml>
to org.apache.struts/struts2-cdi-plugin/2.5-SNAPSHOT/struts2-cdi-plugin-2.5-SNAPSHOT.pom
[JENKINS] Archiving <https://builds.apache.org/job/Struts-JDK8-master/ws/plugins/rest/pom.xml>
to org.apache.struts/struts2-rest-plugin/2.5-SNAPSHOT/struts2-rest-plugin-2.5-SNAPSHOT.pom
[JENKINS] Archiving <https://builds.apache.org/job/Struts-JDK8-master/ws/core/pom.xml>
to org.apache.struts/struts2-core/2.5-SNAPSHOT/struts2-core-2.5-SNAPSHOT.pom
[JENKINS] Archiving <https://builds.apache.org/job/Struts-JDK8-master/ws/core/target/struts2-core-2.5-SNAPSHOT.jar>
to org.apache.struts/struts2-core/2.5-20160119.224959-138/struts2-core-2.5-20160119.224959-138.jar
[JENKINS] Archiving <https://builds.apache.org/job/Struts-JDK8-master/ws/core/target/struts2-core-2.5-SNAPSHOT-sources.jar>
to org.apache.struts/struts2-core/2.5-20160119.224959-138/struts2-core-2.5-20160119.224959-138-sources.jar
[JENKINS] Archiving <https://builds.apache.org/job/Struts-JDK8-master/ws/core/target/struts2-core-2.5-SNAPSHOT-javadoc.jar>
to org.apache.struts/struts2-core/2.5-20160119.224959-138/struts2-core-2.5-20160119.224959-138-javadoc.jar
[JENKINS] Archiving <https://builds.apache.org/job/Struts-JDK8-master/ws/plugins/tiles/pom.xml>
to org.apache.struts/struts2-tiles-plugin/2.5-SNAPSHOT/struts2-tiles-plugin-2.5-SNAPSHOT.pom
[JENKINS] Archiving <https://builds.apache.org/job/Struts-JDK8-master/ws/plugins/tiles/target/struts2-tiles-plugin-2.5-SNAPSHOT-sources.jar>
to org.apache.struts/struts2-tiles-plugin/2.5-SNAPSHOT/struts2-tiles-plugin-2.5-SNAPSHOT-sources.jar
[JENKINS] Archiving <https://builds.apache.org/job/Struts-JDK8-master/ws/archetypes/struts2-archetype-dbportlet/pom.xml>
to org.apache.struts/struts2-archetype-dbportlet/2.5-SNAPSHOT/struts2-archetype-dbportlet-2.5-SNAPSHOT.pom
[JENKINS] Archiving <https://builds.apache.org/job/Struts-JDK8-master/ws/archetypes/struts2-archetype-convention/pom.xml>
to org.apache.struts/struts2-archetype-convention/2.5-SNAPSHOT/struts2-archetype-convention-2.5-SNAPSHOT.pom
[JENKINS] Archiving <https://builds.apache.org/job/Struts-JDK8-master/ws/archetypes/pom.xml>
to org.apache.struts/struts2-archetypes/2.5-SNAPSHOT/struts2-archetypes-2.5-SNAPSHOT.pom
[JENKINS] Archiving <https://builds.apache.org/job/Struts-JDK8-master/ws/bom/pom.xml>
to org.apache.struts/struts2-bom/2.5-SNAPSHOT/struts2-bom-2.5-SNAPSHOT.pom
[JENKINS] Archiving <https://builds.apache.org/job/Struts-JDK8-master/ws/plugins/embeddedjsp/pom.xml>
to org.apache.struts/struts2-embeddedjsp-plugin/2.5-SNAPSHOT/struts2-embeddedjsp-plugin-2.5-SNAPSHOT.pom
[JENKINS] Archiving <https://builds.apache.org/job/Struts-JDK8-master/ws/plugins/pom.xml>
to org.apache.struts/struts2-plugins/2.5-SNAPSHOT/struts2-plugins-2.5-SNAPSHOT.pom
[JENKINS] Archiving <https://builds.apache.org/job/Struts-JDK8-master/ws/plugins/target/struts2-plugins-2.5-SNAPSHOT-site.xml>
to org.apache.struts/struts2-plugins/2.5-20160119.225004-138/struts2-plugins-2.5-20160119.225004-138-site.xml
[JENKINS] Archiving <https://builds.apache.org/job/Struts-JDK8-master/ws/apps/rest-showcase/pom.xml>
to org.apache.struts/struts2-rest-showcase/2.5-SNAPSHOT/struts2-rest-showcase-2.5-SNAPSHOT.pom
[JENKINS] Archiving <https://builds.apache.org/job/Struts-JDK8-master/ws/plugins/javatemplates/pom.xml>
to org.apache.struts/struts2-javatemplates-plugin/2.5-SNAPSHOT/struts2-javatemplates-plugin-2.5-SNAPSHOT.pom
[JENKINS] Archiving <https://builds.apache.org/job/Struts-JDK8-master/ws/bundles/admin/pom.xml>
to org.apache.struts/struts2-osgi-admin-bundle/2.5-SNAPSHOT/struts2-osgi-admin-bundle-2.5-SNAPSHOT.pom
[JENKINS] Archiving <https://builds.apache.org/job/Struts-JDK8-master/ws/apps/pom.xml>
to org.apache.struts/struts2-apps/2.5-SNAPSHOT/struts2-apps-2.5-SNAPSHOT.pom
[JENKINS] Archiving <https://builds.apache.org/job/Struts-JDK8-master/ws/plugins/sitegraph/pom.xml>
to org.apache.struts/struts2-sitegraph-plugin/2.5-SNAPSHOT/struts2-sitegraph-plugin-2.5-SNAPSHOT.pom
[JENKINS] Archiving <https://builds.apache.org/job/Struts-JDK8-master/ws/plugins/testng/pom.xml>
to org.apache.struts/struts2-testng-plugin/2.5-SNAPSHOT/struts2-testng-plugin-2.5-SNAPSHOT.pom
[JENKINS] Archiving <https://builds.apache.org/job/Struts-JDK8-master/ws/apps/portlet/pom.xml>
to org.apache.struts/struts2-portlet/2.5-SNAPSHOT/struts2-portlet-2.5-SNAPSHOT.pom
[JENKINS] Archiving <https://builds.apache.org/job/Struts-JDK8-master/ws/plugins/json/pom.xml>
to org.apache.struts/struts2-json-plugin/2.5-SNAPSHOT/struts2-json-plugin-2.5-SNAPSHOT.pom
[JENKINS] Archiving <https://builds.apache.org/job/Struts-JDK8-master/ws/plugins/junit/pom.xml>
to org.apache.struts/struts2-junit-plugin/2.5-SNAPSHOT/struts2-junit-plugin-2.5-SNAPSHOT.pom
[JENKINS] Archiving <https://builds.apache.org/job/Struts-JDK8-master/ws/plugins/junit/target/struts2-junit-plugin-2.5-SNAPSHOT.jar>
to org.apache.struts/struts2-junit-plugin/2.5-20160119.225036-138/struts2-junit-plugin-2.5-20160119.225036-138.jar
[JENKINS] Archiving <https://builds.apache.org/job/Struts-JDK8-master/ws/plugins/junit/target/struts2-junit-plugin-2.5-SNAPSHOT-sources.jar>
to org.apache.struts/struts2-junit-plugin/2.5-20160119.225036-138/struts2-junit-plugin-2.5-20160119.225036-138-sources.jar
[JENKINS] Archiving <https://builds.apache.org/job/Struts-JDK8-master/ws/plugins/junit/target/struts2-junit-plugin-2.5-SNAPSHOT-javadoc.jar>
to org.apache.struts/struts2-junit-plugin/2.5-20160119.225036-138/struts2-junit-plugin-2.5-20160119.225036-138-javadoc.jar
[JENKINS] Archiving <https://builds.apache.org/job/Struts-JDK8-master/ws/plugins/dwr/pom.xml>
to org.apache.struts/struts2-dwr-plugin/2.5-SNAPSHOT/struts2-dwr-plugin-2.5-SNAPSHOT.pom
[JENKINS] Archiving <https://builds.apache.org/job/Struts-JDK8-master/ws/plugins/dwr/target/struts2-dwr-plugin-2.5-SNAPSHOT.jar>
to org.apache.struts/struts2-dwr-plugin/2.5-20160119.225058-131/struts2-dwr-plugin-2.5-20160119.225058-131.jar
[JENKINS] Archiving <https://builds.apache.org/job/Struts-JDK8-master/ws/plugins/dwr/target/struts2-dwr-plugin-2.5-SNAPSHOT-sources.jar>
to org.apache.struts/struts2-dwr-plugin/2.5-20160119.225058-131/struts2-dwr-plugin-2.5-20160119.225058-131-sources.jar
[JENKINS] Archiving <https://builds.apache.org/job/Struts-JDK8-master/ws/plugins/dwr/target/struts2-dwr-plugin-2.5-SNAPSHOT-javadoc.jar>
to org.apache.struts/struts2-dwr-plugin/2.5-20160119.225058-131/struts2-dwr-plugin-2.5-20160119.225058-131-javadoc.jar
[JENKINS] Archiving <https://builds.apache.org/job/Struts-JDK8-master/ws/archetypes/struts2-archetype-plugin/pom.xml>
to org.apache.struts/struts2-archetype-plugin/2.5-SNAPSHOT/struts2-archetype-plugin-2.5-SNAPSHOT.pom
[JENKINS] Archiving <https://builds.apache.org/job/Struts-JDK8-master/ws/plugins/bean-validation/pom.xml>
to org.apache.struts/struts2-bean-validation-plugin/2.5-SNAPSHOT/struts2-bean-validation-plugin-2.5-SNAPSHOT.pom
[JENKINS] Archiving <https://builds.apache.org/job/Struts-JDK8-master/ws/archetypes/struts2-archetype-angularjs/pom.xml>
to org.apache.struts/struts2-archetype-angularjs/2.5-SNAPSHOT/struts2-archetype-angularjs-2.5-SNAPSHOT.pom
[JENKINS] Archiving <https://builds.apache.org/job/Struts-JDK8-master/ws/plugins/portlet/pom.xml>
to org.apache.struts/struts2-portlet-plugin/2.5-SNAPSHOT/struts2-portlet-plugin-2.5-SNAPSHOT.pom
[JENKINS] Archiving <https://builds.apache.org/job/Struts-JDK8-master/ws/plugins/portlet/target/struts2-portlet-plugin-2.5-SNAPSHOT.jar>
to org.apache.struts/struts2-portlet-plugin/2.5-20160119.225052-131/struts2-portlet-plugin-2.5-20160119.225052-131.jar
[JENKINS] Archiving <https://builds.apache.org/job/Struts-JDK8-master/ws/plugins/portlet/target/struts2-portlet-plugin-2.5-SNAPSHOT-sources.jar>
to org.apache.struts/struts2-portlet-plugin/2.5-20160119.225052-131/struts2-portlet-plugin-2.5-20160119.225052-131-sources.jar
[JENKINS] Archiving <https://builds.apache.org/job/Struts-JDK8-master/ws/plugins/portlet/target/struts2-portlet-plugin-2.5-SNAPSHOT-javadoc.jar>
to org.apache.struts/struts2-portlet-plugin/2.5-20160119.225052-131/struts2-portlet-plugin-2.5-20160119.225052-131-javadoc.jar
[JENKINS] Archiving <https://builds.apache.org/job/Struts-JDK8-master/ws/plugins/spring/pom.xml>
to org.apache.struts/struts2-spring-plugin/2.5-SNAPSHOT/struts2-spring-plugin-2.5-SNAPSHOT.pom
[JENKINS] Archiving <https://builds.apache.org/job/Struts-JDK8-master/ws/plugins/spring/target/struts2-spring-plugin-2.5-SNAPSHOT.jar>
to org.apache.struts/struts2-spring-plugin/2.5-20160119.225012-138/struts2-spring-plugin-2.5-20160119.225012-138.jar
[JENKINS] Archiving <https://builds.apache.org/job/Struts-JDK8-master/ws/plugins/spring/target/struts2-spring-plugin-2.5-SNAPSHOT-sources.jar>
to org.apache.struts/struts2-spring-plugin/2.5-20160119.225012-138/struts2-spring-plugin-2.5-20160119.225012-138-sources.jar
[JENKINS] Archiving <https://builds.apache.org/job/Struts-JDK8-master/ws/plugins/spring/target/struts2-spring-plugin-2.5-SNAPSHOT-javadoc.jar>
to org.apache.struts/struts2-spring-plugin/2.5-20160119.225012-138/struts2-spring-plugin-2.5-20160119.225012-138-javadoc.jar
[JENKINS] Archiving <https://builds.apache.org/job/Struts-JDK8-master/ws/archetypes/struts2-archetype-starter/pom.xml>
to org.apache.struts/struts2-archetype-starter/2.5-SNAPSHOT/struts2-archetype-starter-2.5-SNAPSHOT.pom
[locks-and-latches] Releasing all the locks
[locks-and-latches] All the locks released
channel stopped

---------------------------------------------------------------------
To unsubscribe, e-mail: dev-unsubscribe@struts.apache.org
For additional commands, e-mail: dev-help@struts.apache.org


Mime
View raw message