struts-dev mailing list archives

Site index · List index
Message view « Date » · « Thread »
Top « Date » · « Thread »
From Apache Jenkins Server <jenk...@builds.apache.org>
Subject Build failed in Jenkins: Struts-JDK7-pull-request #90
Date Sat, 28 Nov 2015 15:05:25 GMT
See <https://builds.apache.org/job/Struts-JDK7-pull-request/90/changes>

Changes:

[Lukasz Lenart] Adds required dependencies (cherry picked from commit 85b2198)

[Lukasz Lenart] Re-implements tiles integration based on new API (cherry picked from

[Lukasz Lenart] Drops unused classes (cherry picked from commit 24a5bce)

[Lukasz Lenart] Replaces call to deprecated api (cherry picked from commit 26f153d)

[Lukasz Lenart] Updates Portal Tiles integration (cherry picked from commit 6edc0ff)

[Lukasz Lenart] Adds missing header with license (cherry picked from commit 27ad6cb)

[Lukasz Lenart] Registers Tiles model (cherry picked from commit 388861f)

[Lukasz Lenart] Fixes dependency clash

------------------------------------------
[...truncated 3899 lines...]
[INFO] --- maven-remote-resources-plugin:1.2.1:process (default) @ struts2-dwr-plugin ---
[INFO] 
[INFO] --- maven-resources-plugin:2.5:resources (default-resources) @ struts2-dwr-plugin ---
[debug] execute contextualize
[INFO] Using 'UTF-8' encoding to copy filtered resources.
[INFO] skip non existing resourceDirectory <https://builds.apache.org/job/Struts-JDK7-pull-request/ws/plugins/dwr/src/main/resources>
[INFO] Copying 3 resources
[INFO] 
[INFO] --- maven-compiler-plugin:2.3.2:compile (default-compile) @ struts2-dwr-plugin ---
[INFO] Compiling 1 source file to <https://builds.apache.org/job/Struts-JDK7-pull-request/ws/plugins/dwr/target/classes>
[INFO] 
[INFO] --- maven-bundle-plugin:2.1.0:manifest (bundle-manifest) @ struts2-dwr-plugin ---
[WARNING] Warning in manifest for org.apache.struts:struts2-dwr-plugin:jar:2.3.25-SNAPSHOT
: Superfluous export-package instructions: [org.apache, org.apache.struts2, org]
[INFO] 
[INFO] --- maven-resources-plugin:2.5:testResources (default-testResources) @ struts2-dwr-plugin
---
[debug] execute contextualize
[INFO] Using 'UTF-8' encoding to copy filtered resources.
[INFO] skip non existing resourceDirectory <https://builds.apache.org/job/Struts-JDK7-pull-request/ws/plugins/dwr/src/test/resources>
[INFO] Copying 3 resources
[INFO] 
[INFO] --- maven-compiler-plugin:2.3.2:testCompile (default-testCompile) @ struts2-dwr-plugin
---
[INFO] No sources to compile
[INFO] 
[INFO] --- maven-surefire-plugin:2.3.1:test (default-test) @ struts2-dwr-plugin ---
[INFO] Surefire report directory: <https://builds.apache.org/job/Struts-JDK7-pull-request/ws/plugins/dwr/target/surefire-reports>

-------------------------------------------------------
 T E S T S
-------------------------------------------------------
There are no tests to run.

Results :

Tests run: 0, Failures: 0, Errors: 0, Skipped: 0

[JENKINS] Recording test results
[INFO] 
[INFO] --- maven-jar-plugin:2.3.1:jar (default-jar) @ struts2-dwr-plugin ---
[INFO] Building jar: <https://builds.apache.org/job/Struts-JDK7-pull-request/ws/plugins/dwr/target/struts2-dwr-plugin-2.3.25-SNAPSHOT.jar>
[INFO] 
[INFO] >>> maven-source-plugin:2.1.2:jar (attach-source) @ struts2-dwr-plugin >>>
[WARNING] Failed to getClass for org.apache.maven.plugin.source.SourceJarMojo
[INFO] 
[INFO] <<< maven-source-plugin:2.1.2:jar (attach-source) @ struts2-dwr-plugin <<<
[INFO] 
[INFO] --- maven-source-plugin:2.1.2:jar (attach-source) @ struts2-dwr-plugin ---
[INFO] META-INF already added, skipping
[INFO] META-INF/DEPENDENCIES already added, skipping
[INFO] META-INF/NOTICE already added, skipping
[INFO] META-INF/LICENSE already added, skipping
[INFO] Building jar: <https://builds.apache.org/job/Struts-JDK7-pull-request/ws/plugins/dwr/target/struts2-dwr-plugin-2.3.25-SNAPSHOT-sources.jar>
[INFO] META-INF already added, skipping
[INFO] META-INF/DEPENDENCIES already added, skipping
[INFO] META-INF/NOTICE already added, skipping
[INFO] META-INF/LICENSE already added, skipping
[INFO] 
[INFO] --- maven-site-plugin:3.3:attach-descriptor (attach-descriptor) @ struts2-dwr-plugin
---
[INFO]                                                                         
[INFO] ------------------------------------------------------------------------
[INFO] Building Struts 2 Tiles Plugin 2.3.25-SNAPSHOT
[INFO] ------------------------------------------------------------------------
[INFO] Downloading: http://repo.maven.apache.org/maven2/org/apache/tiles/tiles-servlet-wildcard/2.2.2/tiles-servlet-wildcard-2.2.2.pom
[INFO] Downloaded: http://repo.maven.apache.org/maven2/org/apache/tiles/tiles-servlet-wildcard/2.2.2/tiles-servlet-wildcard-2.2.2.pom
(4 KB at 9.9 KB/sec)
[INFO] Downloading: http://repo.maven.apache.org/maven2/org/apache/tiles/tiles-freemarker/2.2.2/tiles-freemarker-2.2.2.pom
[INFO] Downloaded: http://repo.maven.apache.org/maven2/org/apache/tiles/tiles-freemarker/2.2.2/tiles-freemarker-2.2.2.pom
(3 KB at 36.9 KB/sec)
[INFO] Downloading: http://repo.maven.apache.org/maven2/org/apache/tiles/tiles-ognl/2.2.2/tiles-ognl-2.2.2.pom
[INFO] Downloaded: http://repo.maven.apache.org/maven2/org/apache/tiles/tiles-ognl/2.2.2/tiles-ognl-2.2.2.pom
(4 KB at 54.1 KB/sec)
[INFO] Downloading: http://repo.maven.apache.org/maven2/org/apache/tiles/tiles-el/2.2.2/tiles-el-2.2.2.pom
[INFO] Downloaded: http://repo.maven.apache.org/maven2/org/apache/tiles/tiles-el/2.2.2/tiles-el-2.2.2.pom
(5 KB at 71.6 KB/sec)
[INFO] Downloading: http://repo.maven.apache.org/maven2/org/apache/tiles/tiles-servlet-wildcard/2.2.2/tiles-servlet-wildcard-2.2.2.jar
[INFO] Downloading: http://repo.maven.apache.org/maven2/org/apache/tiles/tiles-freemarker/2.2.2/tiles-freemarker-2.2.2.jar
[INFO] Downloading: http://repo.maven.apache.org/maven2/org/apache/tiles/tiles-ognl/2.2.2/tiles-ognl-2.2.2.jar
[INFO] Downloading: http://repo.maven.apache.org/maven2/org/apache/tiles/tiles-el/2.2.2/tiles-el-2.2.2.jar
[INFO] Downloaded: http://repo.maven.apache.org/maven2/org/apache/tiles/tiles-servlet-wildcard/2.2.2/tiles-servlet-wildcard-2.2.2.jar
(12 KB at 201.5 KB/sec)
[INFO] Downloaded: http://repo.maven.apache.org/maven2/org/apache/tiles/tiles-ognl/2.2.2/tiles-ognl-2.2.2.jar
(16 KB at 153.0 KB/sec)
[INFO] Downloaded: http://repo.maven.apache.org/maven2/org/apache/tiles/tiles-el/2.2.2/tiles-el-2.2.2.jar
(21 KB at 202.7 KB/sec)
[INFO] Downloaded: http://repo.maven.apache.org/maven2/org/apache/tiles/tiles-freemarker/2.2.2/tiles-freemarker-2.2.2.jar
(35 KB at 323.7 KB/sec)
[INFO] 
[INFO] --- maven-remote-resources-plugin:1.2.1:process (default) @ struts2-tiles-plugin ---
[INFO] 
[INFO] --- maven-resources-plugin:2.5:resources (default-resources) @ struts2-tiles-plugin
---
[debug] execute contextualize
[INFO] Using 'UTF-8' encoding to copy filtered resources.
[INFO] Copying 3 resources
[INFO] Copying 3 resources
[INFO] 
[INFO] --- maven-compiler-plugin:2.3.2:compile (default-compile) @ struts2-tiles-plugin ---
[INFO] Compiling 5 source files to <https://builds.apache.org/job/Struts-JDK7-pull-request/ws/plugins/tiles/target/classes>
[INFO] -------------------------------------------------------------
[ERROR] COMPILATION ERROR : 
[INFO] -------------------------------------------------------------
[ERROR] <https://builds.apache.org/job/Struts-JDK7-pull-request/ws/plugins/tiles/src/main/java/org/apache/struts2/tiles/StrutsTilesContainerFactory.java>:[184,94]
error: diamond operator is not supported in -source 1.5
[INFO] 1 error
[INFO] -------------------------------------------------------------
[INFO] ------------------------------------------------------------------------
[INFO] Reactor Summary:
[INFO] 
[INFO] Struts 2 Bill of Materials ........................ SUCCESS [  3.038 s]
[INFO] Struts 2 .......................................... SUCCESS [  2.796 s]
[INFO] XWork: Core ....................................... SUCCESS [ 33.727 s]
[INFO] Struts 2 Core ..................................... SUCCESS [ 59.382 s]
[INFO] Struts Plugins .................................... SUCCESS [  0.498 s]
[INFO] Struts 2 Spring Plugin ............................ SUCCESS [  4.210 s]
[INFO] Struts 2 Convention Plugin ........................ SUCCESS [  6.548 s]
[INFO] Struts 2 JUnit Plugin ............................. SUCCESS [  6.487 s]
[INFO] Struts 2 Webapps .................................. SUCCESS [  0.781 s]
[INFO] Struts 2 Blank Webapp ............................. SUCCESS [  9.279 s]
[INFO] Struts 2 JBoss Blank Webapp ....................... SUCCESS [  4.391 s]
[INFO] Struts 2 Mail Reader Webapp ....................... SUCCESS [  2.494 s]
[INFO] Struts 2 Portlet Plugin ........................... SUCCESS [  7.966 s]
[INFO] Struts 2 DWR Plugin ............................... SUCCESS [  1.805 s]
[INFO] Struts 2 Tiles Plugin ............................. FAILURE [  2.336 s]
[INFO] Struts 2 Portlet Tiles Plugin ..................... SKIPPED
[INFO] Struts 2 Portlet Webapp ........................... SKIPPED
[INFO] Struts 2 Struts 1 Plugin .......................... SKIPPED
[INFO] Struts 2 Dojo Plugin .............................. SKIPPED
[INFO] Struts 2 JSF Plugin ............................... SKIPPED
[INFO] Struts 2 Configuration Browser Plugin ............. SKIPPED
[INFO] Struts 2 Sitemesh Plugin .......................... SKIPPED
[INFO] Struts 2 JSON Plugin .............................. SKIPPED
[INFO] Struts 2 Showcase Webapp .......................... SKIPPED
[INFO] Struts 2 REST Plugin .............................. SKIPPED
[INFO] Struts 2 Rest Showcase Webapp ..................... SKIPPED
[INFO] Struts 2 CDI Plugin ............................... SKIPPED
[INFO] Struts 2 Codebehind Plugin ........................ SKIPPED
[INFO] Struts 2 Embedded JSP Plugin ...................... SKIPPED
[INFO] Struts 2 GXP Plugin ............................... SKIPPED
[INFO] Struts 2 Jasper Reports Plugin .................... SKIPPED
[INFO] Struts 2 Java 8 support plugin .................... SKIPPED
[INFO] Struts 2 Java Templates Plugin .................... SKIPPED
[INFO] Struts 2 JFreeChart Plugin ........................ SKIPPED
[INFO] Struts 2 OSGi Plugin .............................. SKIPPED
[INFO] Struts 2 OVal Plugin .............................. SKIPPED
[INFO] Struts 2 Pell Multipart Plugin .................... SKIPPED
[INFO] Struts 2 Plexus Plugin ............................ SKIPPED
[INFO] Struts 2 Sitegraph Plugin ......................... SKIPPED
[INFO] Struts 2 TestNG Plugin ............................ SKIPPED
[INFO] Struts 2 Tiles 3 Plugin ........................... SKIPPED
[INFO] Struts OSGi Bundles ............................... SKIPPED
[INFO] Struts 2 OSGi Admin Bundle ........................ SKIPPED
[INFO] Struts 2 OSGi Demo Bundle ......................... SKIPPED
[INFO] Struts 2 Maven Archetypes ......................... SKIPPED
[INFO] Struts 2 Archetypes - Angular JS .................. SKIPPED
[INFO] Struts 2 Archetypes - Blank ....................... SKIPPED
[INFO] Struts 2 Archetypes - Blank Convention ............ SKIPPED
[INFO] Struts 2 Archetypes - Database Portlet ............ SKIPPED
[INFO] Struts 2 Archetypes - Plugin ...................... SKIPPED
[INFO] Struts 2 Archetypes - Portlet ..................... SKIPPED
[INFO] Struts 2 Archetypes - Starter ..................... SKIPPED
[INFO] ------------------------------------------------------------------------
[INFO] BUILD FAILURE
[INFO] ------------------------------------------------------------------------
[INFO] Total time: 02:40 min
[INFO] Finished at: 2015-11-28T15:05:18+00:00
[INFO] Final Memory: 130M/400M
[INFO] ------------------------------------------------------------------------
[ERROR] Failed to execute goal org.apache.maven.plugins:maven-compiler-plugin:2.3.2:compile
(default-compile) on project struts2-tiles-plugin: Compilation failure
[ERROR] <https://builds.apache.org/job/Struts-JDK7-pull-request/ws/plugins/tiles/src/main/java/org/apache/struts2/tiles/StrutsTilesContainerFactory.java>:[184,94]
error: diamond operator is not supported in -source 1.5
[ERROR] -> [Help 1]
[ERROR] 
[ERROR] To see the full stack trace of the errors, re-run Maven with the -e switch.
[ERROR] Re-run Maven using the -X switch to enable full debug logging.
[ERROR] 
[ERROR] For more information about the errors and possible solutions, please read the following
articles:
[ERROR] [Help 1] http://cwiki.apache.org/confluence/display/MAVEN/MojoFailureException
[ERROR] 
[ERROR] After correcting the problems, you can resume the build with the command
[ERROR]   mvn <goals> -rf :struts2-tiles-plugin
[JENKINS] Archiving <https://builds.apache.org/job/Struts-JDK7-pull-request/ws/plugins/pell-multipart/pom.xml>
to org.apache.struts/struts2-pell-multipart-plugin/2.3.25-SNAPSHOT/struts2-pell-multipart-plugin-2.3.25-SNAPSHOT.pom
[JENKINS] Archiving <https://builds.apache.org/job/Struts-JDK7-pull-request/ws/plugins/jfreechart/pom.xml>
to org.apache.struts/struts2-jfreechart-plugin/2.3.25-SNAPSHOT/struts2-jfreechart-plugin-2.3.25-SNAPSHOT.pom
[JENKINS] Archiving <https://builds.apache.org/job/Struts-JDK7-pull-request/ws/plugins/java8-support/pom.xml>
to org.apache.struts/struts2-java8-support-plugin/2.3.25-SNAPSHOT/struts2-java8-support-plugin-2.3.25-SNAPSHOT.pom
[JENKINS] Archiving <https://builds.apache.org/job/Struts-JDK7-pull-request/ws/plugins/sitemesh/pom.xml>
to org.apache.struts/struts2-sitemesh-plugin/2.3.25-SNAPSHOT/struts2-sitemesh-plugin-2.3.25-SNAPSHOT.pom
[JENKINS] Archiving <https://builds.apache.org/job/Struts-JDK7-pull-request/ws/archetypes/struts2-archetype-portlet/pom.xml>
to org.apache.struts/struts2-archetype-portlet/2.3.25-SNAPSHOT/struts2-archetype-portlet-2.3.25-SNAPSHOT.pom
[JENKINS] Archiving <https://builds.apache.org/job/Struts-JDK7-pull-request/ws/bundles/demo/pom.xml>
to org.apache.struts/struts2-osgi-demo-bundle/2.3.25-SNAPSHOT/struts2-osgi-demo-bundle-2.3.25-SNAPSHOT.pom
[JENKINS] Archiving <https://builds.apache.org/job/Struts-JDK7-pull-request/ws/plugins/portlet-tiles/pom.xml>
to org.apache.struts/struts2-portlet-tiles-plugin/2.3.25-SNAPSHOT/struts2-portlet-tiles-plugin-2.3.25-SNAPSHOT.pom
[JENKINS] Archiving <https://builds.apache.org/job/Struts-JDK7-pull-request/ws/plugins/jasperreports/pom.xml>
to org.apache.struts/struts2-jasperreports-plugin/2.3.25-SNAPSHOT/struts2-jasperreports-plugin-2.3.25-SNAPSHOT.pom
[JENKINS] Archiving <https://builds.apache.org/job/Struts-JDK7-pull-request/ws/plugins/oval/pom.xml>
to org.apache.struts/struts2-oval-plugin/2.3.25-SNAPSHOT/struts2-oval-plugin-2.3.25-SNAPSHOT.pom
[JENKINS] Archiving <https://builds.apache.org/job/Struts-JDK7-pull-request/ws/plugins/tiles3/pom.xml>
to org.apache.struts/struts2-tiles3-plugin/2.3.25-SNAPSHOT/struts2-tiles3-plugin-2.3.25-SNAPSHOT.pom
[JENKINS] Archiving <https://builds.apache.org/job/Struts-JDK7-pull-request/ws/xwork-core/pom.xml>
to org.apache.struts.xwork/xwork-core/2.3.25-SNAPSHOT/xwork-core-2.3.25-SNAPSHOT.pom
[JENKINS] Archiving <https://builds.apache.org/job/Struts-JDK7-pull-request/ws/xwork-core/target/xwork-core-2.3.25-SNAPSHOT.jar>
to org.apache.struts.xwork/xwork-core/2.3.25-SNAPSHOT/xwork-core-2.3.25-SNAPSHOT.jar
[JENKINS] Archiving <https://builds.apache.org/job/Struts-JDK7-pull-request/ws/xwork-core/target/xwork-core-2.3.25-SNAPSHOT-sources.jar>
to org.apache.struts.xwork/xwork-core/2.3.25-SNAPSHOT/xwork-core-2.3.25-SNAPSHOT-sources.jar
[JENKINS] Archiving <https://builds.apache.org/job/Struts-JDK7-pull-request/ws/apps/jboss-blank/pom.xml>
to org.apache.struts/struts2-jboss-blank/2.3.25-SNAPSHOT/struts2-jboss-blank-2.3.25-SNAPSHOT.pom
[JENKINS] Archiving <https://builds.apache.org/job/Struts-JDK7-pull-request/ws/apps/jboss-blank/target/struts2-jboss-blank.war>
to org.apache.struts/struts2-jboss-blank/2.3.25-SNAPSHOT/struts2-jboss-blank-2.3.25-SNAPSHOT.war
[JENKINS] Archiving <https://builds.apache.org/job/Struts-JDK7-pull-request/ws/apps/jboss-blank/target/struts2-jboss-blank-sources.jar>
to org.apache.struts/struts2-jboss-blank/2.3.25-SNAPSHOT/struts2-jboss-blank-2.3.25-SNAPSHOT-sources.jar
Compressed 3.84 MB of artifacts by 57.8% relative to #82
[JENKINS] Archiving <https://builds.apache.org/job/Struts-JDK7-pull-request/ws/plugins/cdi/pom.xml>
to org.apache.struts/struts2-cdi-plugin/2.3.25-SNAPSHOT/struts2-cdi-plugin-2.3.25-SNAPSHOT.pom
[JENKINS] Archiving <https://builds.apache.org/job/Struts-JDK7-pull-request/ws/core/pom.xml>
to org.apache.struts/struts2-core/2.3.25-SNAPSHOT/struts2-core-2.3.25-SNAPSHOT.pom
[JENKINS] Archiving <https://builds.apache.org/job/Struts-JDK7-pull-request/ws/core/target/struts2-core-2.3.25-SNAPSHOT.jar>
to org.apache.struts/struts2-core/2.3.25-SNAPSHOT/struts2-core-2.3.25-SNAPSHOT.jar
[JENKINS] Archiving <https://builds.apache.org/job/Struts-JDK7-pull-request/ws/core/target/struts2-core-2.3.25-SNAPSHOT-sources.jar>
to org.apache.struts/struts2-core/2.3.25-SNAPSHOT/struts2-core-2.3.25-SNAPSHOT-sources.jar
[JENKINS] Archiving <https://builds.apache.org/job/Struts-JDK7-pull-request/ws/plugins/tiles/pom.xml>
to org.apache.struts/struts2-tiles-plugin/2.3.25-SNAPSHOT/struts2-tiles-plugin-2.3.25-SNAPSHOT.pom
[JENKINS] Archiving <https://builds.apache.org/job/Struts-JDK7-pull-request/ws/archetypes/struts2-archetype-dbportlet/pom.xml>
to org.apache.struts/struts2-archetype-dbportlet/2.3.25-SNAPSHOT/struts2-archetype-dbportlet-2.3.25-SNAPSHOT.pom
[JENKINS] Archiving <https://builds.apache.org/job/Struts-JDK7-pull-request/ws/archetypes/pom.xml>
to org.apache.struts/struts2-archetypes/2.3.25-SNAPSHOT/struts2-archetypes-2.3.25-SNAPSHOT.pom
[JENKINS] Archiving <https://builds.apache.org/job/Struts-JDK7-pull-request/ws/bom/pom.xml>
to org.apache.struts/struts2-bom/2.3.25-SNAPSHOT/struts2-bom-2.3.25-SNAPSHOT.pom
[JENKINS] Archiving <https://builds.apache.org/job/Struts-JDK7-pull-request/ws/plugins/embeddedjsp/pom.xml>
to org.apache.struts/struts2-embeddedjsp-plugin/2.3.25-SNAPSHOT/struts2-embeddedjsp-plugin-2.3.25-SNAPSHOT.pom
[JENKINS] Archiving <https://builds.apache.org/job/Struts-JDK7-pull-request/ws/plugins/javatemplates/pom.xml>
to org.apache.struts/struts2-javatemplates-plugin/2.3.25-SNAPSHOT/struts2-javatemplates-plugin-2.3.25-SNAPSHOT.pom
[JENKINS] Archiving <https://builds.apache.org/job/Struts-JDK7-pull-request/ws/apps/rest-showcase/pom.xml>
to org.apache.struts/struts2-rest-showcase/2.3.25-SNAPSHOT/struts2-rest-showcase-2.3.25-SNAPSHOT.pom
[JENKINS] Archiving <https://builds.apache.org/job/Struts-JDK7-pull-request/ws/bundles/admin/pom.xml>
to org.apache.struts/struts2-osgi-admin-bundle/2.3.25-SNAPSHOT/struts2-osgi-admin-bundle-2.3.25-SNAPSHOT.pom
[JENKINS] Archiving <https://builds.apache.org/job/Struts-JDK7-pull-request/ws/apps/pom.xml>
to org.apache.struts/struts2-apps/2.3.25-SNAPSHOT/struts2-apps-2.3.25-SNAPSHOT.pom
[JENKINS] Archiving <https://builds.apache.org/job/Struts-JDK7-pull-request/ws/plugins/json/pom.xml>
to org.apache.struts/struts2-json-plugin/2.3.25-SNAPSHOT/struts2-json-plugin-2.3.25-SNAPSHOT.pom
[JENKINS] Archiving <https://builds.apache.org/job/Struts-JDK7-pull-request/ws/plugins/junit/pom.xml>
to org.apache.struts/struts2-junit-plugin/2.3.25-SNAPSHOT/struts2-junit-plugin-2.3.25-SNAPSHOT.pom
[JENKINS] Archiving <https://builds.apache.org/job/Struts-JDK7-pull-request/ws/plugins/junit/target/struts2-junit-plugin-2.3.25-SNAPSHOT.jar>
to org.apache.struts/struts2-junit-plugin/2.3.25-SNAPSHOT/struts2-junit-plugin-2.3.25-SNAPSHOT.jar
[JENKINS] Archiving <https://builds.apache.org/job/Struts-JDK7-pull-request/ws/plugins/junit/target/struts2-junit-plugin-2.3.25-SNAPSHOT-sources.jar>
to org.apache.struts/struts2-junit-plugin/2.3.25-SNAPSHOT/struts2-junit-plugin-2.3.25-SNAPSHOT-sources.jar
[JENKINS] Archiving <https://builds.apache.org/job/Struts-JDK7-pull-request/ws/archetypes/struts2-archetype-plugin/pom.xml>
to org.apache.struts/struts2-archetype-plugin/2.3.25-SNAPSHOT/struts2-archetype-plugin-2.3.25-SNAPSHOT.pom
[JENKINS] Archiving <https://builds.apache.org/job/Struts-JDK7-pull-request/ws/apps/mailreader/pom.xml>
to org.apache.struts/struts2-mailreader/2.3.25-SNAPSHOT/struts2-mailreader-2.3.25-SNAPSHOT.pom
[JENKINS] Archiving <https://builds.apache.org/job/Struts-JDK7-pull-request/ws/apps/mailreader/target/struts2-mailreader.war>
to org.apache.struts/struts2-mailreader/2.3.25-SNAPSHOT/struts2-mailreader-2.3.25-SNAPSHOT.war
[JENKINS] Archiving <https://builds.apache.org/job/Struts-JDK7-pull-request/ws/apps/mailreader/target/struts2-mailreader-sources.jar>
to org.apache.struts/struts2-mailreader/2.3.25-SNAPSHOT/struts2-mailreader-2.3.25-SNAPSHOT-sources.jar
Compressed 4.31 MB of artifacts by 58.7% relative to #82
[JENKINS] Archiving <https://builds.apache.org/job/Struts-JDK7-pull-request/ws/archetypes/struts2-archetype-angularjs/pom.xml>
to org.apache.struts/struts2-archetype-angularjs/2.3.25-SNAPSHOT/struts2-archetype-angularjs-2.3.25-SNAPSHOT.pom
[JENKINS] Archiving <https://builds.apache.org/job/Struts-JDK7-pull-request/ws/plugins/plexus/pom.xml>
to org.apache.struts/struts2-plexus-plugin/2.3.25-SNAPSHOT/struts2-plexus-plugin-2.3.25-SNAPSHOT.pom
[JENKINS] Archiving <https://builds.apache.org/job/Struts-JDK7-pull-request/ws/plugins/jsf/pom.xml>
to org.apache.struts/struts2-jsf-plugin/2.3.25-SNAPSHOT/struts2-jsf-plugin-2.3.25-SNAPSHOT.pom
[JENKINS] Archiving <https://builds.apache.org/job/Struts-JDK7-pull-request/ws/plugins/config-browser/pom.xml>
to org.apache.struts/struts2-config-browser-plugin/2.3.25-SNAPSHOT/struts2-config-browser-plugin-2.3.25-SNAPSHOT.pom
[JENKINS] Archiving <https://builds.apache.org/job/Struts-JDK7-pull-request/ws/plugins/struts1/pom.xml>
to org.apache.struts/struts2-struts1-plugin/2.3.25-SNAPSHOT/struts2-struts1-plugin-2.3.25-SNAPSHOT.pom
[JENKINS] Archiving <https://builds.apache.org/job/Struts-JDK7-pull-request/ws/archetypes/struts2-archetype-blank/pom.xml>
to org.apache.struts/struts2-archetype-blank/2.3.25-SNAPSHOT/struts2-archetype-blank-2.3.25-SNAPSHOT.pom
[JENKINS] Archiving <https://builds.apache.org/job/Struts-JDK7-pull-request/ws/plugins/gxp/pom.xml>
to org.apache.struts/struts2-gxp-plugin/2.3.25-SNAPSHOT/struts2-gxp-plugin-2.3.25-SNAPSHOT.pom
[JENKINS] Archiving <https://builds.apache.org/job/Struts-JDK7-pull-request/ws/plugins/convention/pom.xml>
to org.apache.struts/struts2-convention-plugin/2.3.25-SNAPSHOT/struts2-convention-plugin-2.3.25-SNAPSHOT.pom
[JENKINS] Archiving <https://builds.apache.org/job/Struts-JDK7-pull-request/ws/plugins/convention/target/struts2-convention-plugin-2.3.25-SNAPSHOT.jar>
to org.apache.struts/struts2-convention-plugin/2.3.25-SNAPSHOT/struts2-convention-plugin-2.3.25-SNAPSHOT.jar
[JENKINS] Archiving <https://builds.apache.org/job/Struts-JDK7-pull-request/ws/plugins/convention/target/struts2-convention-plugin-2.3.25-SNAPSHOT-sources.jar>
to org.apache.struts/struts2-convention-plugin/2.3.25-SNAPSHOT/struts2-convention-plugin-2.3.25-SNAPSHOT-sources.jar
[JENKINS] Archiving <https://builds.apache.org/job/Struts-JDK7-pull-request/ws/bundles/pom.xml>
to org.apache.struts/struts2-osgi-bundles/2.3.25-SNAPSHOT/struts2-osgi-bundles-2.3.25-SNAPSHOT.pom
[JENKINS] Archiving <https://builds.apache.org/job/Struts-JDK7-pull-request/ws/pom.xml>
to org.apache.struts/struts2-parent/2.3.25-SNAPSHOT/struts2-parent-2.3.25-SNAPSHOT.pom
[JENKINS] Archiving <https://builds.apache.org/job/Struts-JDK7-pull-request/ws/target/struts2-parent-2.3.25-SNAPSHOT-site.xml>
to org.apache.struts/struts2-parent/2.3.25-SNAPSHOT/struts2-parent-2.3.25-SNAPSHOT-site.xml
[JENKINS] Archiving <https://builds.apache.org/job/Struts-JDK7-pull-request/ws/plugins/osgi/pom.xml>
to org.apache.struts/struts2-osgi-plugin/2.3.25-SNAPSHOT/struts2-osgi-plugin-2.3.25-SNAPSHOT.pom
[JENKINS] Archiving <https://builds.apache.org/job/Struts-JDK7-pull-request/ws/plugins/dojo/pom.xml>
to org.apache.struts/struts2-dojo-plugin/2.3.25-SNAPSHOT/struts2-dojo-plugin-2.3.25-SNAPSHOT.pom
[JENKINS] Archiving <https://builds.apache.org/job/Struts-JDK7-pull-request/ws/apps/showcase/pom.xml>
to org.apache.struts/struts2-showcase/2.3.25-SNAPSHOT/struts2-showcase-2.3.25-SNAPSHOT.pom
[JENKINS] Archiving <https://builds.apache.org/job/Struts-JDK7-pull-request/ws/plugins/rest/pom.xml>
to org.apache.struts/struts2-rest-plugin/2.3.25-SNAPSHOT/struts2-rest-plugin-2.3.25-SNAPSHOT.pom
[JENKINS] Archiving <https://builds.apache.org/job/Struts-JDK7-pull-request/ws/archetypes/struts2-archetype-convention/pom.xml>
to org.apache.struts/struts2-archetype-convention/2.3.25-SNAPSHOT/struts2-archetype-convention-2.3.25-SNAPSHOT.pom
[JENKINS] Archiving <https://builds.apache.org/job/Struts-JDK7-pull-request/ws/plugins/pom.xml>
to org.apache.struts/struts2-plugins/2.3.25-SNAPSHOT/struts2-plugins-2.3.25-SNAPSHOT.pom
[JENKINS] Archiving <https://builds.apache.org/job/Struts-JDK7-pull-request/ws/plugins/target/struts2-plugins-2.3.25-SNAPSHOT-site.xml>
to org.apache.struts/struts2-plugins/2.3.25-SNAPSHOT/struts2-plugins-2.3.25-SNAPSHOT-site.xml
[JENKINS] Archiving <https://builds.apache.org/job/Struts-JDK7-pull-request/ws/plugins/sitegraph/pom.xml>
to org.apache.struts/struts2-sitegraph-plugin/2.3.25-SNAPSHOT/struts2-sitegraph-plugin-2.3.25-SNAPSHOT.pom
[JENKINS] Archiving <https://builds.apache.org/job/Struts-JDK7-pull-request/ws/apps/portlet/pom.xml>
to org.apache.struts/struts2-portlet/2.3.25-SNAPSHOT/struts2-portlet-2.3.25-SNAPSHOT.pom
[JENKINS] Archiving <https://builds.apache.org/job/Struts-JDK7-pull-request/ws/plugins/testng/pom.xml>
to org.apache.struts/struts2-testng-plugin/2.3.25-SNAPSHOT/struts2-testng-plugin-2.3.25-SNAPSHOT.pom
[JENKINS] Archiving <https://builds.apache.org/job/Struts-JDK7-pull-request/ws/plugins/dwr/pom.xml>
to org.apache.struts/struts2-dwr-plugin/2.3.25-SNAPSHOT/struts2-dwr-plugin-2.3.25-SNAPSHOT.pom
[JENKINS] Archiving <https://builds.apache.org/job/Struts-JDK7-pull-request/ws/plugins/dwr/target/struts2-dwr-plugin-2.3.25-SNAPSHOT.jar>
to org.apache.struts/struts2-dwr-plugin/2.3.25-SNAPSHOT/struts2-dwr-plugin-2.3.25-SNAPSHOT.jar
[JENKINS] Archiving <https://builds.apache.org/job/Struts-JDK7-pull-request/ws/plugins/dwr/target/struts2-dwr-plugin-2.3.25-SNAPSHOT-sources.jar>
to org.apache.struts/struts2-dwr-plugin/2.3.25-SNAPSHOT/struts2-dwr-plugin-2.3.25-SNAPSHOT-sources.jar
[JENKINS] Archiving <https://builds.apache.org/job/Struts-JDK7-pull-request/ws/plugins/codebehind/pom.xml>
to org.apache.struts/struts2-codebehind-plugin/2.3.25-SNAPSHOT/struts2-codebehind-plugin-2.3.25-SNAPSHOT.pom
[JENKINS] Archiving <https://builds.apache.org/job/Struts-JDK7-pull-request/ws/plugins/portlet/pom.xml>
to org.apache.struts/struts2-portlet-plugin/2.3.25-SNAPSHOT/struts2-portlet-plugin-2.3.25-SNAPSHOT.pom
[JENKINS] Archiving <https://builds.apache.org/job/Struts-JDK7-pull-request/ws/plugins/portlet/target/struts2-portlet-plugin-2.3.25-SNAPSHOT.jar>
to org.apache.struts/struts2-portlet-plugin/2.3.25-SNAPSHOT/struts2-portlet-plugin-2.3.25-SNAPSHOT.jar
[JENKINS] Archiving <https://builds.apache.org/job/Struts-JDK7-pull-request/ws/plugins/portlet/target/struts2-portlet-plugin-2.3.25-SNAPSHOT-sources.jar>
to org.apache.struts/struts2-portlet-plugin/2.3.25-SNAPSHOT/struts2-portlet-plugin-2.3.25-SNAPSHOT-sources.jar
[JENKINS] Archiving <https://builds.apache.org/job/Struts-JDK7-pull-request/ws/plugins/spring/pom.xml>
to org.apache.struts/struts2-spring-plugin/2.3.25-SNAPSHOT/struts2-spring-plugin-2.3.25-SNAPSHOT.pom
[JENKINS] Archiving <https://builds.apache.org/job/Struts-JDK7-pull-request/ws/plugins/spring/target/struts2-spring-plugin-2.3.25-SNAPSHOT.jar>
to org.apache.struts/struts2-spring-plugin/2.3.25-SNAPSHOT/struts2-spring-plugin-2.3.25-SNAPSHOT.jar
[JENKINS] Archiving <https://builds.apache.org/job/Struts-JDK7-pull-request/ws/plugins/spring/target/struts2-spring-plugin-2.3.25-SNAPSHOT-sources.jar>
to org.apache.struts/struts2-spring-plugin/2.3.25-SNAPSHOT/struts2-spring-plugin-2.3.25-SNAPSHOT-sources.jar
[JENKINS] Archiving <https://builds.apache.org/job/Struts-JDK7-pull-request/ws/apps/blank/pom.xml>
to org.apache.struts/struts2-blank/2.3.25-SNAPSHOT/struts2-blank-2.3.25-SNAPSHOT.pom
[JENKINS] Archiving <https://builds.apache.org/job/Struts-JDK7-pull-request/ws/apps/blank/target/struts2-blank.war>
to org.apache.struts/struts2-blank/2.3.25-SNAPSHOT/struts2-blank-2.3.25-SNAPSHOT.war
[JENKINS] Archiving <https://builds.apache.org/job/Struts-JDK7-pull-request/ws/apps/blank/target/struts2-blank-sources.jar>
to org.apache.struts/struts2-blank/2.3.25-SNAPSHOT/struts2-blank-2.3.25-SNAPSHOT-sources.jar
Compressed 4.65 MB of artifacts by 47.7% relative to #82
[JENKINS] Archiving <https://builds.apache.org/job/Struts-JDK7-pull-request/ws/archetypes/struts2-archetype-starter/pom.xml>
to org.apache.struts/struts2-archetype-starter/2.3.25-SNAPSHOT/struts2-archetype-starter-2.3.25-SNAPSHOT.pom
channel stopped
[locks-and-latches] Releasing all the locks
[locks-and-latches] All the locks released
Putting comment on the pull request

---------------------------------------------------------------------
To unsubscribe, e-mail: dev-unsubscribe@struts.apache.org
For additional commands, e-mail: dev-help@struts.apache.org


Mime
View raw message