struts-dev mailing list archives

Site index · List index
Message view « Date » · « Thread »
Top « Date » · « Thread »
From Apache Jenkins Server <jenk...@builds.apache.org>
Subject Build failed in Jenkins: Struts-JDK8-master #34
Date Thu, 24 Sep 2015 18:53:05 GMT
See <https://builds.apache.org/job/Struts-JDK8-master/34/changes>

Changes:

[jogep] WW-4505 Add plugin to support bean validation

------------------------------------------
[...truncated 3885 lines...]
Generating <https://builds.apache.org/job/Struts-JDK8-master/ws/core/target/apidocs/com/opensymphony/xwork2/ognl/package-use.html...>
Generating <https://builds.apache.org/job/Struts-JDK8-master/ws/core/target/apidocs/com/opensymphony/xwork2/ognl/accessor/package-use.html...>
Generating <https://builds.apache.org/job/Struts-JDK8-master/ws/core/target/apidocs/com/opensymphony/xwork2/result/package-use.html...>
Generating <https://builds.apache.org/job/Struts-JDK8-master/ws/core/target/apidocs/com/opensymphony/xwork2/security/package-use.html...>
Generating <https://builds.apache.org/job/Struts-JDK8-master/ws/core/target/apidocs/com/opensymphony/xwork2/spring/package-use.html...>
Generating <https://builds.apache.org/job/Struts-JDK8-master/ws/core/target/apidocs/com/opensymphony/xwork2/spring/interceptor/package-use.html...>
Generating <https://builds.apache.org/job/Struts-JDK8-master/ws/core/target/apidocs/com/opensymphony/xwork2/test/package-use.html...>
Generating <https://builds.apache.org/job/Struts-JDK8-master/ws/core/target/apidocs/com/opensymphony/xwork2/util/package-use.html...>
Generating <https://builds.apache.org/job/Struts-JDK8-master/ws/core/target/apidocs/com/opensymphony/xwork2/util/classloader/package-use.html...>
Generating <https://builds.apache.org/job/Struts-JDK8-master/ws/core/target/apidocs/com/opensymphony/xwork2/util/finder/package-use.html...>
Generating <https://builds.apache.org/job/Struts-JDK8-master/ws/core/target/apidocs/com/opensymphony/xwork2/util/fs/package-use.html...>
Generating <https://builds.apache.org/job/Struts-JDK8-master/ws/core/target/apidocs/com/opensymphony/xwork2/util/location/package-use.html...>
Generating <https://builds.apache.org/job/Struts-JDK8-master/ws/core/target/apidocs/com/opensymphony/xwork2/util/logging/package-use.html...>
Generating <https://builds.apache.org/job/Struts-JDK8-master/ws/core/target/apidocs/com/opensymphony/xwork2/util/logging/commons/package-use.html...>
Generating <https://builds.apache.org/job/Struts-JDK8-master/ws/core/target/apidocs/com/opensymphony/xwork2/util/logging/jdk/package-use.html...>
Generating <https://builds.apache.org/job/Struts-JDK8-master/ws/core/target/apidocs/com/opensymphony/xwork2/util/logging/log4j2/package-use.html...>
Generating <https://builds.apache.org/job/Struts-JDK8-master/ws/core/target/apidocs/com/opensymphony/xwork2/util/logging/slf4j/package-use.html...>
Generating <https://builds.apache.org/job/Struts-JDK8-master/ws/core/target/apidocs/com/opensymphony/xwork2/util/profiling/package-use.html...>
Generating <https://builds.apache.org/job/Struts-JDK8-master/ws/core/target/apidocs/com/opensymphony/xwork2/util/reflection/package-use.html...>
Generating <https://builds.apache.org/job/Struts-JDK8-master/ws/core/target/apidocs/com/opensymphony/xwork2/validator/package-use.html...>
Generating <https://builds.apache.org/job/Struts-JDK8-master/ws/core/target/apidocs/com/opensymphony/xwork2/validator/annotations/package-use.html...>
Generating <https://builds.apache.org/job/Struts-JDK8-master/ws/core/target/apidocs/com/opensymphony/xwork2/validator/validators/package-use.html...>
Generating <https://builds.apache.org/job/Struts-JDK8-master/ws/core/target/apidocs/org/apache/struts2/package-use.html...>
Generating <https://builds.apache.org/job/Struts-JDK8-master/ws/core/target/apidocs/org/apache/struts2/components/package-use.html...>
Generating <https://builds.apache.org/job/Struts-JDK8-master/ws/core/target/apidocs/org/apache/struts2/components/template/package-use.html...>
Generating <https://builds.apache.org/job/Struts-JDK8-master/ws/core/target/apidocs/org/apache/struts2/config/package-use.html...>
Generating <https://builds.apache.org/job/Struts-JDK8-master/ws/core/target/apidocs/org/apache/struts2/dispatcher/package-use.html...>
Generating <https://builds.apache.org/job/Struts-JDK8-master/ws/core/target/apidocs/org/apache/struts2/dispatcher/filter/package-use.html...>
Generating <https://builds.apache.org/job/Struts-JDK8-master/ws/core/target/apidocs/org/apache/struts2/dispatcher/listener/package-use.html...>
Generating <https://builds.apache.org/job/Struts-JDK8-master/ws/core/target/apidocs/org/apache/struts2/dispatcher/mapper/package-use.html...>
Generating <https://builds.apache.org/job/Struts-JDK8-master/ws/core/target/apidocs/org/apache/struts2/dispatcher/multipart/package-use.html...>
Generating <https://builds.apache.org/job/Struts-JDK8-master/ws/core/target/apidocs/org/apache/struts2/dispatcher/servlet/package-use.html...>
Generating <https://builds.apache.org/job/Struts-JDK8-master/ws/core/target/apidocs/org/apache/struts2/factory/package-use.html...>
Generating <https://builds.apache.org/job/Struts-JDK8-master/ws/core/target/apidocs/org/apache/struts2/interceptor/package-use.html...>
Generating <https://builds.apache.org/job/Struts-JDK8-master/ws/core/target/apidocs/org/apache/struts2/interceptor/debugging/package-use.html...>
Generating <https://builds.apache.org/job/Struts-JDK8-master/ws/core/target/apidocs/org/apache/struts2/interceptor/servlet/package-use.html...>
Generating <https://builds.apache.org/job/Struts-JDK8-master/ws/core/target/apidocs/org/apache/struts2/interceptor/validation/package-use.html...>
Generating <https://builds.apache.org/job/Struts-JDK8-master/ws/core/target/apidocs/org/apache/struts2/result/package-use.html...>
Generating <https://builds.apache.org/job/Struts-JDK8-master/ws/core/target/apidocs/org/apache/struts2/util/package-use.html...>
Generating <https://builds.apache.org/job/Struts-JDK8-master/ws/core/target/apidocs/org/apache/struts2/util/fs/package-use.html...>
Generating <https://builds.apache.org/job/Struts-JDK8-master/ws/core/target/apidocs/org/apache/struts2/views/package-use.html...>
Generating <https://builds.apache.org/job/Struts-JDK8-master/ws/core/target/apidocs/org/apache/struts2/views/annotations/package-use.html...>
Generating <https://builds.apache.org/job/Struts-JDK8-master/ws/core/target/apidocs/org/apache/struts2/views/freemarker/package-use.html...>
Generating <https://builds.apache.org/job/Struts-JDK8-master/ws/core/target/apidocs/org/apache/struts2/views/freemarker/tags/package-use.html...>
Generating <https://builds.apache.org/job/Struts-JDK8-master/ws/core/target/apidocs/org/apache/struts2/views/jsp/package-use.html...>
Generating <https://builds.apache.org/job/Struts-JDK8-master/ws/core/target/apidocs/org/apache/struts2/views/jsp/iterator/package-use.html...>
Generating <https://builds.apache.org/job/Struts-JDK8-master/ws/core/target/apidocs/org/apache/struts2/views/jsp/ui/package-use.html...>
Generating <https://builds.apache.org/job/Struts-JDK8-master/ws/core/target/apidocs/org/apache/struts2/views/util/package-use.html...>
Generating <https://builds.apache.org/job/Struts-JDK8-master/ws/core/target/apidocs/org/apache/struts2/views/velocity/package-use.html...>
Generating <https://builds.apache.org/job/Struts-JDK8-master/ws/core/target/apidocs/org/apache/struts2/views/velocity/components/package-use.html...>
Generating <https://builds.apache.org/job/Struts-JDK8-master/ws/core/target/apidocs/org/apache/struts2/views/xslt/package-use.html...>
Building index for all the packages and classes...
Generating <https://builds.apache.org/job/Struts-JDK8-master/ws/core/target/apidocs/overview-tree.html...>
Generating <https://builds.apache.org/job/Struts-JDK8-master/ws/core/target/apidocs/index-all.html...>
Generating <https://builds.apache.org/job/Struts-JDK8-master/ws/core/target/apidocs/deprecated-list.html...>
Building index for all classes...
Generating <https://builds.apache.org/job/Struts-JDK8-master/ws/core/target/apidocs/allclasses-frame.html...>
Generating <https://builds.apache.org/job/Struts-JDK8-master/ws/core/target/apidocs/allclasses-noframe.html...>
Generating <https://builds.apache.org/job/Struts-JDK8-master/ws/core/target/apidocs/index.html...>
Generating <https://builds.apache.org/job/Struts-JDK8-master/ws/core/target/apidocs/overview-summary.html...>
Generating <https://builds.apache.org/job/Struts-JDK8-master/ws/core/target/apidocs/help-doc.html...>
[INFO] Building jar: <https://builds.apache.org/job/Struts-JDK8-master/ws/core/target/struts2-core-2.5-SNAPSHOT-javadoc.jar>
[INFO] 
[INFO] --- maven-remote-resources-plugin:1.2.1:process (default) @ struts2-core ---
[INFO] 
[INFO] --- maven-resources-plugin:2.5:resources (default-resources) @ struts2-core ---
[debug] execute contextualize
[INFO] Using 'UTF-8' encoding to copy filtered resources.
[INFO] Copying 197 resources
[INFO] Copying 3 resources
[INFO] 
[INFO] --- maven-compiler-plugin:2.3.2:compile (default-compile) @ struts2-core ---
[INFO] Compiling 732 source files to <https://builds.apache.org/job/Struts-JDK8-master/ws/core/target/classes>
[INFO] 
[INFO] --- maven-apt-plugin:1.0.15:execute (default) @ struts2-core ---
[INFO] ------------------------------------------------------------------------
[INFO] Reactor Summary:
[INFO] 
[INFO] Struts 2 Bill of Materials ........................ SUCCESS [  7.869 s]
[INFO] Struts 2 .......................................... SUCCESS [  6.641 s]
[INFO] Struts 2 Core ..................................... FAILURE [ 21.242 s]
[INFO] Struts Plugins .................................... SKIPPED
[INFO] Struts 2 Spring Plugin ............................ SKIPPED
[INFO] Struts 2 Convention Plugin ........................ SKIPPED
[INFO] Struts 2 JUnit Plugin ............................. SKIPPED
[INFO] Struts 2 Portlet Plugin ........................... SKIPPED
[INFO] Struts 2 DWR Plugin ............................... SKIPPED
[INFO] Struts 2 Tiles Plugin ............................. SKIPPED
[INFO] Struts 2 Portlet Tiles Plugin ..................... SKIPPED
[INFO] Struts 2 Webapps .................................. SKIPPED
[INFO] Struts 2 Portlet Webapp ........................... SKIPPED
[INFO] Struts 2 Configuration Browser Plugin ............. SKIPPED
[INFO] Struts 2 Sitemesh Plugin .......................... SKIPPED
[INFO] Struts 2 JSON Plugin .............................. SKIPPED
[INFO] Struts 2 Bean Validation Plugin ................... SKIPPED
[INFO] Struts 2 Showcase Webapp .......................... SKIPPED
[INFO] Struts 2 REST Plugin .............................. SKIPPED
[INFO] Struts 2 Rest Showcase Webapp ..................... SKIPPED
[INFO] Struts 2 CDI Plugin ............................... SKIPPED
[INFO] Struts 2 Embedded JSP Plugin ...................... SKIPPED
[INFO] Struts 2 GXP Plugin ............................... SKIPPED
[INFO] Struts 2 Jasper Reports Plugin .................... SKIPPED
[INFO] Struts 2 Java 8 support plugin .................... SKIPPED
[INFO] Struts 2 Java Templates Plugin .................... SKIPPED
[INFO] Struts 2 JFreeChart Plugin ........................ SKIPPED
[INFO] Struts 2 OSGi Plugin .............................. SKIPPED
[INFO] Struts 2 OVal Plugin .............................. SKIPPED
[INFO] Struts 2 Pell Multipart Plugin .................... SKIPPED
[INFO] Struts 2 Plexus Plugin ............................ SKIPPED
[INFO] Struts 2 Sitegraph Plugin ......................... SKIPPED
[INFO] Struts 2 TestNG Plugin ............................ SKIPPED
[INFO] Struts 2 Tiles 3 Plugin ........................... SKIPPED
[INFO] Struts OSGi Bundles ............................... SKIPPED
[INFO] Struts 2 OSGi Admin Bundle ........................ SKIPPED
[INFO] Struts 2 OSGi Demo Bundle ......................... SKIPPED
[INFO] Struts 2 Maven Archetypes ......................... SKIPPED
[INFO] Struts 2 Archetypes - Angular JS .................. SKIPPED
[INFO] Struts 2 Archetypes - Blank ....................... SKIPPED
[INFO] Struts 2 Archetypes - Blank Convention ............ SKIPPED
[INFO] Struts 2 Archetypes - Database Portlet ............ SKIPPED
[INFO] Struts 2 Archetypes - Plugin ...................... SKIPPED
[INFO] Struts 2 Archetypes - Portlet ..................... SKIPPED
[INFO] Struts 2 Archetypes - Starter ..................... SKIPPED
[INFO] Struts 2 Assembly ................................. SKIPPED
[INFO] ------------------------------------------------------------------------
[INFO] BUILD FAILURE
[INFO] ------------------------------------------------------------------------
[INFO] Total time: 57.810 s
[INFO] Finished at: 2015-09-24T18:52:57+00:00
[INFO] Final Memory: 49M/321M
[INFO] ------------------------------------------------------------------------
[ERROR] Failed to execute goal org.apache.myfaces.tobago:maven-apt-plugin:1.0.15:execute (default)
on project struts2-core: Error starting apt compiler: com.sun.tools.apt.Main -> [Help 1]
[ERROR] 
[ERROR] To see the full stack trace of the errors, re-run Maven with the -e switch.
[ERROR] Re-run Maven using the -X switch to enable full debug logging.
[ERROR] 
[ERROR] For more information about the errors and possible solutions, please read the following
articles:
[ERROR] [Help 1] http://cwiki.apache.org/confluence/display/MAVEN/MojoExecutionException
[ERROR] 
[ERROR] After correcting the problems, you can resume the build with the command
[ERROR]   mvn <goals> -rf :struts2-core
[JENKINS] Archiving <https://builds.apache.org/job/Struts-JDK8-master/ws/plugins/plexus/pom.xml>
to org.apache.struts/struts2-plexus-plugin/2.5-SNAPSHOT/struts2-plexus-plugin-2.5-SNAPSHOT.pom
No prior successful build to compare, so performing full copy of artifacts
[JENKINS] Archiving <https://builds.apache.org/job/Struts-JDK8-master/ws/plugins/pell-multipart/pom.xml>
to org.apache.struts/struts2-pell-multipart-plugin/2.5-SNAPSHOT/struts2-pell-multipart-plugin-2.5-SNAPSHOT.pom
No prior successful build to compare, so performing full copy of artifacts
[JENKINS] Archiving <https://builds.apache.org/job/Struts-JDK8-master/ws/plugins/java8-support/pom.xml>
to org.apache.struts/struts2-java8-support-plugin/2.5-SNAPSHOT/struts2-java8-support-plugin-2.5-SNAPSHOT.pom
No prior successful build to compare, so performing full copy of artifacts
[JENKINS] Archiving <https://builds.apache.org/job/Struts-JDK8-master/ws/plugins/jfreechart/pom.xml>
to org.apache.struts/struts2-jfreechart-plugin/2.5-SNAPSHOT/struts2-jfreechart-plugin-2.5-SNAPSHOT.pom
No prior successful build to compare, so performing full copy of artifacts
[JENKINS] Archiving <https://builds.apache.org/job/Struts-JDK8-master/ws/plugins/sitemesh/pom.xml>
to org.apache.struts/struts2-sitemesh-plugin/2.5-SNAPSHOT/struts2-sitemesh-plugin-2.5-SNAPSHOT.pom
No prior successful build to compare, so performing full copy of artifacts
[JENKINS] Archiving <https://builds.apache.org/job/Struts-JDK8-master/ws/plugins/config-browser/pom.xml>
to org.apache.struts/struts2-config-browser-plugin/2.5-SNAPSHOT/struts2-config-browser-plugin-2.5-SNAPSHOT.pom
No prior successful build to compare, so performing full copy of artifacts
[JENKINS] Archiving <https://builds.apache.org/job/Struts-JDK8-master/ws/archetypes/struts2-archetype-portlet/pom.xml>
to org.apache.struts/struts2-archetype-portlet/2.5-SNAPSHOT/struts2-archetype-portlet-2.5-SNAPSHOT.pom
No prior successful build to compare, so performing full copy of artifacts
[JENKINS] Archiving <https://builds.apache.org/job/Struts-JDK8-master/ws/bundles/demo/pom.xml>
to org.apache.struts/struts2-osgi-demo-bundle/2.5-SNAPSHOT/struts2-osgi-demo-bundle-2.5-SNAPSHOT.pom
No prior successful build to compare, so performing full copy of artifacts
[JENKINS] Archiving <https://builds.apache.org/job/Struts-JDK8-master/ws/plugins/portlet-tiles/pom.xml>
to org.apache.struts/struts2-portlet-tiles-plugin/2.5-SNAPSHOT/struts2-portlet-tiles-plugin-2.5-SNAPSHOT.pom
No prior successful build to compare, so performing full copy of artifacts
[JENKINS] Archiving <https://builds.apache.org/job/Struts-JDK8-master/ws/plugins/jasperreports/pom.xml>
to org.apache.struts/struts2-jasperreports-plugin/2.5-SNAPSHOT/struts2-jasperreports-plugin-2.5-SNAPSHOT.pom
No prior successful build to compare, so performing full copy of artifacts
[JENKINS] Archiving <https://builds.apache.org/job/Struts-JDK8-master/ws/archetypes/struts2-archetype-blank/pom.xml>
to org.apache.struts/struts2-archetype-blank/2.5-SNAPSHOT/struts2-archetype-blank-2.5-SNAPSHOT.pom
No prior successful build to compare, so performing full copy of artifacts
[JENKINS] Archiving <https://builds.apache.org/job/Struts-JDK8-master/ws/plugins/tiles3/pom.xml>
to org.apache.struts/struts2-tiles3-plugin/2.5-SNAPSHOT/struts2-tiles3-plugin-2.5-SNAPSHOT.pom
No prior successful build to compare, so performing full copy of artifacts
[JENKINS] Archiving <https://builds.apache.org/job/Struts-JDK8-master/ws/plugins/oval/pom.xml>
to org.apache.struts/struts2-oval-plugin/2.5-SNAPSHOT/struts2-oval-plugin-2.5-SNAPSHOT.pom
No prior successful build to compare, so performing full copy of artifacts
[JENKINS] Archiving <https://builds.apache.org/job/Struts-JDK8-master/ws/plugins/gxp/pom.xml>
to org.apache.struts/struts2-gxp-plugin/2.5-SNAPSHOT/struts2-gxp-plugin-2.5-SNAPSHOT.pom
No prior successful build to compare, so performing full copy of artifacts
[JENKINS] Archiving <https://builds.apache.org/job/Struts-JDK8-master/ws/plugins/convention/pom.xml>
to org.apache.struts/struts2-convention-plugin/2.5-SNAPSHOT/struts2-convention-plugin-2.5-SNAPSHOT.pom
No prior successful build to compare, so performing full copy of artifacts
[JENKINS] Archiving <https://builds.apache.org/job/Struts-JDK8-master/ws/bundles/pom.xml>
to org.apache.struts/struts2-osgi-bundles/2.5-SNAPSHOT/struts2-osgi-bundles-2.5-SNAPSHOT.pom
No prior successful build to compare, so performing full copy of artifacts
[JENKINS] Archiving <https://builds.apache.org/job/Struts-JDK8-master/ws/pom.xml> to
org.apache.struts/struts2-parent/2.5-SNAPSHOT/struts2-parent-2.5-SNAPSHOT.pom
[JENKINS] Archiving <https://builds.apache.org/job/Struts-JDK8-master/ws/target/struts2-parent-2.5-SNAPSHOT-site.xml>
to org.apache.struts/struts2-parent/2.5-20150924.185213-87/struts2-parent-2.5-20150924.185213-87-site.xml
Sending artifact delta relative to Struts-JDK8-master » Struts 2 #33
Archived 2 artifacts
Archive block size is 32768
Received 0 blocks and 39407 bytes
Compression is 0.0%
Took 0.17 sec
[JENKINS] Archiving <https://builds.apache.org/job/Struts-JDK8-master/ws/plugins/osgi/pom.xml>
to org.apache.struts/struts2-osgi-plugin/2.5-SNAPSHOT/struts2-osgi-plugin-2.5-SNAPSHOT.pom
No prior successful build to compare, so performing full copy of artifacts
[JENKINS] Archiving <https://builds.apache.org/job/Struts-JDK8-master/ws/assembly/pom.xml>
to org.apache.struts/struts2-assembly/2.5-SNAPSHOT/struts2-assembly-2.5-SNAPSHOT.pom
No prior successful build to compare, so performing full copy of artifacts
[JENKINS] Archiving <https://builds.apache.org/job/Struts-JDK8-master/ws/apps/showcase/pom.xml>
to org.apache.struts/struts2-showcase/2.5-SNAPSHOT/struts2-showcase-2.5-SNAPSHOT.pom
No prior successful build to compare, so performing full copy of artifacts
[JENKINS] Archiving <https://builds.apache.org/job/Struts-JDK8-master/ws/plugins/cdi/pom.xml>
to org.apache.struts/struts2-cdi-plugin/2.5-SNAPSHOT/struts2-cdi-plugin-2.5-SNAPSHOT.pom
No prior successful build to compare, so performing full copy of artifacts
[JENKINS] Archiving <https://builds.apache.org/job/Struts-JDK8-master/ws/plugins/rest/pom.xml>
to org.apache.struts/struts2-rest-plugin/2.5-SNAPSHOT/struts2-rest-plugin-2.5-SNAPSHOT.pom
No prior successful build to compare, so performing full copy of artifacts
[JENKINS] Archiving <https://builds.apache.org/job/Struts-JDK8-master/ws/core/pom.xml>
to org.apache.struts/struts2-core/2.5-SNAPSHOT/struts2-core-2.5-SNAPSHOT.pom
[JENKINS] Archiving <https://builds.apache.org/job/Struts-JDK8-master/ws/core/target/struts2-core-2.5-SNAPSHOT-sources.jar>
to org.apache.struts/struts2-core/2.5-SNAPSHOT/struts2-core-2.5-SNAPSHOT-sources.jar
[JENKINS] Archiving <https://builds.apache.org/job/Struts-JDK8-master/ws/core/target/struts2-core-2.5-SNAPSHOT-javadoc.jar>
to org.apache.struts/struts2-core/2.5-SNAPSHOT/struts2-core-2.5-SNAPSHOT-javadoc.jar
No prior successful build to compare, so performing full copy of artifacts
[JENKINS] Archiving <https://builds.apache.org/job/Struts-JDK8-master/ws/plugins/tiles/pom.xml>
to org.apache.struts/struts2-tiles-plugin/2.5-SNAPSHOT/struts2-tiles-plugin-2.5-SNAPSHOT.pom
No prior successful build to compare, so performing full copy of artifacts
[JENKINS] Archiving <https://builds.apache.org/job/Struts-JDK8-master/ws/archetypes/struts2-archetype-dbportlet/pom.xml>
to org.apache.struts/struts2-archetype-dbportlet/2.5-SNAPSHOT/struts2-archetype-dbportlet-2.5-SNAPSHOT.pom
No prior successful build to compare, so performing full copy of artifacts
[JENKINS] Archiving <https://builds.apache.org/job/Struts-JDK8-master/ws/archetypes/struts2-archetype-convention/pom.xml>
to org.apache.struts/struts2-archetype-convention/2.5-SNAPSHOT/struts2-archetype-convention-2.5-SNAPSHOT.pom
No prior successful build to compare, so performing full copy of artifacts
[JENKINS] Archiving <https://builds.apache.org/job/Struts-JDK8-master/ws/archetypes/pom.xml>
to org.apache.struts/struts2-archetypes/2.5-SNAPSHOT/struts2-archetypes-2.5-SNAPSHOT.pom
No prior successful build to compare, so performing full copy of artifacts
[JENKINS] Archiving <https://builds.apache.org/job/Struts-JDK8-master/ws/bom/pom.xml>
to org.apache.struts/struts2-bom/2.5-SNAPSHOT/struts2-bom-2.5-SNAPSHOT.pom
Sending artifact delta relative to Struts-JDK8-master » Struts 2 Bill of Materials #33
Archived 1 artifacts
Archive block size is 32768
Received 0 blocks and 7820 bytes
Compression is 0.0%
Took 0.16 sec
[JENKINS] Archiving <https://builds.apache.org/job/Struts-JDK8-master/ws/plugins/embeddedjsp/pom.xml>
to org.apache.struts/struts2-embeddedjsp-plugin/2.5-SNAPSHOT/struts2-embeddedjsp-plugin-2.5-SNAPSHOT.pom
No prior successful build to compare, so performing full copy of artifacts
[JENKINS] Archiving <https://builds.apache.org/job/Struts-JDK8-master/ws/plugins/pom.xml>
to org.apache.struts/struts2-plugins/2.5-SNAPSHOT/struts2-plugins-2.5-SNAPSHOT.pom
No prior successful build to compare, so performing full copy of artifacts
[JENKINS] Archiving <https://builds.apache.org/job/Struts-JDK8-master/ws/apps/rest-showcase/pom.xml>
to org.apache.struts/struts2-rest-showcase/2.5-SNAPSHOT/struts2-rest-showcase-2.5-SNAPSHOT.pom
No prior successful build to compare, so performing full copy of artifacts
[JENKINS] Archiving <https://builds.apache.org/job/Struts-JDK8-master/ws/plugins/javatemplates/pom.xml>
to org.apache.struts/struts2-javatemplates-plugin/2.5-SNAPSHOT/struts2-javatemplates-plugin-2.5-SNAPSHOT.pom
No prior successful build to compare, so performing full copy of artifacts
[JENKINS] Archiving <https://builds.apache.org/job/Struts-JDK8-master/ws/bundles/admin/pom.xml>
to org.apache.struts/struts2-osgi-admin-bundle/2.5-SNAPSHOT/struts2-osgi-admin-bundle-2.5-SNAPSHOT.pom
No prior successful build to compare, so performing full copy of artifacts
[JENKINS] Archiving <https://builds.apache.org/job/Struts-JDK8-master/ws/apps/pom.xml>
to org.apache.struts/struts2-apps/2.5-SNAPSHOT/struts2-apps-2.5-SNAPSHOT.pom
No prior successful build to compare, so performing full copy of artifacts
[JENKINS] Archiving <https://builds.apache.org/job/Struts-JDK8-master/ws/plugins/sitegraph/pom.xml>
to org.apache.struts/struts2-sitegraph-plugin/2.5-SNAPSHOT/struts2-sitegraph-plugin-2.5-SNAPSHOT.pom
No prior successful build to compare, so performing full copy of artifacts
[JENKINS] Archiving <https://builds.apache.org/job/Struts-JDK8-master/ws/plugins/testng/pom.xml>
to org.apache.struts/struts2-testng-plugin/2.5-SNAPSHOT/struts2-testng-plugin-2.5-SNAPSHOT.pom
No prior successful build to compare, so performing full copy of artifacts
[JENKINS] Archiving <https://builds.apache.org/job/Struts-JDK8-master/ws/apps/portlet/pom.xml>
to org.apache.struts/struts2-portlet/2.5-SNAPSHOT/struts2-portlet-2.5-SNAPSHOT.pom
No prior successful build to compare, so performing full copy of artifacts
[JENKINS] Archiving <https://builds.apache.org/job/Struts-JDK8-master/ws/plugins/json/pom.xml>
to org.apache.struts/struts2-json-plugin/2.5-SNAPSHOT/struts2-json-plugin-2.5-SNAPSHOT.pom
No prior successful build to compare, so performing full copy of artifacts
[JENKINS] Archiving <https://builds.apache.org/job/Struts-JDK8-master/ws/plugins/junit/pom.xml>
to org.apache.struts/struts2-junit-plugin/2.5-SNAPSHOT/struts2-junit-plugin-2.5-SNAPSHOT.pom
No prior successful build to compare, so performing full copy of artifacts
[JENKINS] Archiving <https://builds.apache.org/job/Struts-JDK8-master/ws/plugins/dwr/pom.xml>
to org.apache.struts/struts2-dwr-plugin/2.5-SNAPSHOT/struts2-dwr-plugin-2.5-SNAPSHOT.pom
No prior successful build to compare, so performing full copy of artifacts
[JENKINS] Archiving <https://builds.apache.org/job/Struts-JDK8-master/ws/archetypes/struts2-archetype-plugin/pom.xml>
to org.apache.struts/struts2-archetype-plugin/2.5-SNAPSHOT/struts2-archetype-plugin-2.5-SNAPSHOT.pom
No prior successful build to compare, so performing full copy of artifacts
[JENKINS] Archiving <https://builds.apache.org/job/Struts-JDK8-master/ws/plugins/bean-validation/pom.xml>
to org.apache.struts/struts2-bean-validation-plugin/2.5-SNAPSHOT/struts2-bean-validation-plugin-2.5-SNAPSHOT.pom
No prior successful build to compare, so performing full copy of artifacts
[JENKINS] Archiving <https://builds.apache.org/job/Struts-JDK8-master/ws/archetypes/struts2-archetype-angularjs/pom.xml>
to org.apache.struts/struts2-archetype-angularjs/2.5-SNAPSHOT/struts2-archetype-angularjs-2.5-SNAPSHOT.pom
No prior successful build to compare, so performing full copy of artifacts
[JENKINS] Archiving <https://builds.apache.org/job/Struts-JDK8-master/ws/plugins/portlet/pom.xml>
to org.apache.struts/struts2-portlet-plugin/2.5-SNAPSHOT/struts2-portlet-plugin-2.5-SNAPSHOT.pom
No prior successful build to compare, so performing full copy of artifacts
[JENKINS] Archiving <https://builds.apache.org/job/Struts-JDK8-master/ws/plugins/spring/pom.xml>
to org.apache.struts/struts2-spring-plugin/2.5-SNAPSHOT/struts2-spring-plugin-2.5-SNAPSHOT.pom
No prior successful build to compare, so performing full copy of artifacts
[JENKINS] Archiving <https://builds.apache.org/job/Struts-JDK8-master/ws/archetypes/struts2-archetype-starter/pom.xml>
to org.apache.struts/struts2-archetype-starter/2.5-SNAPSHOT/struts2-archetype-starter-2.5-SNAPSHOT.pom
No prior successful build to compare, so performing full copy of artifacts
channel stopped
[locks-and-latches] Releasing all the locks
[locks-and-latches] All the locks released

---------------------------------------------------------------------
To unsubscribe, e-mail: dev-unsubscribe@struts.apache.org
For additional commands, e-mail: dev-help@struts.apache.org


Mime
View raw message