struts-dev mailing list archives

Site index · List index
Message view « Date » · « Thread »
Top « Date » · « Thread »
From Apache Jenkins Server <jenk...@builds.apache.org>
Subject Build failed in Jenkins: Struts-JDK8-master #19
Date Thu, 16 Jul 2015 20:58:17 GMT
See <https://builds.apache.org/job/Struts-JDK8-master/19/changes>

Changes:

[jogep] Fix wrong closing HTML tags in javadoc comments

[jogep] Correct Exception type in java doc

------------------------------------------
[...truncated 2592 lines...]
[ERROR] * @return Vector<String> containing matching filenames
[ERROR] ^
[ERROR] <https://builds.apache.org/job/Struts-JDK8-master/ws/core/src/main/java/com/opensymphony/xwork2/util/CreateIfNull.java>:54:
error: no summary or caption for table
[ERROR] * </table>
[ERROR] ^
[ERROR] <https://builds.apache.org/job/Struts-JDK8-master/ws/core/src/main/java/com/opensymphony/xwork2/util/CreateIfNull.java>:61:
error: unknown tag: User
[ERROR] * private List<User> users;
[ERROR] ^
[ERROR] <https://builds.apache.org/job/Struts-JDK8-master/ws/core/src/main/java/com/opensymphony/xwork2/util/Element.java>:54:
error: no summary or caption for table
[ERROR] * </table>
[ERROR] ^
[ERROR] <https://builds.apache.org/job/Struts-JDK8-master/ws/core/src/main/java/com/opensymphony/xwork2/util/Element.java>:62:
error: malformed HTML
[ERROR] * private Map<Long, User> userMap;
[ERROR] ^
[ERROR] <https://builds.apache.org/job/Struts-JDK8-master/ws/core/src/main/java/com/opensymphony/xwork2/util/Element.java>:62:
error: bad use of '>'
[ERROR] * private Map<Long, User> userMap;
[ERROR] ^
[ERROR] <https://builds.apache.org/job/Struts-JDK8-master/ws/core/src/main/java/com/opensymphony/xwork2/util/Element.java>:65:
error: unknown tag: User
[ERROR] * public List<User> userList;
[ERROR] ^
[ERROR] <https://builds.apache.org/job/Struts-JDK8-master/ws/core/src/main/java/com/opensymphony/xwork2/util/Key.java>:54:
error: no summary or caption for table
[ERROR] * </table>
[ERROR] ^
[ERROR] <https://builds.apache.org/job/Struts-JDK8-master/ws/core/src/main/java/com/opensymphony/xwork2/util/Key.java>:62:
error: malformed HTML
[ERROR] * private Map<Long, User> userMap;
[ERROR] ^
[ERROR] <https://builds.apache.org/job/Struts-JDK8-master/ws/core/src/main/java/com/opensymphony/xwork2/util/Key.java>:62:
error: bad use of '>'
[ERROR] * private Map<Long, User> userMap;
[ERROR] ^
[ERROR] <https://builds.apache.org/job/Struts-JDK8-master/ws/core/src/main/java/com/opensymphony/xwork2/util/KeyProperty.java>:55:
error: no summary or caption for table
[ERROR] * </table>
[ERROR] ^
[ERROR] <https://builds.apache.org/job/Struts-JDK8-master/ws/core/src/main/java/com/opensymphony/xwork2/util/KeyProperty.java>:63:
error: unknown tag: User
[ERROR] * protected List<User> users = null;
[ERROR] ^
[ERROR] <https://builds.apache.org/job/Struts-JDK8-master/ws/core/src/main/java/com/opensymphony/xwork2/util/LocalizedTextUtil.java>:63:
error: self-closing element not allowed
[ERROR] * com/<br/>
[ERROR] ^
[ERROR] <https://builds.apache.org/job/Struts-JDK8-master/ws/core/src/main/java/com/opensymphony/xwork2/util/LocalizedTextUtil.java>:64:
error: self-closing element not allowed
[ERROR] * &nbsp; acme/<br/>
[ERROR] ^
[ERROR] <https://builds.apache.org/job/Struts-JDK8-master/ws/core/src/main/java/com/opensymphony/xwork2/util/LocalizedTextUtil.java>:65:
error: self-closing element not allowed
[ERROR] * &nbsp; &nbsp; package.properties<br/>
[ERROR] ^
[ERROR] <https://builds.apache.org/job/Struts-JDK8-master/ws/core/src/main/java/com/opensymphony/xwork2/util/LocalizedTextUtil.java>:66:
error: self-closing element not allowed
[ERROR] * &nbsp; &nbsp; actions/<br/>
[ERROR] ^
[ERROR] <https://builds.apache.org/job/Struts-JDK8-master/ws/core/src/main/java/com/opensymphony/xwork2/util/LocalizedTextUtil.java>:67:
error: self-closing element not allowed
[ERROR] * &nbsp; &nbsp; &nbsp; package.properties<br/>
[ERROR] ^
[ERROR] <https://builds.apache.org/job/Struts-JDK8-master/ws/core/src/main/java/com/opensymphony/xwork2/util/LocalizedTextUtil.java>:68:
error: self-closing element not allowed
[ERROR] * &nbsp; &nbsp; &nbsp; FooAction.java<br/>
[ERROR] ^
[ERROR] <https://builds.apache.org/job/Struts-JDK8-master/ws/core/src/main/java/com/opensymphony/xwork2/util/LocalizedTextUtil.java>:69:
error: self-closing element not allowed
[ERROR] * &nbsp; &nbsp; &nbsp; FooAction.properties<br/>
[ERROR] ^
[ERROR] <https://builds.apache.org/job/Struts-JDK8-master/ws/core/src/main/java/com/opensymphony/xwork2/util/NamedVariablePatternMatcher.java>:40:
error: malformed HTML
[ERROR] *  <td><code>/animals/{animal}</code</td>
[ERROR] ^
[ERROR] <https://builds.apache.org/job/Struts-JDK8-master/ws/core/src/main/java/com/opensymphony/xwork2/util/NamedVariablePatternMatcher.java>:40:
error: end tag missing: </code>
[ERROR] *  <td><code>/animals/{animal}</code</td>
[ERROR] ^
[ERROR] <https://builds.apache.org/job/Struts-JDK8-master/ws/core/src/main/java/com/opensymphony/xwork2/util/NamedVariablePatternMatcher.java>:42:
error: bad use of '>'
[ERROR] *  <td>{animal -> dog}</td>
[ERROR] ^
[ERROR] <https://builds.apache.org/job/Struts-JDK8-master/ws/core/src/main/java/com/opensymphony/xwork2/util/NamedVariablePatternMatcher.java>:45:
error: malformed HTML
[ERROR] *  <td><code>/animals/{animal}/tag/No{id}</code</td>
[ERROR] ^
[ERROR] <https://builds.apache.org/job/Struts-JDK8-master/ws/core/src/main/java/com/opensymphony/xwork2/util/NamedVariablePatternMatcher.java>:45:
error: end tag missing: </code>
[ERROR] *  <td><code>/animals/{animal}/tag/No{id}</code</td>
[ERROR] ^
[ERROR] <https://builds.apache.org/job/Struts-JDK8-master/ws/core/src/main/java/com/opensymphony/xwork2/util/NamedVariablePatternMatcher.java>:47:
error: bad use of '>'
[ERROR] *  <td>{animal -> dog, id -> 23}</td>
[ERROR] ^
[ERROR] <https://builds.apache.org/job/Struts-JDK8-master/ws/core/src/main/java/com/opensymphony/xwork2/util/NamedVariablePatternMatcher.java>:47:
error: bad use of '>'
[ERROR] *  <td>{animal -> dog, id -> 23}</td>
[ERROR] ^
[ERROR] <https://builds.apache.org/job/Struts-JDK8-master/ws/core/src/main/java/com/opensymphony/xwork2/util/NamedVariablePatternMatcher.java>:50:
error: malformed HTML
[ERROR] *  <td><code>/{language}</code</td>
[ERROR] ^
[ERROR] <https://builds.apache.org/job/Struts-JDK8-master/ws/core/src/main/java/com/opensymphony/xwork2/util/NamedVariablePatternMatcher.java>:50:
error: end tag missing: </code>
[ERROR] *  <td><code>/{language}</code</td>
[ERROR] ^
[ERROR] <https://builds.apache.org/job/Struts-JDK8-master/ws/core/src/main/java/com/opensymphony/xwork2/util/NamedVariablePatternMatcher.java>:52:
error: bad use of '>'
[ERROR] *  <td>{language -> en}</td>
[ERROR] ^
[ERROR] <https://builds.apache.org/job/Struts-JDK8-master/ws/core/src/main/java/com/opensymphony/xwork2/util/NamedVariablePatternMatcher.java>:54:
error: no summary or caption for table
[ERROR] * </table>
[ERROR] ^
[ERROR] <https://builds.apache.org/job/Struts-JDK8-master/ws/core/src/main/java/com/opensymphony/xwork2/util/NamedVariablePatternMatcher.java>:60:
error: unknown tag: Since
[ERROR] * @Since 2.1
[ERROR] ^
[ERROR] <https://builds.apache.org/job/Struts-JDK8-master/ws/core/src/main/java/com/opensymphony/xwork2/util/finder/ResourceFinder.java>:448:
error: unexpected end tag: </p>
[ERROR] * </p>
[ERROR] ^
[ERROR] <https://builds.apache.org/job/Struts-JDK8-master/ws/core/src/main/java/com/opensymphony/xwork2/util/finder/ResourceFinder.java>:441:
error: element not closed: pre
[ERROR] * <pre>
[ERROR] ^
[ERROR] <https://builds.apache.org/job/Struts-JDK8-master/ws/core/src/main/java/com/opensymphony/xwork2/util/finder/ResourceFinder.java>:733:
error: bad use of '>'
[ERROR] * <pre>>
[ERROR] ^
[ERROR] <https://builds.apache.org/job/Struts-JDK8-master/ws/core/src/main/java/com/opensymphony/xwork2/util/finder/ResourceFinder.java>:778:
error: unknown tag: Properties
[ERROR] * List<Properties> appProps = finder.findAllProperties("app.properties");
[ERROR] ^
[ERROR] <https://builds.apache.org/job/Struts-JDK8-master/ws/core/src/main/java/com/opensymphony/xwork2/util/finder/ResourceFinder.java>:821:
error: unknown tag: Properties
[ERROR] * List<Properties> appProps = finder.findAvailableProperties("app.properties");
[ERROR] ^
[ERROR] <https://builds.apache.org/job/Struts-JDK8-master/ws/core/src/main/java/com/opensymphony/xwork2/util/finder/ResourceFinder.java>:868:
error: unknown tag: Properties
[ERROR] * List<Properties> driversList = finder.findAvailableProperties("jdbcDrivers");
[ERROR] ^
[ERROR] <https://builds.apache.org/job/Struts-JDK8-master/ws/core/src/main/java/com/opensymphony/xwork2/util/finder/ResourceFinder.java>:912:
error: unknown tag: Properties
[ERROR] * List<Properties> driversList = finder.findAvailableProperties("jdbcDrivers");
[ERROR] ^
[ERROR] <https://builds.apache.org/job/Struts-JDK8-master/ws/core/src/main/java/com/opensymphony/xwork2/util/finder/ResourceFinder.java>:916:
error: unexpected end tag: </p>
[ERROR] * </p>
[ERROR] ^
[ERROR] <https://builds.apache.org/job/Struts-JDK8-master/ws/core/src/main/java/com/opensymphony/xwork2/util/finder/ResourceFinder.java>:910:
error: element not closed: pre
[ERROR] * <pre>
[ERROR] ^
[ERROR] <https://builds.apache.org/job/Struts-JDK8-master/ws/core/src/main/java/com/opensymphony/xwork2/util/profiling/UtilTimerStack.java>:418:
error: unknown tag: String
[ERROR] *       new UtilTimerStack.ProfilingBlock<String>() {
[ERROR] ^
[ERROR] <https://builds.apache.org/job/Struts-JDK8-master/ws/core/src/main/java/com/opensymphony/xwork2/util/profiling/UtilTimerStack.java>:431:
error: unknown tag: String
[ERROR] *       new UtilTimerStack.ProfilingBlock<String>() {
[ERROR] ^
[ERROR] <https://builds.apache.org/job/Struts-JDK8-master/ws/core/src/main/java/com/opensymphony/xwork2/util/profiling/UtilTimerStack.java>:86:
error: tag not allowed here: <ul>
[ERROR] *      <ul>
[ERROR] ^
[ERROR] 
[ERROR] Command line was: /home/jenkins/jenkins-slave/tools/hudson.model.JDK/latest1.8/jre/../bin/javadoc
@options @packages
[ERROR] 
[ERROR] Refer to the generated Javadoc files in '<https://builds.apache.org/job/Struts-JDK8-master/ws/core/target/apidocs'>
dir.
[ERROR] -> [Help 1]
[ERROR] 
[ERROR] To see the full stack trace of the errors, re-run Maven with the -e switch.
[ERROR] Re-run Maven using the -X switch to enable full debug logging.
[ERROR] 
[ERROR] For more information about the errors and possible solutions, please read the following
articles:
[ERROR] [Help 1] http://cwiki.apache.org/confluence/display/MAVEN/MojoExecutionException
[ERROR] 
[ERROR] After correcting the problems, you can resume the build with the command
[ERROR]   mvn <goals> -rf :struts2-core
[JENKINS] Archiving <https://builds.apache.org/job/Struts-JDK8-master/ws/plugins/plexus/pom.xml>
to org.apache.struts/struts2-plexus-plugin/2.5-SNAPSHOT/struts2-plexus-plugin-2.5-SNAPSHOT.pom
No prior successful build to compare, so performing full copy of artifacts
[JENKINS] Archiving <https://builds.apache.org/job/Struts-JDK8-master/ws/plugins/pell-multipart/pom.xml>
to org.apache.struts/struts2-pell-multipart-plugin/2.5-SNAPSHOT/struts2-pell-multipart-plugin-2.5-SNAPSHOT.pom
No prior successful build to compare, so performing full copy of artifacts
[JENKINS] Archiving <https://builds.apache.org/job/Struts-JDK8-master/ws/plugins/java8-support/pom.xml>
to org.apache.struts/struts2-java8-support-plugin/2.5-SNAPSHOT/struts2-java8-support-plugin-2.5-SNAPSHOT.pom
No prior successful build to compare, so performing full copy of artifacts
[JENKINS] Archiving <https://builds.apache.org/job/Struts-JDK8-master/ws/plugins/jfreechart/pom.xml>
to org.apache.struts/struts2-jfreechart-plugin/2.5-SNAPSHOT/struts2-jfreechart-plugin-2.5-SNAPSHOT.pom
No prior successful build to compare, so performing full copy of artifacts
[JENKINS] Archiving <https://builds.apache.org/job/Struts-JDK8-master/ws/plugins/sitemesh/pom.xml>
to org.apache.struts/struts2-sitemesh-plugin/2.5-SNAPSHOT/struts2-sitemesh-plugin-2.5-SNAPSHOT.pom
No prior successful build to compare, so performing full copy of artifacts
[JENKINS] Archiving <https://builds.apache.org/job/Struts-JDK8-master/ws/plugins/config-browser/pom.xml>
to org.apache.struts/struts2-config-browser-plugin/2.5-SNAPSHOT/struts2-config-browser-plugin-2.5-SNAPSHOT.pom
No prior successful build to compare, so performing full copy of artifacts
[JENKINS] Archiving <https://builds.apache.org/job/Struts-JDK8-master/ws/archetypes/struts2-archetype-portlet/pom.xml>
to org.apache.struts/struts2-archetype-portlet/2.5-SNAPSHOT/struts2-archetype-portlet-2.5-SNAPSHOT.pom
No prior successful build to compare, so performing full copy of artifacts
[JENKINS] Archiving <https://builds.apache.org/job/Struts-JDK8-master/ws/bundles/demo/pom.xml>
to org.apache.struts/struts2-osgi-demo-bundle/2.5-SNAPSHOT/struts2-osgi-demo-bundle-2.5-SNAPSHOT.pom
No prior successful build to compare, so performing full copy of artifacts
[JENKINS] Archiving <https://builds.apache.org/job/Struts-JDK8-master/ws/plugins/portlet-tiles/pom.xml>
to org.apache.struts/struts2-portlet-tiles-plugin/2.5-SNAPSHOT/struts2-portlet-tiles-plugin-2.5-SNAPSHOT.pom
No prior successful build to compare, so performing full copy of artifacts
[JENKINS] Archiving <https://builds.apache.org/job/Struts-JDK8-master/ws/plugins/jasperreports/pom.xml>
to org.apache.struts/struts2-jasperreports-plugin/2.5-SNAPSHOT/struts2-jasperreports-plugin-2.5-SNAPSHOT.pom
No prior successful build to compare, so performing full copy of artifacts
[JENKINS] Archiving <https://builds.apache.org/job/Struts-JDK8-master/ws/archetypes/struts2-archetype-blank/pom.xml>
to org.apache.struts/struts2-archetype-blank/2.5-SNAPSHOT/struts2-archetype-blank-2.5-SNAPSHOT.pom
No prior successful build to compare, so performing full copy of artifacts
[JENKINS] Archiving <https://builds.apache.org/job/Struts-JDK8-master/ws/plugins/tiles3/pom.xml>
to org.apache.struts/struts2-tiles3-plugin/2.5-SNAPSHOT/struts2-tiles3-plugin-2.5-SNAPSHOT.pom
No prior successful build to compare, so performing full copy of artifacts
[JENKINS] Archiving <https://builds.apache.org/job/Struts-JDK8-master/ws/plugins/oval/pom.xml>
to org.apache.struts/struts2-oval-plugin/2.5-SNAPSHOT/struts2-oval-plugin-2.5-SNAPSHOT.pom
No prior successful build to compare, so performing full copy of artifacts
[JENKINS] Archiving <https://builds.apache.org/job/Struts-JDK8-master/ws/plugins/gxp/pom.xml>
to org.apache.struts/struts2-gxp-plugin/2.5-SNAPSHOT/struts2-gxp-plugin-2.5-SNAPSHOT.pom
No prior successful build to compare, so performing full copy of artifacts
[JENKINS] Archiving <https://builds.apache.org/job/Struts-JDK8-master/ws/plugins/convention/pom.xml>
to org.apache.struts/struts2-convention-plugin/2.5-SNAPSHOT/struts2-convention-plugin-2.5-SNAPSHOT.pom
No prior successful build to compare, so performing full copy of artifacts
[JENKINS] Archiving <https://builds.apache.org/job/Struts-JDK8-master/ws/bundles/pom.xml>
to org.apache.struts/struts2-osgi-bundles/2.5-SNAPSHOT/struts2-osgi-bundles-2.5-SNAPSHOT.pom
No prior successful build to compare, so performing full copy of artifacts
[JENKINS] Archiving <https://builds.apache.org/job/Struts-JDK8-master/ws/pom.xml> to
org.apache.struts/struts2-parent/2.5-SNAPSHOT/struts2-parent-2.5-SNAPSHOT.pom
[JENKINS] Archiving <https://builds.apache.org/job/Struts-JDK8-master/ws/target/struts2-parent-2.5-SNAPSHOT-site.xml>
to org.apache.struts/struts2-parent/2.5-20150716.205758-55/struts2-parent-2.5-20150716.205758-55-site.xml
Sending artifact delta relative to Struts-JDK8-master » Struts 2 #18
Archived 2 artifacts
Archive block size is 32768
Received 0 blocks and 39471 bytes
Compression is 0.0%
Took 93 ms
[JENKINS] Archiving <https://builds.apache.org/job/Struts-JDK8-master/ws/plugins/osgi/pom.xml>
to org.apache.struts/struts2-osgi-plugin/2.5-SNAPSHOT/struts2-osgi-plugin-2.5-SNAPSHOT.pom
No prior successful build to compare, so performing full copy of artifacts
[JENKINS] Archiving <https://builds.apache.org/job/Struts-JDK8-master/ws/assembly/pom.xml>
to org.apache.struts/struts2-assembly/2.5-SNAPSHOT/struts2-assembly-2.5-SNAPSHOT.pom
No prior successful build to compare, so performing full copy of artifacts
[JENKINS] Archiving <https://builds.apache.org/job/Struts-JDK8-master/ws/apps/showcase/pom.xml>
to org.apache.struts/struts2-showcase/2.5-SNAPSHOT/struts2-showcase-2.5-SNAPSHOT.pom
No prior successful build to compare, so performing full copy of artifacts
[JENKINS] Archiving <https://builds.apache.org/job/Struts-JDK8-master/ws/plugins/cdi/pom.xml>
to org.apache.struts/struts2-cdi-plugin/2.5-SNAPSHOT/struts2-cdi-plugin-2.5-SNAPSHOT.pom
No prior successful build to compare, so performing full copy of artifacts
[JENKINS] Archiving <https://builds.apache.org/job/Struts-JDK8-master/ws/plugins/rest/pom.xml>
to org.apache.struts/struts2-rest-plugin/2.5-SNAPSHOT/struts2-rest-plugin-2.5-SNAPSHOT.pom
No prior successful build to compare, so performing full copy of artifacts
[JENKINS] Archiving <https://builds.apache.org/job/Struts-JDK8-master/ws/core/pom.xml>
to org.apache.struts/struts2-core/2.5-SNAPSHOT/struts2-core-2.5-SNAPSHOT.pom
[JENKINS] Archiving <https://builds.apache.org/job/Struts-JDK8-master/ws/core/target/struts2-core-2.5-SNAPSHOT-sources.jar>
to org.apache.struts/struts2-core/2.5-SNAPSHOT/struts2-core-2.5-SNAPSHOT-sources.jar
No prior successful build to compare, so performing full copy of artifacts
[JENKINS] Archiving <https://builds.apache.org/job/Struts-JDK8-master/ws/plugins/tiles/pom.xml>
to org.apache.struts/struts2-tiles-plugin/2.5-SNAPSHOT/struts2-tiles-plugin-2.5-SNAPSHOT.pom
No prior successful build to compare, so performing full copy of artifacts
[JENKINS] Archiving <https://builds.apache.org/job/Struts-JDK8-master/ws/archetypes/struts2-archetype-dbportlet/pom.xml>
to org.apache.struts/struts2-archetype-dbportlet/2.5-SNAPSHOT/struts2-archetype-dbportlet-2.5-SNAPSHOT.pom
No prior successful build to compare, so performing full copy of artifacts
[JENKINS] Archiving <https://builds.apache.org/job/Struts-JDK8-master/ws/archetypes/struts2-archetype-convention/pom.xml>
to org.apache.struts/struts2-archetype-convention/2.5-SNAPSHOT/struts2-archetype-convention-2.5-SNAPSHOT.pom
No prior successful build to compare, so performing full copy of artifacts
[JENKINS] Archiving <https://builds.apache.org/job/Struts-JDK8-master/ws/archetypes/pom.xml>
to org.apache.struts/struts2-archetypes/2.5-SNAPSHOT/struts2-archetypes-2.5-SNAPSHOT.pom
No prior successful build to compare, so performing full copy of artifacts
[JENKINS] Archiving <https://builds.apache.org/job/Struts-JDK8-master/ws/bom/pom.xml>
to org.apache.struts/struts2-bom/2.5-SNAPSHOT/struts2-bom-2.5-SNAPSHOT.pom
Sending artifact delta relative to Struts-JDK8-master » Struts 2 Bill of Materials #18
Archived 1 artifacts
Archive block size is 32768
Received 0 blocks and 7820 bytes
Compression is 0.0%
Took 59 ms
[JENKINS] Archiving <https://builds.apache.org/job/Struts-JDK8-master/ws/plugins/embeddedjsp/pom.xml>
to org.apache.struts/struts2-embeddedjsp-plugin/2.5-SNAPSHOT/struts2-embeddedjsp-plugin-2.5-SNAPSHOT.pom
No prior successful build to compare, so performing full copy of artifacts
[JENKINS] Archiving <https://builds.apache.org/job/Struts-JDK8-master/ws/plugins/pom.xml>
to org.apache.struts/struts2-plugins/2.5-SNAPSHOT/struts2-plugins-2.5-SNAPSHOT.pom
No prior successful build to compare, so performing full copy of artifacts
[JENKINS] Archiving <https://builds.apache.org/job/Struts-JDK8-master/ws/apps/rest-showcase/pom.xml>
to org.apache.struts/struts2-rest-showcase/2.5-SNAPSHOT/struts2-rest-showcase-2.5-SNAPSHOT.pom
No prior successful build to compare, so performing full copy of artifacts
[JENKINS] Archiving <https://builds.apache.org/job/Struts-JDK8-master/ws/plugins/javatemplates/pom.xml>
to org.apache.struts/struts2-javatemplates-plugin/2.5-SNAPSHOT/struts2-javatemplates-plugin-2.5-SNAPSHOT.pom
No prior successful build to compare, so performing full copy of artifacts
[JENKINS] Archiving <https://builds.apache.org/job/Struts-JDK8-master/ws/bundles/admin/pom.xml>
to org.apache.struts/struts2-osgi-admin-bundle/2.5-SNAPSHOT/struts2-osgi-admin-bundle-2.5-SNAPSHOT.pom
No prior successful build to compare, so performing full copy of artifacts
[JENKINS] Archiving <https://builds.apache.org/job/Struts-JDK8-master/ws/apps/pom.xml>
to org.apache.struts/struts2-apps/2.5-SNAPSHOT/struts2-apps-2.5-SNAPSHOT.pom
No prior successful build to compare, so performing full copy of artifacts
[JENKINS] Archiving <https://builds.apache.org/job/Struts-JDK8-master/ws/plugins/sitegraph/pom.xml>
to org.apache.struts/struts2-sitegraph-plugin/2.5-SNAPSHOT/struts2-sitegraph-plugin-2.5-SNAPSHOT.pom
No prior successful build to compare, so performing full copy of artifacts
[JENKINS] Archiving <https://builds.apache.org/job/Struts-JDK8-master/ws/plugins/testng/pom.xml>
to org.apache.struts/struts2-testng-plugin/2.5-SNAPSHOT/struts2-testng-plugin-2.5-SNAPSHOT.pom
No prior successful build to compare, so performing full copy of artifacts
[JENKINS] Archiving <https://builds.apache.org/job/Struts-JDK8-master/ws/apps/portlet/pom.xml>
to org.apache.struts/struts2-portlet/2.5-SNAPSHOT/struts2-portlet-2.5-SNAPSHOT.pom
No prior successful build to compare, so performing full copy of artifacts
[JENKINS] Archiving <https://builds.apache.org/job/Struts-JDK8-master/ws/plugins/json/pom.xml>
to org.apache.struts/struts2-json-plugin/2.5-SNAPSHOT/struts2-json-plugin-2.5-SNAPSHOT.pom
No prior successful build to compare, so performing full copy of artifacts
[JENKINS] Archiving <https://builds.apache.org/job/Struts-JDK8-master/ws/plugins/junit/pom.xml>
to org.apache.struts/struts2-junit-plugin/2.5-SNAPSHOT/struts2-junit-plugin-2.5-SNAPSHOT.pom
No prior successful build to compare, so performing full copy of artifacts
[JENKINS] Archiving <https://builds.apache.org/job/Struts-JDK8-master/ws/plugins/dwr/pom.xml>
to org.apache.struts/struts2-dwr-plugin/2.5-SNAPSHOT/struts2-dwr-plugin-2.5-SNAPSHOT.pom
No prior successful build to compare, so performing full copy of artifacts
[JENKINS] Archiving <https://builds.apache.org/job/Struts-JDK8-master/ws/archetypes/struts2-archetype-plugin/pom.xml>
to org.apache.struts/struts2-archetype-plugin/2.5-SNAPSHOT/struts2-archetype-plugin-2.5-SNAPSHOT.pom
No prior successful build to compare, so performing full copy of artifacts
[JENKINS] Archiving <https://builds.apache.org/job/Struts-JDK8-master/ws/plugins/bean-validation/pom.xml>
to org.apache.struts/struts2-bean-validation-plugin/2.5-SNAPSHOT/struts2-bean-validation-plugin-2.5-SNAPSHOT.pom
No prior successful build to compare, so performing full copy of artifacts
[JENKINS] Archiving <https://builds.apache.org/job/Struts-JDK8-master/ws/archetypes/struts2-archetype-angularjs/pom.xml>
to org.apache.struts/struts2-archetype-angularjs/2.5-SNAPSHOT/struts2-archetype-angularjs-2.5-SNAPSHOT.pom
No prior successful build to compare, so performing full copy of artifacts
[JENKINS] Archiving <https://builds.apache.org/job/Struts-JDK8-master/ws/plugins/portlet/pom.xml>
to org.apache.struts/struts2-portlet-plugin/2.5-SNAPSHOT/struts2-portlet-plugin-2.5-SNAPSHOT.pom
No prior successful build to compare, so performing full copy of artifacts
[JENKINS] Archiving <https://builds.apache.org/job/Struts-JDK8-master/ws/plugins/spring/pom.xml>
to org.apache.struts/struts2-spring-plugin/2.5-SNAPSHOT/struts2-spring-plugin-2.5-SNAPSHOT.pom
No prior successful build to compare, so performing full copy of artifacts
[JENKINS] Archiving <https://builds.apache.org/job/Struts-JDK8-master/ws/archetypes/struts2-archetype-starter/pom.xml>
to org.apache.struts/struts2-archetype-starter/2.5-SNAPSHOT/struts2-archetype-starter-2.5-SNAPSHOT.pom
No prior successful build to compare, so performing full copy of artifacts
channel stopped
[locks-and-latches] Releasing all the locks
[locks-and-latches] All the locks released

---------------------------------------------------------------------
To unsubscribe, e-mail: dev-unsubscribe@struts.apache.org
For additional commands, e-mail: dev-help@struts.apache.org


Mime
View raw message