struts-dev mailing list archives

Site index · List index
Message view « Date » · « Thread »
Top « Date » · « Thread »
From Apache Jenkins Server <jenk...@builds.apache.org>
Subject Build failed in Jenkins: Struts-JDK8-master #12
Date Fri, 26 Jun 2015 20:00:09 GMT
See <https://builds.apache.org/job/Struts-JDK8-master/12/changes>

Changes:

[aleksandr.7m] converted align and valign to css text-align and vertical-align

[aleksandr.7m] js align and valign to style

[aleksandr.7m] bgcolor, cellpadding, cellspacing converted to css style in debug.ftl

[aleksandr.7m] replaced inline styles with classes

[aleksandr.7m] removed FormButton align attribute

[aleksandr.7m] removed border from transferselects tables

[crancran.git] WW-4516: Allow JSON plug-in to skip bean cache when devMode is enabled.

[crancran.git] Renamed debugMode to devMode.

[crancran.git] Removed unused methods

[crancran.git] Renamed setter for devMode.

[aleksandr.7m] site html-s

------------------------------------------
[...truncated 2601 lines...]
[ERROR] * <p/> <u>Extending the interceptor:</u>
[ERROR] ^
[ERROR] <https://builds.apache.org/job/Struts-JDK8-master/ws/core/src/main/java/com/opensymphony/xwork2/interceptor/AliasInterceptor.java>:63:
error: self-closing element not allowed
[ERROR] * <p/>
[ERROR] ^
[ERROR] <https://builds.apache.org/job/Struts-JDK8-master/ws/core/src/main/java/com/opensymphony/xwork2/interceptor/AliasInterceptor.java>:71:
error: self-closing element not allowed
[ERROR] * <p/> <u>Example code:</u>
[ERROR] ^
[ERROR] <https://builds.apache.org/job/Struts-JDK8-master/ws/core/src/main/java/com/opensymphony/xwork2/interceptor/ChainingInterceptor.java>:34:
error: self-closing element not allowed
[ERROR] * <p/>
[ERROR] ^
[ERROR] <https://builds.apache.org/job/Struts-JDK8-master/ws/core/src/main/java/com/opensymphony/xwork2/interceptor/ChainingInterceptor.java>:40:
error: self-closing element not allowed
[ERROR] * <p/>
[ERROR] ^
[ERROR] <https://builds.apache.org/job/Struts-JDK8-master/ws/core/src/main/java/com/opensymphony/xwork2/interceptor/ChainingInterceptor.java>:40:
warning: empty <p> tag
[ERROR] * <p/>
[ERROR] ^
[ERROR] <https://builds.apache.org/job/Struts-JDK8-master/ws/core/src/main/java/com/opensymphony/xwork2/interceptor/ChainingInterceptor.java>:41:
error: self-closing element not allowed
[ERROR] * <p/>
[ERROR] ^
[ERROR] <https://builds.apache.org/job/Struts-JDK8-master/ws/core/src/main/java/com/opensymphony/xwork2/interceptor/ChainingInterceptor.java>:43:
error: self-closing element not allowed
[ERROR] * <br/>This means two things:
[ERROR] ^
[ERROR] <https://builds.apache.org/job/Struts-JDK8-master/ws/core/src/main/java/com/opensymphony/xwork2/interceptor/ChainingInterceptor.java>:44:
error: self-closing element not allowed
[ERROR] * <br/><b>One</b>, you can safely apply it to all your actions without
any worry of adverse affects.
[ERROR] ^
[ERROR] <https://builds.apache.org/job/Struts-JDK8-master/ws/core/src/main/java/com/opensymphony/xwork2/interceptor/ChainingInterceptor.java>:45:
error: self-closing element not allowed
[ERROR] * <br/><b/>Two</b>, it is up to you to ensure an object exists in
the stack prior to invoking this action. The most typical way this is done
[ERROR] ^
[ERROR] <https://builds.apache.org/job/Struts-JDK8-master/ws/core/src/main/java/com/opensymphony/xwork2/interceptor/ChainingInterceptor.java>:45:
error: self-closing element not allowed
[ERROR] * <br/><b/>Two</b>, it is up to you to ensure an object exists in
the stack prior to invoking this action. The most typical way this is done
[ERROR] ^
[ERROR] <https://builds.apache.org/job/Struts-JDK8-master/ws/core/src/main/java/com/opensymphony/xwork2/interceptor/ChainingInterceptor.java>:48:
error: self-closing element not allowed
[ERROR] * <p/>
[ERROR] ^
[ERROR] <https://builds.apache.org/job/Struts-JDK8-master/ws/core/src/main/java/com/opensymphony/xwork2/interceptor/ChainingInterceptor.java>:56:
warning: empty <p> tag
[ERROR] * <p>
[ERROR] ^
[ERROR] <https://builds.apache.org/job/Struts-JDK8-master/ws/core/src/main/java/com/opensymphony/xwork2/interceptor/ChainingInterceptor.java>:62:
error: unexpected end tag: </p>
[ERROR] * </p>
[ERROR] ^
[ERROR] <https://builds.apache.org/job/Struts-JDK8-master/ws/core/src/main/java/com/opensymphony/xwork2/interceptor/ChainingInterceptor.java>:64:
error: unexpected end tag: </p>
[ERROR] * </p>
[ERROR] ^
[ERROR] <https://builds.apache.org/job/Struts-JDK8-master/ws/core/src/main/java/com/opensymphony/xwork2/interceptor/ChainingInterceptor.java>:82:
error: tag not allowed here: <p>
[ERROR] * <p/>
[ERROR] ^
[ERROR] <https://builds.apache.org/job/Struts-JDK8-master/ws/core/src/main/java/com/opensymphony/xwork2/interceptor/ChainingInterceptor.java>:87:
error: tag not allowed here: <p>
[ERROR] * <p/>
[ERROR] ^
[ERROR] <https://builds.apache.org/job/Struts-JDK8-master/ws/core/src/main/java/com/opensymphony/xwork2/interceptor/ChainingInterceptor.java>:93:
error: tag not allowed here: <p>
[ERROR] * <p/>
[ERROR] ^
[ERROR] <https://builds.apache.org/job/Struts-JDK8-master/ws/core/src/main/java/com/opensymphony/xwork2/interceptor/ConversionErrorInterceptor.java>:32:
error: self-closing element not allowed
[ERROR] * <p/>
[ERROR] ^
[ERROR] <https://builds.apache.org/job/Struts-JDK8-master/ws/core/src/main/java/com/opensymphony/xwork2/interceptor/ConversionErrorInterceptor.java>:43:
error: self-closing element not allowed
[ERROR] * <p/> <u>Interceptor parameters:</u>
[ERROR] ^
[ERROR] <https://builds.apache.org/job/Struts-JDK8-master/ws/core/src/main/java/com/opensymphony/xwork2/interceptor/ConversionErrorInterceptor.java>:55:
error: self-closing element not allowed
[ERROR] * <p/> <u>Extending the interceptor:</u>
[ERROR] ^
[ERROR] <https://builds.apache.org/job/Struts-JDK8-master/ws/core/src/main/java/com/opensymphony/xwork2/interceptor/ConversionErrorInterceptor.java>:57:
error: self-closing element not allowed
[ERROR] * <p/>
[ERROR] ^
[ERROR] <https://builds.apache.org/job/Struts-JDK8-master/ws/core/src/main/java/com/opensymphony/xwork2/interceptor/ConversionErrorInterceptor.java>:68:
error: self-closing element not allowed
[ERROR] * <p/> <u>Example code:</u>
[ERROR] ^
[ERROR] <https://builds.apache.org/job/Struts-JDK8-master/ws/core/src/main/java/com/opensymphony/xwork2/interceptor/DefaultWorkflowInterceptor.java>:184:
warning: no @param for action
[ERROR] protected String processInputConfig(final Object action, final String method, final
String currentResultName) throws Exception {
[ERROR] ^
[ERROR] <https://builds.apache.org/job/Struts-JDK8-master/ws/core/src/main/java/com/opensymphony/xwork2/interceptor/DefaultWorkflowInterceptor.java>:201:
error: no tag name after @
[ERROR] * Notify action if it implements {@see ValidationErrorAware} interface
[ERROR] ^
[ERROR] <https://builds.apache.org/job/Struts-JDK8-master/ws/core/src/main/java/com/opensymphony/xwork2/interceptor/DefaultWorkflowInterceptor.java>:29:
error: self-closing element not allowed
[ERROR] * <p/>
[ERROR] ^
[ERROR] <https://builds.apache.org/job/Struts-JDK8-master/ws/core/src/main/java/com/opensymphony/xwork2/interceptor/DefaultWorkflowInterceptor.java>:32:
error: self-closing element not allowed
[ERROR] * <p/>
[ERROR] ^
[ERROR] <https://builds.apache.org/job/Struts-JDK8-master/ws/core/src/main/java/com/opensymphony/xwork2/interceptor/DefaultWorkflowInterceptor.java>:37:
error: self-closing element not allowed
[ERROR] * <p/>
[ERROR] ^
[ERROR] <https://builds.apache.org/job/Struts-JDK8-master/ws/core/src/main/java/com/opensymphony/xwork2/interceptor/DefaultWorkflowInterceptor.java>:44:
error: self-closing element not allowed
[ERROR] * <p/>
[ERROR] ^
[ERROR] <https://builds.apache.org/job/Struts-JDK8-master/ws/core/src/main/java/com/opensymphony/xwork2/interceptor/ExceptionMappingInterceptor.java>:42:
error: self-closing element not allowed
[ERROR] * <p/> <u>Interceptor parameters:</u>
[ERROR] ^
[ERROR] <https://builds.apache.org/job/Struts-JDK8-master/ws/core/src/main/java/com/opensymphony/xwork2/interceptor/ExceptionMappingInterceptor.java>:62:
error: self-closing element not allowed
[ERROR] * <p/> <u>Extending the interceptor:</u>
[ERROR] ^
[ERROR] <https://builds.apache.org/job/Struts-JDK8-master/ws/core/src/main/java/com/opensymphony/xwork2/interceptor/ExceptionMappingInterceptor.java>:64:
error: self-closing element not allowed
[ERROR] * <p/>
[ERROR] ^
[ERROR] <https://builds.apache.org/job/Struts-JDK8-master/ws/core/src/main/java/com/opensymphony/xwork2/interceptor/ExceptionMappingInterceptor.java>:74:
error: self-closing element not allowed
[ERROR] * <p/> <u>Example code:</u>
[ERROR] ^
[ERROR] <https://builds.apache.org/job/Struts-JDK8-master/ws/core/src/main/java/com/opensymphony/xwork2/interceptor/ExceptionMappingInterceptor.java>:100:
error: self-closing element not allowed
[ERROR] * <p/>
[ERROR] ^
[ERROR] <https://builds.apache.org/job/Struts-JDK8-master/ws/core/src/main/java/com/opensymphony/xwork2/interceptor/ExceptionMappingInterceptor.java>:104:
error: block element not allowed within inline element <code>: pre
[ERROR] * <pre>
[ERROR] ^
[ERROR] <https://builds.apache.org/job/Struts-JDK8-master/ws/core/src/main/java/com/opensymphony/xwork2/interceptor/ExceptionMappingInterceptor.java>:102:
error: element not closed: code
[ERROR] * <code>com.mycompany.app.unhandled<code> at WARN level.
[ERROR] ^
[ERROR] <https://builds.apache.org/job/Struts-JDK8-master/ws/core/src/main/java/com/opensymphony/xwork2/interceptor/ExceptionMappingInterceptor.java>:102:
error: element not closed: code
[ERROR] * <code>com.mycompany.app.unhandled<code> at WARN level.
[ERROR] ^
[ERROR] <https://builds.apache.org/job/Struts-JDK8-master/ws/core/src/main/java/com/opensymphony/xwork2/interceptor/I18nInterceptor.java>:29:
error: self-closing element not allowed
[ERROR] * <p/>
[ERROR] ^
[ERROR] <https://builds.apache.org/job/Struts-JDK8-master/ws/core/src/main/java/com/opensymphony/xwork2/interceptor/I18nInterceptor.java>:38:
error: self-closing element not allowed
[ERROR] * <p/>
[ERROR] ^
[ERROR] <https://builds.apache.org/job/Struts-JDK8-master/ws/core/src/main/java/com/opensymphony/xwork2/interceptor/I18nInterceptor.java>:39:
error: self-closing element not allowed
[ERROR] * <p/>For example, using the default parameter name, a request to <b>foo.action?request_locale=en_US</b>,
then the
[ERROR] ^
[ERROR] <https://builds.apache.org/job/Struts-JDK8-master/ws/core/src/main/java/com/opensymphony/xwork2/interceptor/I18nInterceptor.java>:41:
error: self-closing element not allowed
[ERROR] * <p/>
[ERROR] ^
[ERROR] <https://builds.apache.org/job/Struts-JDK8-master/ws/core/src/main/java/com/opensymphony/xwork2/interceptor/I18nInterceptor.java>:43:
error: self-closing element not allowed
[ERROR] * <p/>
[ERROR] ^
[ERROR] <https://builds.apache.org/job/Struts-JDK8-master/ws/core/src/main/java/com/opensymphony/xwork2/interceptor/I18nInterceptor.java>:45:
error: self-closing element not allowed
[ERROR] * <p/>
[ERROR] ^
[ERROR] 
[ERROR] Command line was: /home/jenkins/jenkins-slave/tools/hudson.model.JDK/latest1.8/jre/../bin/javadoc
@options @packages
[ERROR] 
[ERROR] Refer to the generated Javadoc files in '<https://builds.apache.org/job/Struts-JDK8-master/ws/core/target/apidocs'>
dir.
[ERROR] -> [Help 1]
[ERROR] 
[ERROR] To see the full stack trace of the errors, re-run Maven with the -e switch.
[ERROR] Re-run Maven using the -X switch to enable full debug logging.
[ERROR] 
[ERROR] For more information about the errors and possible solutions, please read the following
articles:
[ERROR] [Help 1] http://cwiki.apache.org/confluence/display/MAVEN/MojoExecutionException
[ERROR] 
[ERROR] After correcting the problems, you can resume the build with the command
[ERROR]   mvn <goals> -rf :struts2-core
[JENKINS] Archiving <https://builds.apache.org/job/Struts-JDK8-master/ws/plugins/plexus/pom.xml>
to org.apache.struts/struts2-plexus-plugin/2.5-SNAPSHOT/struts2-plexus-plugin-2.5-SNAPSHOT.pom
No prior successful build to compare, so performing full copy of artifacts
[JENKINS] Archiving <https://builds.apache.org/job/Struts-JDK8-master/ws/plugins/pell-multipart/pom.xml>
to org.apache.struts/struts2-pell-multipart-plugin/2.5-SNAPSHOT/struts2-pell-multipart-plugin-2.5-SNAPSHOT.pom
No prior successful build to compare, so performing full copy of artifacts
[JENKINS] Archiving <https://builds.apache.org/job/Struts-JDK8-master/ws/plugins/java8-support/pom.xml>
to org.apache.struts/struts2-java8-support-plugin/2.5-SNAPSHOT/struts2-java8-support-plugin-2.5-SNAPSHOT.pom
No prior successful build to compare, so performing full copy of artifacts
[JENKINS] Archiving <https://builds.apache.org/job/Struts-JDK8-master/ws/plugins/jfreechart/pom.xml>
to org.apache.struts/struts2-jfreechart-plugin/2.5-SNAPSHOT/struts2-jfreechart-plugin-2.5-SNAPSHOT.pom
No prior successful build to compare, so performing full copy of artifacts
[JENKINS] Archiving <https://builds.apache.org/job/Struts-JDK8-master/ws/plugins/sitemesh/pom.xml>
to org.apache.struts/struts2-sitemesh-plugin/2.5-SNAPSHOT/struts2-sitemesh-plugin-2.5-SNAPSHOT.pom
No prior successful build to compare, so performing full copy of artifacts
[JENKINS] Archiving <https://builds.apache.org/job/Struts-JDK8-master/ws/plugins/config-browser/pom.xml>
to org.apache.struts/struts2-config-browser-plugin/2.5-SNAPSHOT/struts2-config-browser-plugin-2.5-SNAPSHOT.pom
No prior successful build to compare, so performing full copy of artifacts
[JENKINS] Archiving <https://builds.apache.org/job/Struts-JDK8-master/ws/archetypes/struts2-archetype-portlet/pom.xml>
to org.apache.struts/struts2-archetype-portlet/2.5-SNAPSHOT/struts2-archetype-portlet-2.5-SNAPSHOT.pom
No prior successful build to compare, so performing full copy of artifacts
[JENKINS] Archiving <https://builds.apache.org/job/Struts-JDK8-master/ws/bundles/demo/pom.xml>
to org.apache.struts/struts2-osgi-demo-bundle/2.5-SNAPSHOT/struts2-osgi-demo-bundle-2.5-SNAPSHOT.pom
No prior successful build to compare, so performing full copy of artifacts
[JENKINS] Archiving <https://builds.apache.org/job/Struts-JDK8-master/ws/plugins/portlet-tiles/pom.xml>
to org.apache.struts/struts2-portlet-tiles-plugin/2.5-SNAPSHOT/struts2-portlet-tiles-plugin-2.5-SNAPSHOT.pom
No prior successful build to compare, so performing full copy of artifacts
[JENKINS] Archiving <https://builds.apache.org/job/Struts-JDK8-master/ws/plugins/jasperreports/pom.xml>
to org.apache.struts/struts2-jasperreports-plugin/2.5-SNAPSHOT/struts2-jasperreports-plugin-2.5-SNAPSHOT.pom
No prior successful build to compare, so performing full copy of artifacts
[JENKINS] Archiving <https://builds.apache.org/job/Struts-JDK8-master/ws/archetypes/struts2-archetype-blank/pom.xml>
to org.apache.struts/struts2-archetype-blank/2.5-SNAPSHOT/struts2-archetype-blank-2.5-SNAPSHOT.pom
No prior successful build to compare, so performing full copy of artifacts
[JENKINS] Archiving <https://builds.apache.org/job/Struts-JDK8-master/ws/plugins/tiles3/pom.xml>
to org.apache.struts/struts2-tiles3-plugin/2.5-SNAPSHOT/struts2-tiles3-plugin-2.5-SNAPSHOT.pom
No prior successful build to compare, so performing full copy of artifacts
[JENKINS] Archiving <https://builds.apache.org/job/Struts-JDK8-master/ws/plugins/oval/pom.xml>
to org.apache.struts/struts2-oval-plugin/2.5-SNAPSHOT/struts2-oval-plugin-2.5-SNAPSHOT.pom
No prior successful build to compare, so performing full copy of artifacts
[JENKINS] Archiving <https://builds.apache.org/job/Struts-JDK8-master/ws/plugins/gxp/pom.xml>
to org.apache.struts/struts2-gxp-plugin/2.5-SNAPSHOT/struts2-gxp-plugin-2.5-SNAPSHOT.pom
No prior successful build to compare, so performing full copy of artifacts
[JENKINS] Archiving <https://builds.apache.org/job/Struts-JDK8-master/ws/plugins/convention/pom.xml>
to org.apache.struts/struts2-convention-plugin/2.5-SNAPSHOT/struts2-convention-plugin-2.5-SNAPSHOT.pom
No prior successful build to compare, so performing full copy of artifacts
[JENKINS] Archiving <https://builds.apache.org/job/Struts-JDK8-master/ws/bundles/pom.xml>
to org.apache.struts/struts2-osgi-bundles/2.5-SNAPSHOT/struts2-osgi-bundles-2.5-SNAPSHOT.pom
No prior successful build to compare, so performing full copy of artifacts
[JENKINS] Archiving <https://builds.apache.org/job/Struts-JDK8-master/ws/pom.xml> to
org.apache.struts/struts2-parent/2.5-SNAPSHOT/struts2-parent-2.5-SNAPSHOT.pom
[JENKINS] Archiving <https://builds.apache.org/job/Struts-JDK8-master/ws/target/struts2-parent-2.5-SNAPSHOT-site.xml>
to org.apache.struts/struts2-parent/2.5-20150626.195932-39/struts2-parent-2.5-20150626.195932-39-site.xml
Sending artifact delta relative to Struts-JDK8-master » Struts 2 #11
Archived 2 artifacts
Archive block size is 32768
Received 0 blocks and 39471 bytes
Compression is 0.0%
Took 0.27 sec
[JENKINS] Archiving <https://builds.apache.org/job/Struts-JDK8-master/ws/plugins/osgi/pom.xml>
to org.apache.struts/struts2-osgi-plugin/2.5-SNAPSHOT/struts2-osgi-plugin-2.5-SNAPSHOT.pom
No prior successful build to compare, so performing full copy of artifacts
[JENKINS] Archiving <https://builds.apache.org/job/Struts-JDK8-master/ws/assembly/pom.xml>
to org.apache.struts/struts2-assembly/2.5-SNAPSHOT/struts2-assembly-2.5-SNAPSHOT.pom
No prior successful build to compare, so performing full copy of artifacts
[JENKINS] Archiving <https://builds.apache.org/job/Struts-JDK8-master/ws/apps/showcase/pom.xml>
to org.apache.struts/struts2-showcase/2.5-SNAPSHOT/struts2-showcase-2.5-SNAPSHOT.pom
No prior successful build to compare, so performing full copy of artifacts
[JENKINS] Archiving <https://builds.apache.org/job/Struts-JDK8-master/ws/plugins/cdi/pom.xml>
to org.apache.struts/struts2-cdi-plugin/2.5-SNAPSHOT/struts2-cdi-plugin-2.5-SNAPSHOT.pom
No prior successful build to compare, so performing full copy of artifacts
[JENKINS] Archiving <https://builds.apache.org/job/Struts-JDK8-master/ws/plugins/rest/pom.xml>
to org.apache.struts/struts2-rest-plugin/2.5-SNAPSHOT/struts2-rest-plugin-2.5-SNAPSHOT.pom
No prior successful build to compare, so performing full copy of artifacts
[JENKINS] Archiving <https://builds.apache.org/job/Struts-JDK8-master/ws/core/pom.xml>
to org.apache.struts/struts2-core/2.5-SNAPSHOT/struts2-core-2.5-SNAPSHOT.pom
[JENKINS] Archiving <https://builds.apache.org/job/Struts-JDK8-master/ws/core/target/struts2-core-2.5-SNAPSHOT-sources.jar>
to org.apache.struts/struts2-core/2.5-SNAPSHOT/struts2-core-2.5-SNAPSHOT-sources.jar
No prior successful build to compare, so performing full copy of artifacts
[JENKINS] Archiving <https://builds.apache.org/job/Struts-JDK8-master/ws/plugins/tiles/pom.xml>
to org.apache.struts/struts2-tiles-plugin/2.5-SNAPSHOT/struts2-tiles-plugin-2.5-SNAPSHOT.pom
No prior successful build to compare, so performing full copy of artifacts
[JENKINS] Archiving <https://builds.apache.org/job/Struts-JDK8-master/ws/archetypes/struts2-archetype-dbportlet/pom.xml>
to org.apache.struts/struts2-archetype-dbportlet/2.5-SNAPSHOT/struts2-archetype-dbportlet-2.5-SNAPSHOT.pom
No prior successful build to compare, so performing full copy of artifacts
[JENKINS] Archiving <https://builds.apache.org/job/Struts-JDK8-master/ws/archetypes/struts2-archetype-convention/pom.xml>
to org.apache.struts/struts2-archetype-convention/2.5-SNAPSHOT/struts2-archetype-convention-2.5-SNAPSHOT.pom
No prior successful build to compare, so performing full copy of artifacts
[JENKINS] Archiving <https://builds.apache.org/job/Struts-JDK8-master/ws/archetypes/pom.xml>
to org.apache.struts/struts2-archetypes/2.5-SNAPSHOT/struts2-archetypes-2.5-SNAPSHOT.pom
No prior successful build to compare, so performing full copy of artifacts
[JENKINS] Archiving <https://builds.apache.org/job/Struts-JDK8-master/ws/bom/pom.xml>
to org.apache.struts/struts2-bom/2.5-SNAPSHOT/struts2-bom-2.5-SNAPSHOT.pom
Sending artifact delta relative to Struts-JDK8-master » Struts 2 Bill of Materials #11
Archived 1 artifacts
Archive block size is 32768
Received 0 blocks and 7820 bytes
Compression is 0.0%
Took 0.15 sec
[JENKINS] Archiving <https://builds.apache.org/job/Struts-JDK8-master/ws/plugins/embeddedjsp/pom.xml>
to org.apache.struts/struts2-embeddedjsp-plugin/2.5-SNAPSHOT/struts2-embeddedjsp-plugin-2.5-SNAPSHOT.pom
No prior successful build to compare, so performing full copy of artifacts
[JENKINS] Archiving <https://builds.apache.org/job/Struts-JDK8-master/ws/plugins/pom.xml>
to org.apache.struts/struts2-plugins/2.5-SNAPSHOT/struts2-plugins-2.5-SNAPSHOT.pom
No prior successful build to compare, so performing full copy of artifacts
[JENKINS] Archiving <https://builds.apache.org/job/Struts-JDK8-master/ws/apps/rest-showcase/pom.xml>
to org.apache.struts/struts2-rest-showcase/2.5-SNAPSHOT/struts2-rest-showcase-2.5-SNAPSHOT.pom
No prior successful build to compare, so performing full copy of artifacts
[JENKINS] Archiving <https://builds.apache.org/job/Struts-JDK8-master/ws/plugins/javatemplates/pom.xml>
to org.apache.struts/struts2-javatemplates-plugin/2.5-SNAPSHOT/struts2-javatemplates-plugin-2.5-SNAPSHOT.pom
No prior successful build to compare, so performing full copy of artifacts
[JENKINS] Archiving <https://builds.apache.org/job/Struts-JDK8-master/ws/bundles/admin/pom.xml>
to org.apache.struts/struts2-osgi-admin-bundle/2.5-SNAPSHOT/struts2-osgi-admin-bundle-2.5-SNAPSHOT.pom
No prior successful build to compare, so performing full copy of artifacts
[JENKINS] Archiving <https://builds.apache.org/job/Struts-JDK8-master/ws/apps/pom.xml>
to org.apache.struts/struts2-apps/2.5-SNAPSHOT/struts2-apps-2.5-SNAPSHOT.pom
No prior successful build to compare, so performing full copy of artifacts
[JENKINS] Archiving <https://builds.apache.org/job/Struts-JDK8-master/ws/plugins/sitegraph/pom.xml>
to org.apache.struts/struts2-sitegraph-plugin/2.5-SNAPSHOT/struts2-sitegraph-plugin-2.5-SNAPSHOT.pom
No prior successful build to compare, so performing full copy of artifacts
[JENKINS] Archiving <https://builds.apache.org/job/Struts-JDK8-master/ws/plugins/testng/pom.xml>
to org.apache.struts/struts2-testng-plugin/2.5-SNAPSHOT/struts2-testng-plugin-2.5-SNAPSHOT.pom
No prior successful build to compare, so performing full copy of artifacts
[JENKINS] Archiving <https://builds.apache.org/job/Struts-JDK8-master/ws/apps/portlet/pom.xml>
to org.apache.struts/struts2-portlet/2.5-SNAPSHOT/struts2-portlet-2.5-SNAPSHOT.pom
No prior successful build to compare, so performing full copy of artifacts
[JENKINS] Archiving <https://builds.apache.org/job/Struts-JDK8-master/ws/plugins/json/pom.xml>
to org.apache.struts/struts2-json-plugin/2.5-SNAPSHOT/struts2-json-plugin-2.5-SNAPSHOT.pom
No prior successful build to compare, so performing full copy of artifacts
[JENKINS] Archiving <https://builds.apache.org/job/Struts-JDK8-master/ws/plugins/junit/pom.xml>
to org.apache.struts/struts2-junit-plugin/2.5-SNAPSHOT/struts2-junit-plugin-2.5-SNAPSHOT.pom
No prior successful build to compare, so performing full copy of artifacts
[JENKINS] Archiving <https://builds.apache.org/job/Struts-JDK8-master/ws/plugins/dwr/pom.xml>
to org.apache.struts/struts2-dwr-plugin/2.5-SNAPSHOT/struts2-dwr-plugin-2.5-SNAPSHOT.pom
No prior successful build to compare, so performing full copy of artifacts
[JENKINS] Archiving <https://builds.apache.org/job/Struts-JDK8-master/ws/archetypes/struts2-archetype-plugin/pom.xml>
to org.apache.struts/struts2-archetype-plugin/2.5-SNAPSHOT/struts2-archetype-plugin-2.5-SNAPSHOT.pom
No prior successful build to compare, so performing full copy of artifacts
[JENKINS] Archiving <https://builds.apache.org/job/Struts-JDK8-master/ws/plugins/bean-validation/pom.xml>
to org.apache.struts/struts2-bean-validation-plugin/2.5-SNAPSHOT/struts2-bean-validation-plugin-2.5-SNAPSHOT.pom
No prior successful build to compare, so performing full copy of artifacts
[JENKINS] Archiving <https://builds.apache.org/job/Struts-JDK8-master/ws/archetypes/struts2-archetype-angularjs/pom.xml>
to org.apache.struts/struts2-archetype-angularjs/2.5-SNAPSHOT/struts2-archetype-angularjs-2.5-SNAPSHOT.pom
No prior successful build to compare, so performing full copy of artifacts
[JENKINS] Archiving <https://builds.apache.org/job/Struts-JDK8-master/ws/plugins/portlet/pom.xml>
to org.apache.struts/struts2-portlet-plugin/2.5-SNAPSHOT/struts2-portlet-plugin-2.5-SNAPSHOT.pom
No prior successful build to compare, so performing full copy of artifacts
[JENKINS] Archiving <https://builds.apache.org/job/Struts-JDK8-master/ws/plugins/spring/pom.xml>
to org.apache.struts/struts2-spring-plugin/2.5-SNAPSHOT/struts2-spring-plugin-2.5-SNAPSHOT.pom
No prior successful build to compare, so performing full copy of artifacts
[JENKINS] Archiving <https://builds.apache.org/job/Struts-JDK8-master/ws/archetypes/struts2-archetype-starter/pom.xml>
to org.apache.struts/struts2-archetype-starter/2.5-SNAPSHOT/struts2-archetype-starter-2.5-SNAPSHOT.pom
No prior successful build to compare, so performing full copy of artifacts
channel stopped
[locks-and-latches] Releasing all the locks
[locks-and-latches] All the locks released

---------------------------------------------------------------------
To unsubscribe, e-mail: dev-unsubscribe@struts.apache.org
For additional commands, e-mail: dev-help@struts.apache.org


Mime
View raw message