struts-dev mailing list archives

Site index · List index
Message view « Date » · « Thread »
Top « Date » · « Thread »
From Apache Jenkins Server <jenk...@builds.apache.org>
Subject Build failed in Jenkins: Struts-JDK8-master #3
Date Thu, 18 Jun 2015 10:36:05 GMT
See <https://builds.apache.org/job/Struts-JDK8-master/3/>

------------------------------------------
[...truncated 2668 lines...]
[ERROR] * @throws IOException
[ERROR] ^
[ERROR] <https://builds.apache.org/job/Struts-JDK8-master/ws/core/src/main/java/org/apache/struts2/dispatcher/ServletRedirectResult.java>:310:
warning: no @return
[ERROR] public ServletRedirectResult addParameter(String key, Object value) {
[ERROR] ^
[ERROR] <https://builds.apache.org/job/Struts-JDK8-master/ws/core/src/main/java/org/apache/struts2/dispatcher/ServletActionRedirectResult.java>:36:
error: reference not found
[ERROR] * {@link ActionMapperFactory} to redirect the browser to a URL that invokes the
[ERROR] ^
[ERROR] <https://builds.apache.org/job/Struts-JDK8-master/ws/core/src/main/java/org/apache/struts2/dispatcher/ServletActionRedirectResult.java>:106:
error: semicolon missing
[ERROR] *    /genReport/generateReport.action?reportType=pie&width=100&height=100#summary
[ERROR] ^
[ERROR] <https://builds.apache.org/job/Struts-JDK8-master/ws/core/src/main/java/org/apache/struts2/dispatcher/ServletActionRedirectResult.java>:106:
error: semicolon missing
[ERROR] *    /genReport/generateReport.action?reportType=pie&width=100&height=100#summary
[ERROR] ^
[ERROR] <https://builds.apache.org/job/Struts-JDK8-master/ws/core/src/main/java/org/apache/struts2/dispatcher/ServletDispatcherResult.java>:49:
error: self-closing element not allowed
[ERROR] * <p/>
[ERROR] ^
[ERROR] <https://builds.apache.org/job/Struts-JDK8-master/ws/core/src/main/java/org/apache/struts2/dispatcher/ServletRedirectResult.java>:60:
error: self-closing element not allowed
[ERROR] * <p/>
[ERROR] ^
[ERROR] <https://builds.apache.org/job/Struts-JDK8-master/ws/core/src/main/java/org/apache/struts2/dispatcher/StreamResult.java>:295:
warning: no @param for invocation
[ERROR] protected void resolveParamsFromStack(ValueStack stack, ActionInvocation invocation)
{
[ERROR] ^
[ERROR] <https://builds.apache.org/job/Struts-JDK8-master/ws/core/src/main/java/org/apache/struts2/dispatcher/StreamResult.java>:40:
error: self-closing element not allowed
[ERROR] * <p/>
[ERROR] ^
[ERROR] <https://builds.apache.org/job/Struts-JDK8-master/ws/core/src/main/java/org/apache/struts2/dispatcher/StrutsResultSupport.java>:42:
error: self-closing element not allowed
[ERROR] * <p/>
[ERROR] ^
[ERROR] <https://builds.apache.org/job/Struts-JDK8-master/ws/core/src/main/java/org/apache/struts2/dispatcher/StrutsResultSupport.java>:58:
error: self-closing element not allowed
[ERROR] * <p/>
[ERROR] ^
[ERROR] <https://builds.apache.org/job/Struts-JDK8-master/ws/core/src/main/java/org/apache/struts2/dispatcher/StrutsResultSupport.java>:58:
warning: empty <p> tag
[ERROR] * <p/>
[ERROR] ^
[ERROR] <https://builds.apache.org/job/Struts-JDK8-master/ws/core/src/main/java/org/apache/struts2/dispatcher/StrutsResultSupport.java>:62:
error: self-closing element not allowed
[ERROR] * <p/>
[ERROR] ^
[ERROR] <https://builds.apache.org/job/Struts-JDK8-master/ws/core/src/main/java/org/apache/struts2/dispatcher/StrutsResultSupport.java>:64:
error: self-closing element not allowed
[ERROR] * <p/>
[ERROR] ^
[ERROR] <https://builds.apache.org/job/Struts-JDK8-master/ws/core/src/main/java/org/apache/struts2/dispatcher/StrutsResultSupport.java>:64:
warning: empty <p> tag
[ERROR] * <p/>
[ERROR] ^
[ERROR] <https://builds.apache.org/job/Struts-JDK8-master/ws/core/src/main/java/org/apache/struts2/dispatcher/StrutsResultSupport.java>:69:
error: self-closing element not allowed
[ERROR] * <p/>
[ERROR] ^
[ERROR] <https://builds.apache.org/job/Struts-JDK8-master/ws/core/src/main/java/org/apache/struts2/dispatcher/StrutsResultSupport.java>:71:
error: self-closing element not allowed
[ERROR] * <p/>
[ERROR] ^
[ERROR] <https://builds.apache.org/job/Struts-JDK8-master/ws/core/src/main/java/org/apache/struts2/dispatcher/StrutsResultSupport.java>:71:
warning: empty <p> tag
[ERROR] * <p/>
[ERROR] ^
[ERROR] <https://builds.apache.org/job/Struts-JDK8-master/ws/core/src/main/java/org/apache/struts2/dispatcher/StrutsResultSupport.java>:78:
error: self-closing element not allowed
[ERROR] * <p/>
[ERROR] ^
[ERROR] <https://builds.apache.org/job/Struts-JDK8-master/ws/core/src/main/java/org/apache/struts2/dispatcher/StrutsResultSupport.java>:81:
error: self-closing element not allowed
[ERROR] * <p/>
[ERROR] ^
[ERROR] <https://builds.apache.org/job/Struts-JDK8-master/ws/core/src/main/java/org/apache/struts2/dispatcher/StrutsResultSupport.java>:83:
error: self-closing element not allowed
[ERROR] * <p/>
[ERROR] ^
[ERROR] <https://builds.apache.org/job/Struts-JDK8-master/ws/core/src/main/java/org/apache/struts2/dispatcher/StrutsResultSupport.java>:83:
warning: empty <p> tag
[ERROR] * <p/>
[ERROR] ^
[ERROR] <https://builds.apache.org/job/Struts-JDK8-master/ws/core/src/main/java/org/apache/struts2/dispatcher/StrutsResultSupport.java>:86:
error: self-closing element not allowed
[ERROR] * <p/>
[ERROR] ^
[ERROR] <https://builds.apache.org/job/Struts-JDK8-master/ws/core/src/main/java/org/apache/struts2/dispatcher/StrutsResultSupport.java>:89:
warning: empty <p> tag
[ERROR] * override {@link #doExecute(String, ActionInvocation)}.<p>
[ERROR] ^
[ERROR] <https://builds.apache.org/job/Struts-JDK8-master/ws/core/src/main/java/org/apache/struts2/dispatcher/StrutsResultSupport.java>:90:
error: self-closing element not allowed
[ERROR] * <p/>
[ERROR] ^
[ERROR] <https://builds.apache.org/job/Struts-JDK8-master/ws/core/src/main/java/org/apache/struts2/dispatcher/StrutsResultSupport.java>:92:
error: self-closing element not allowed
[ERROR] * <p/>
[ERROR] ^
[ERROR] <https://builds.apache.org/job/Struts-JDK8-master/ws/core/src/main/java/org/apache/struts2/dispatcher/StrutsResultSupport.java>:92:
warning: empty <p> tag
[ERROR] * <p/>
[ERROR] ^
[ERROR] <https://builds.apache.org/job/Struts-JDK8-master/ws/core/src/main/java/org/apache/struts2/dispatcher/StrutsResultSupport.java>:98:
error: self-closing element not allowed
[ERROR] * <p/>
[ERROR] ^
[ERROR] <https://builds.apache.org/job/Struts-JDK8-master/ws/core/src/main/java/org/apache/struts2/dispatcher/VelocityResult.java>:173:
error: self-closing element not allowed
[ERROR] * <p/>
[ERROR] ^
[ERROR] <https://builds.apache.org/job/Struts-JDK8-master/ws/core/src/main/java/org/apache/struts2/dispatcher/VelocityResult.java>:178:
warning: no @param for templateLocation
[ERROR] protected String getContentType(String templateLocation) {
[ERROR] ^
[ERROR] <https://builds.apache.org/job/Struts-JDK8-master/ws/core/src/main/java/org/apache/struts2/dispatcher/VelocityResult.java>:189:
warning: no @param for templateLocation
[ERROR] protected String getEncoding(String templateLocation) {
[ERROR] ^
[ERROR] <https://builds.apache.org/job/Struts-JDK8-master/ws/core/src/main/java/org/apache/struts2/dispatcher/VelocityResult.java>:230:
warning: no @param for request
[ERROR] protected Context createContext(VelocityManager velocityManager, ValueStack stack,
HttpServletRequest request, HttpServletResponse response, String location) {
[ERROR] ^
[ERROR] <https://builds.apache.org/job/Struts-JDK8-master/ws/core/src/main/java/org/apache/struts2/dispatcher/VelocityResult.java>:230:
warning: no @param for response
[ERROR] protected Context createContext(VelocityManager velocityManager, ValueStack stack,
HttpServletRequest request, HttpServletResponse response, String location) {
[ERROR] ^
[ERROR] <https://builds.apache.org/job/Struts-JDK8-master/ws/core/src/main/java/org/apache/struts2/dispatcher/mapper/DefaultActionMapper.java>:319:
warning: no @param for configManager
[ERROR] protected void parseNameAndNamespace(String uri, ActionMapping mapping, ConfigurationManager
configManager) {
[ERROR] ^
[ERROR] <https://builds.apache.org/job/Struts-JDK8-master/ws/core/src/main/java/org/apache/struts2/dispatcher/mapper/DefaultActionMapper.java>:440:
warning: no @return
[ERROR] protected String getDefaultExtension() {
[ERROR] ^
[ERROR] <https://builds.apache.org/job/Struts-JDK8-master/ws/core/src/main/java/org/apache/struts2/dispatcher/mapper/DefaultActionMapper.java>:49:
warning: empty <p> tag
[ERROR] * <p/>
[ERROR] ^
[ERROR] <https://builds.apache.org/job/Struts-JDK8-master/ws/core/src/main/java/org/apache/struts2/dispatcher/mapper/DefaultActionMapper.java>:54:
warning: empty <p> tag
[ERROR] * <p/>
[ERROR] ^
[ERROR] <https://builds.apache.org/job/Struts-JDK8-master/ws/core/src/main/java/org/apache/struts2/dispatcher/mapper/DefaultActionMapper.java>:75:
warning: empty <p> tag
[ERROR] * <p/>
[ERROR] ^
[ERROR] <https://builds.apache.org/job/Struts-JDK8-master/ws/core/src/main/java/org/apache/struts2/dispatcher/mapper/DefaultActionMapper.java>:77:
warning: empty <p> tag
[ERROR] * <p/>
[ERROR] ^
[ERROR] <https://builds.apache.org/job/Struts-JDK8-master/ws/core/src/main/java/org/apache/struts2/dispatcher/mapper/DefaultActionMapper.java>:94:
warning: empty <p> tag
[ERROR] * <p/>
[ERROR] ^
[ERROR] <https://builds.apache.org/job/Struts-JDK8-master/ws/core/src/main/java/org/apache/struts2/dispatcher/mapper/DefaultActionMapper.java>:96:
warning: empty <p> tag
[ERROR] * <p/>
[ERROR] ^
[ERROR] <https://builds.apache.org/job/Struts-JDK8-master/ws/core/src/main/java/org/apache/struts2/dispatcher/mapper/PrefixBasedActionMapper.java>:36:
warning: empty <p> tag
[ERROR] * <p/>
[ERROR] ^
[ERROR] <https://builds.apache.org/job/Struts-JDK8-master/ws/core/src/main/java/org/apache/struts2/dispatcher/ng/filter/StrutsPrepareAndExecuteFilter.java>:76:
warning: no @param for dispatcher
[ERROR] protected void postInit(Dispatcher dispatcher, FilterConfig filterConfig) {
[ERROR] ^
[ERROR] 
[ERROR] Command line was: /x1/jenkins/jenkins-slave/tools/hudson.model.JDK/latest1.8/jre/../bin/javadoc
@options @packages
[ERROR] 
[ERROR] Refer to the generated Javadoc files in '<https://builds.apache.org/job/Struts-JDK8-master/ws/core/target/apidocs'>
dir.
[ERROR] -> [Help 1]
[ERROR] 
[ERROR] To see the full stack trace of the errors, re-run Maven with the -e switch.
[ERROR] Re-run Maven using the -X switch to enable full debug logging.
[ERROR] 
[ERROR] For more information about the errors and possible solutions, please read the following
articles:
[ERROR] [Help 1] http://cwiki.apache.org/confluence/display/MAVEN/MojoExecutionException
[ERROR] 
[ERROR] After correcting the problems, you can resume the build with the command
[ERROR]   mvn <goals> -rf :struts2-core
[JENKINS] Archiving <https://builds.apache.org/job/Struts-JDK8-master/ws/plugins/plexus/pom.xml>
to org.apache.struts/struts2-plexus-plugin/2.5-SNAPSHOT/struts2-plexus-plugin-2.5-SNAPSHOT.pom
No prior successful build to compare, so performing full copy of artifacts
[JENKINS] Archiving <https://builds.apache.org/job/Struts-JDK8-master/ws/plugins/pell-multipart/pom.xml>
to org.apache.struts/struts2-pell-multipart-plugin/2.5-SNAPSHOT/struts2-pell-multipart-plugin-2.5-SNAPSHOT.pom
No prior successful build to compare, so performing full copy of artifacts
[JENKINS] Archiving <https://builds.apache.org/job/Struts-JDK8-master/ws/plugins/java8-support/pom.xml>
to org.apache.struts/struts2-java8-support-plugin/2.5-SNAPSHOT/struts2-java8-support-plugin-2.5-SNAPSHOT.pom
No prior successful build to compare, so performing full copy of artifacts
[JENKINS] Archiving <https://builds.apache.org/job/Struts-JDK8-master/ws/plugins/jfreechart/pom.xml>
to org.apache.struts/struts2-jfreechart-plugin/2.5-SNAPSHOT/struts2-jfreechart-plugin-2.5-SNAPSHOT.pom
No prior successful build to compare, so performing full copy of artifacts
[JENKINS] Archiving <https://builds.apache.org/job/Struts-JDK8-master/ws/plugins/sitemesh/pom.xml>
to org.apache.struts/struts2-sitemesh-plugin/2.5-SNAPSHOT/struts2-sitemesh-plugin-2.5-SNAPSHOT.pom
No prior successful build to compare, so performing full copy of artifacts
[JENKINS] Archiving <https://builds.apache.org/job/Struts-JDK8-master/ws/plugins/config-browser/pom.xml>
to org.apache.struts/struts2-config-browser-plugin/2.5-SNAPSHOT/struts2-config-browser-plugin-2.5-SNAPSHOT.pom
No prior successful build to compare, so performing full copy of artifacts
[JENKINS] Archiving <https://builds.apache.org/job/Struts-JDK8-master/ws/archetypes/struts2-archetype-portlet/pom.xml>
to org.apache.struts/struts2-archetype-portlet/2.5-SNAPSHOT/struts2-archetype-portlet-2.5-SNAPSHOT.pom
No prior successful build to compare, so performing full copy of artifacts
[JENKINS] Archiving <https://builds.apache.org/job/Struts-JDK8-master/ws/bundles/demo/pom.xml>
to org.apache.struts/struts2-osgi-demo-bundle/2.5-SNAPSHOT/struts2-osgi-demo-bundle-2.5-SNAPSHOT.pom
No prior successful build to compare, so performing full copy of artifacts
[JENKINS] Archiving <https://builds.apache.org/job/Struts-JDK8-master/ws/plugins/portlet-tiles/pom.xml>
to org.apache.struts/struts2-portlet-tiles-plugin/2.5-SNAPSHOT/struts2-portlet-tiles-plugin-2.5-SNAPSHOT.pom
No prior successful build to compare, so performing full copy of artifacts
[JENKINS] Archiving <https://builds.apache.org/job/Struts-JDK8-master/ws/plugins/jasperreports/pom.xml>
to org.apache.struts/struts2-jasperreports-plugin/2.5-SNAPSHOT/struts2-jasperreports-plugin-2.5-SNAPSHOT.pom
No prior successful build to compare, so performing full copy of artifacts
[JENKINS] Archiving <https://builds.apache.org/job/Struts-JDK8-master/ws/archetypes/struts2-archetype-blank/pom.xml>
to org.apache.struts/struts2-archetype-blank/2.5-SNAPSHOT/struts2-archetype-blank-2.5-SNAPSHOT.pom
No prior successful build to compare, so performing full copy of artifacts
[JENKINS] Archiving <https://builds.apache.org/job/Struts-JDK8-master/ws/plugins/tiles3/pom.xml>
to org.apache.struts/struts2-tiles3-plugin/2.5-SNAPSHOT/struts2-tiles3-plugin-2.5-SNAPSHOT.pom
No prior successful build to compare, so performing full copy of artifacts
[JENKINS] Archiving <https://builds.apache.org/job/Struts-JDK8-master/ws/plugins/oval/pom.xml>
to org.apache.struts/struts2-oval-plugin/2.5-SNAPSHOT/struts2-oval-plugin-2.5-SNAPSHOT.pom
No prior successful build to compare, so performing full copy of artifacts
[JENKINS] Archiving <https://builds.apache.org/job/Struts-JDK8-master/ws/plugins/gxp/pom.xml>
to org.apache.struts/struts2-gxp-plugin/2.5-SNAPSHOT/struts2-gxp-plugin-2.5-SNAPSHOT.pom
No prior successful build to compare, so performing full copy of artifacts
[JENKINS] Archiving <https://builds.apache.org/job/Struts-JDK8-master/ws/plugins/convention/pom.xml>
to org.apache.struts/struts2-convention-plugin/2.5-SNAPSHOT/struts2-convention-plugin-2.5-SNAPSHOT.pom
No prior successful build to compare, so performing full copy of artifacts
[JENKINS] Archiving <https://builds.apache.org/job/Struts-JDK8-master/ws/bundles/pom.xml>
to org.apache.struts/struts2-osgi-bundles/2.5-SNAPSHOT/struts2-osgi-bundles-2.5-SNAPSHOT.pom
No prior successful build to compare, so performing full copy of artifacts
[JENKINS] Archiving <https://builds.apache.org/job/Struts-JDK8-master/ws/pom.xml> to
org.apache.struts/struts2-parent/2.5-SNAPSHOT/struts2-parent-2.5-SNAPSHOT.pom
[JENKINS] Archiving <https://builds.apache.org/job/Struts-JDK8-master/ws/target/struts2-parent-2.5-SNAPSHOT-site.xml>
to org.apache.struts/struts2-parent/2.5-20150618.103542-19/struts2-parent-2.5-20150618.103542-19-site.xml
Sending artifact delta relative to Struts-JDK8-master ? Struts 2 #2
Archived 2 artifacts
Archive block size is 32768
Received 0 blocks and 39470 bytes
Compression is 0.0%
Took 34 ms
[JENKINS] Archiving <https://builds.apache.org/job/Struts-JDK8-master/ws/plugins/osgi/pom.xml>
to org.apache.struts/struts2-osgi-plugin/2.5-SNAPSHOT/struts2-osgi-plugin-2.5-SNAPSHOT.pom
No prior successful build to compare, so performing full copy of artifacts
[JENKINS] Archiving <https://builds.apache.org/job/Struts-JDK8-master/ws/assembly/pom.xml>
to org.apache.struts/struts2-assembly/2.5-SNAPSHOT/struts2-assembly-2.5-SNAPSHOT.pom
No prior successful build to compare, so performing full copy of artifacts
[JENKINS] Archiving <https://builds.apache.org/job/Struts-JDK8-master/ws/apps/showcase/pom.xml>
to org.apache.struts/struts2-showcase/2.5-SNAPSHOT/struts2-showcase-2.5-SNAPSHOT.pom
No prior successful build to compare, so performing full copy of artifacts
[JENKINS] Archiving <https://builds.apache.org/job/Struts-JDK8-master/ws/plugins/cdi/pom.xml>
to org.apache.struts/struts2-cdi-plugin/2.5-SNAPSHOT/struts2-cdi-plugin-2.5-SNAPSHOT.pom
No prior successful build to compare, so performing full copy of artifacts
[JENKINS] Archiving <https://builds.apache.org/job/Struts-JDK8-master/ws/plugins/rest/pom.xml>
to org.apache.struts/struts2-rest-plugin/2.5-SNAPSHOT/struts2-rest-plugin-2.5-SNAPSHOT.pom
No prior successful build to compare, so performing full copy of artifacts
[JENKINS] Archiving <https://builds.apache.org/job/Struts-JDK8-master/ws/core/pom.xml>
to org.apache.struts/struts2-core/2.5-SNAPSHOT/struts2-core-2.5-SNAPSHOT.pom
[JENKINS] Archiving <https://builds.apache.org/job/Struts-JDK8-master/ws/core/target/struts2-core-2.5-SNAPSHOT-sources.jar>
to org.apache.struts/struts2-core/2.5-SNAPSHOT/struts2-core-2.5-SNAPSHOT-sources.jar
No prior successful build to compare, so performing full copy of artifacts
[JENKINS] Archiving <https://builds.apache.org/job/Struts-JDK8-master/ws/plugins/tiles/pom.xml>
to org.apache.struts/struts2-tiles-plugin/2.5-SNAPSHOT/struts2-tiles-plugin-2.5-SNAPSHOT.pom
No prior successful build to compare, so performing full copy of artifacts
[JENKINS] Archiving <https://builds.apache.org/job/Struts-JDK8-master/ws/archetypes/struts2-archetype-dbportlet/pom.xml>
to org.apache.struts/struts2-archetype-dbportlet/2.5-SNAPSHOT/struts2-archetype-dbportlet-2.5-SNAPSHOT.pom
No prior successful build to compare, so performing full copy of artifacts
[JENKINS] Archiving <https://builds.apache.org/job/Struts-JDK8-master/ws/archetypes/struts2-archetype-convention/pom.xml>
to org.apache.struts/struts2-archetype-convention/2.5-SNAPSHOT/struts2-archetype-convention-2.5-SNAPSHOT.pom
No prior successful build to compare, so performing full copy of artifacts
[JENKINS] Archiving <https://builds.apache.org/job/Struts-JDK8-master/ws/archetypes/pom.xml>
to org.apache.struts/struts2-archetypes/2.5-SNAPSHOT/struts2-archetypes-2.5-SNAPSHOT.pom
No prior successful build to compare, so performing full copy of artifacts
[JENKINS] Archiving <https://builds.apache.org/job/Struts-JDK8-master/ws/bom/pom.xml>
to org.apache.struts/struts2-bom/2.5-SNAPSHOT/struts2-bom-2.5-SNAPSHOT.pom
Sending artifact delta relative to Struts-JDK8-master ? Struts 2 Bill of Materials #2
Archived 1 artifacts
Archive block size is 32768
Received 0 blocks and 7820 bytes
Compression is 0.0%
Took 5 ms
[JENKINS] Archiving <https://builds.apache.org/job/Struts-JDK8-master/ws/plugins/embeddedjsp/pom.xml>
to org.apache.struts/struts2-embeddedjsp-plugin/2.5-SNAPSHOT/struts2-embeddedjsp-plugin-2.5-SNAPSHOT.pom
No prior successful build to compare, so performing full copy of artifacts
[JENKINS] Archiving <https://builds.apache.org/job/Struts-JDK8-master/ws/plugins/pom.xml>
to org.apache.struts/struts2-plugins/2.5-SNAPSHOT/struts2-plugins-2.5-SNAPSHOT.pom
No prior successful build to compare, so performing full copy of artifacts
[JENKINS] Archiving <https://builds.apache.org/job/Struts-JDK8-master/ws/apps/rest-showcase/pom.xml>
to org.apache.struts/struts2-rest-showcase/2.5-SNAPSHOT/struts2-rest-showcase-2.5-SNAPSHOT.pom
No prior successful build to compare, so performing full copy of artifacts
[JENKINS] Archiving <https://builds.apache.org/job/Struts-JDK8-master/ws/plugins/javatemplates/pom.xml>
to org.apache.struts/struts2-javatemplates-plugin/2.5-SNAPSHOT/struts2-javatemplates-plugin-2.5-SNAPSHOT.pom
No prior successful build to compare, so performing full copy of artifacts
[JENKINS] Archiving <https://builds.apache.org/job/Struts-JDK8-master/ws/bundles/admin/pom.xml>
to org.apache.struts/struts2-osgi-admin-bundle/2.5-SNAPSHOT/struts2-osgi-admin-bundle-2.5-SNAPSHOT.pom
No prior successful build to compare, so performing full copy of artifacts
[JENKINS] Archiving <https://builds.apache.org/job/Struts-JDK8-master/ws/apps/pom.xml>
to org.apache.struts/struts2-apps/2.5-SNAPSHOT/struts2-apps-2.5-SNAPSHOT.pom
No prior successful build to compare, so performing full copy of artifacts
[JENKINS] Archiving <https://builds.apache.org/job/Struts-JDK8-master/ws/plugins/sitegraph/pom.xml>
to org.apache.struts/struts2-sitegraph-plugin/2.5-SNAPSHOT/struts2-sitegraph-plugin-2.5-SNAPSHOT.pom
No prior successful build to compare, so performing full copy of artifacts
[JENKINS] Archiving <https://builds.apache.org/job/Struts-JDK8-master/ws/plugins/testng/pom.xml>
to org.apache.struts/struts2-testng-plugin/2.5-SNAPSHOT/struts2-testng-plugin-2.5-SNAPSHOT.pom
No prior successful build to compare, so performing full copy of artifacts
[JENKINS] Archiving <https://builds.apache.org/job/Struts-JDK8-master/ws/apps/portlet/pom.xml>
to org.apache.struts/struts2-portlet/2.5-SNAPSHOT/struts2-portlet-2.5-SNAPSHOT.pom
No prior successful build to compare, so performing full copy of artifacts
[JENKINS] Archiving <https://builds.apache.org/job/Struts-JDK8-master/ws/plugins/json/pom.xml>
to org.apache.struts/struts2-json-plugin/2.5-SNAPSHOT/struts2-json-plugin-2.5-SNAPSHOT.pom
No prior successful build to compare, so performing full copy of artifacts
[JENKINS] Archiving <https://builds.apache.org/job/Struts-JDK8-master/ws/plugins/junit/pom.xml>
to org.apache.struts/struts2-junit-plugin/2.5-SNAPSHOT/struts2-junit-plugin-2.5-SNAPSHOT.pom
No prior successful build to compare, so performing full copy of artifacts
[JENKINS] Archiving <https://builds.apache.org/job/Struts-JDK8-master/ws/plugins/dwr/pom.xml>
to org.apache.struts/struts2-dwr-plugin/2.5-SNAPSHOT/struts2-dwr-plugin-2.5-SNAPSHOT.pom
No prior successful build to compare, so performing full copy of artifacts
[JENKINS] Archiving <https://builds.apache.org/job/Struts-JDK8-master/ws/archetypes/struts2-archetype-plugin/pom.xml>
to org.apache.struts/struts2-archetype-plugin/2.5-SNAPSHOT/struts2-archetype-plugin-2.5-SNAPSHOT.pom
No prior successful build to compare, so performing full copy of artifacts
[JENKINS] Archiving <https://builds.apache.org/job/Struts-JDK8-master/ws/plugins/bean-validation/pom.xml>
to org.apache.struts/struts2-bean-validation-plugin/2.5-SNAPSHOT/struts2-bean-validation-plugin-2.5-SNAPSHOT.pom
No prior successful build to compare, so performing full copy of artifacts
[JENKINS] Archiving <https://builds.apache.org/job/Struts-JDK8-master/ws/archetypes/struts2-archetype-angularjs/pom.xml>
to org.apache.struts/struts2-archetype-angularjs/2.5-SNAPSHOT/struts2-archetype-angularjs-2.5-SNAPSHOT.pom
No prior successful build to compare, so performing full copy of artifacts
[JENKINS] Archiving <https://builds.apache.org/job/Struts-JDK8-master/ws/plugins/portlet/pom.xml>
to org.apache.struts/struts2-portlet-plugin/2.5-SNAPSHOT/struts2-portlet-plugin-2.5-SNAPSHOT.pom
No prior successful build to compare, so performing full copy of artifacts
[JENKINS] Archiving <https://builds.apache.org/job/Struts-JDK8-master/ws/plugins/spring/pom.xml>
to org.apache.struts/struts2-spring-plugin/2.5-SNAPSHOT/struts2-spring-plugin-2.5-SNAPSHOT.pom
No prior successful build to compare, so performing full copy of artifacts
[JENKINS] Archiving <https://builds.apache.org/job/Struts-JDK8-master/ws/archetypes/struts2-archetype-starter/pom.xml>
to org.apache.struts/struts2-archetype-starter/2.5-SNAPSHOT/struts2-archetype-starter-2.5-SNAPSHOT.pom
No prior successful build to compare, so performing full copy of artifacts
channel stopped
[locks-and-latches] Releasing all the locks
[locks-and-latches] All the locks released

---------------------------------------------------------------------
To unsubscribe, e-mail: dev-unsubscribe@struts.apache.org
For additional commands, e-mail: dev-help@struts.apache.org


Mime
View raw message