struts-dev mailing list archives

Site index · List index
Message view « Date » · « Thread »
Top « Date » · « Thread »
From Apache Jenkins Server <jenk...@builds.apache.org>
Subject Build failed in Jenkins: Struts-JDK8-master #2
Date Thu, 18 Jun 2015 10:04:53 GMT
See <https://builds.apache.org/job/Struts-JDK8-master/2/changes>

Changes:

[Lukasz Lenart] WW-4077 Moves ValidationAware interface into proper package

[Lukasz Lenart] WW-4443 Renames scope DEFAULT into PROTOTYPE

------------------------------------------
[...truncated 2626 lines...]
[ERROR] <https://builds.apache.org/job/Struts-JDK8-master/ws/core/src/main/java/com/opensymphony/xwork2/factory/ValidatorFactory.java>:16:
error: bad use of '>'
[ERROR] * @param params    property name -> value Map to set onto the Validator instance
[ERROR] ^
[ERROR] <https://builds.apache.org/job/Struts-JDK8-master/ws/core/src/main/java/com/opensymphony/xwork2/inject/ContainerBuilder.java>:216:
error: self-closing element not allowed
[ERROR] * <p/>
[ERROR] ^
[ERROR] <https://builds.apache.org/job/Struts-JDK8-master/ws/core/src/main/java/com/opensymphony/xwork2/inject/Scope.java>:67:
error: self-closing element not allowed
[ERROR] * <p/>
[ERROR] ^
[ERROR] <https://builds.apache.org/job/Struts-JDK8-master/ws/core/src/main/java/com/opensymphony/xwork2/inject/util/ReferenceCache.java>:98:
error: self-closing element not allowed
[ERROR] * <p/>
[ERROR] ^
[ERROR] <https://builds.apache.org/job/Struts-JDK8-master/ws/core/src/main/java/com/opensymphony/xwork2/util/reflection/ReflectionProvider.java>:101:
error: self-closing element not allowed
[ERROR] * <p/>
[ERROR] ^
[ERROR] <https://builds.apache.org/job/Struts-JDK8-master/ws/core/src/main/java/com/opensymphony/xwork2/ognl/OgnlUtil.java>:464:
error: self-closing element not allowed
[ERROR] * <p/>
[ERROR] ^
[ERROR] <https://builds.apache.org/job/Struts-JDK8-master/ws/core/src/main/java/com/opensymphony/xwork2/util/ValueStack.java>:47:
error: bad use of '>'
[ERROR] * Set a override map containing <code>key -> values</code> that takes
precedent when doing find operations on the ValueStack.
[ERROR] ^
[ERROR] <https://builds.apache.org/job/Struts-JDK8-master/ws/core/src/main/java/com/opensymphony/xwork2/util/ValueStack.java>:48:
error: self-closing element not allowed
[ERROR] * <p/>
[ERROR] ^
[ERROR] <https://builds.apache.org/job/Struts-JDK8-master/ws/core/src/main/java/com/opensymphony/xwork2/ognl/accessor/ObjectProxyPropertyAccessor.java>:30:
error: self-closing element not allowed
[ERROR] * <p/>
[ERROR] ^
[ERROR] <https://builds.apache.org/job/Struts-JDK8-master/ws/core/src/main/java/com/opensymphony/xwork2/conversion/ConversionFileProcessor.java>:6:
error: unknown tag: clazz
[ERROR] * Used to process <clazz>-conversion.properties file to read defined Converters
[ERROR] ^
[ERROR] <https://builds.apache.org/job/Struts-JDK8-master/ws/core/src/main/java/com/opensymphony/xwork2/conversion/ObjectTypeDeterminer.java>:21:
error: self-closing element not allowed
[ERROR] * <p/>
[ERROR] ^
[ERROR] <https://builds.apache.org/job/Struts-JDK8-master/ws/core/src/main/java/com/opensymphony/xwork2/conversion/annotations/Conversion.java>:28:
error: self-closing element not allowed
[ERROR] * <p/> <u>Annotation usage:</u>
[ERROR] ^
[ERROR] <https://builds.apache.org/job/Struts-JDK8-master/ws/core/src/main/java/com/opensymphony/xwork2/conversion/annotations/Conversion.java>:34:
error: self-closing element not allowed
[ERROR] * <p/> <u>Annotation parameters:</u>
[ERROR] ^
[ERROR] <https://builds.apache.org/job/Struts-JDK8-master/ws/core/src/main/java/com/opensymphony/xwork2/conversion/annotations/Conversion.java>:54:
error: no summary or caption for table
[ERROR] * </table>
[ERROR] ^
[ERROR] <https://builds.apache.org/job/Struts-JDK8-master/ws/core/src/main/java/com/opensymphony/xwork2/conversion/annotations/Conversion.java>:57:
error: self-closing element not allowed
[ERROR] * <p/> <u>Example code:</u>
[ERROR] ^
[ERROR] <https://builds.apache.org/job/Struts-JDK8-master/ws/core/src/main/java/com/opensymphony/xwork2/conversion/annotations/TypeConversion.java>:25:
error: self-closing element not allowed
[ERROR] * <p/>This annotation is used for class and application wide conversion rules.
[ERROR] ^
[ERROR] <https://builds.apache.org/job/Struts-JDK8-master/ws/core/src/main/java/com/opensymphony/xwork2/conversion/annotations/TypeConversion.java>:27:
error: self-closing element not allowed
[ERROR] * Class wide conversion:<br/>
[ERROR] ^
[ERROR] <https://builds.apache.org/job/Struts-JDK8-master/ws/core/src/main/java/com/opensymphony/xwork2/conversion/annotations/TypeConversion.java>:33:
error: self-closing element not allowed
[ERROR] * Allication wide conversion:<br/>
[ERROR] ^
[ERROR] <https://builds.apache.org/job/Struts-JDK8-master/ws/core/src/main/java/com/opensymphony/xwork2/conversion/annotations/TypeConversion.java>:36:
error: self-closing element not allowed
[ERROR] * <p/>
[ERROR] ^
[ERROR] <https://builds.apache.org/job/Struts-JDK8-master/ws/core/src/main/java/com/opensymphony/xwork2/conversion/annotations/TypeConversion.java>:39:
error: self-closing element not allowed
[ERROR] * <p/> <u>Annotation usage:</u>
[ERROR] ^
[ERROR] <https://builds.apache.org/job/Struts-JDK8-master/ws/core/src/main/java/com/opensymphony/xwork2/conversion/annotations/TypeConversion.java>:45:
error: self-closing element not allowed
[ERROR] * <p/> <u>Annotation parameters:</u>
[ERROR] ^
[ERROR] <https://builds.apache.org/job/Struts-JDK8-master/ws/core/src/main/java/com/opensymphony/xwork2/conversion/annotations/TypeConversion.java>:89:
error: no summary or caption for table
[ERROR] * </table>
[ERROR] ^
[ERROR] <https://builds.apache.org/job/Struts-JDK8-master/ws/core/src/main/java/com/opensymphony/xwork2/conversion/annotations/TypeConversion.java>:93:
error: self-closing element not allowed
[ERROR] * <p/> <u>Example code:</u>
[ERROR] ^
[ERROR] <https://builds.apache.org/job/Struts-JDK8-master/ws/core/src/main/java/com/opensymphony/xwork2/conversion/metadata/ConversionDescription.java>:73:
error: self-closing element not allowed
[ERROR] * Sets the property name to be inserted into the related conversion.properties file.<br/>
[ERROR] ^
[ERROR] <https://builds.apache.org/job/Struts-JDK8-master/ws/core/src/main/java/com/opensymphony/xwork2/conversion/metadata/ConversionDescription.java>:134:
error: self-closing element not allowed
[ERROR] * Example:<br/>
[ERROR] ^
[ERROR] <https://builds.apache.org/job/Struts-JDK8-master/ws/core/src/main/java/com/opensymphony/xwork2/conversion/metadata/ConversionDescription.java>:135:
error: self-closing element not allowed
[ERROR] * property.name = converter.className<br/>
[ERROR] ^
[ERROR] <https://builds.apache.org/job/Struts-JDK8-master/ws/core/src/main/java/com/opensymphony/xwork2/conversion/metadata/ConversionDescription.java>:136:
error: self-closing element not allowed
[ERROR] * Collection_property.name = converter.className<br/>
[ERROR] ^
[ERROR] <https://builds.apache.org/job/Struts-JDK8-master/ws/core/src/main/java/com/opensymphony/xwork2/conversion/impl/AnnotationXWorkConverter.java>:20:
error: self-closing element not allowed
[ERROR] * <p/>
[ERROR] ^
[ERROR] <https://builds.apache.org/job/Struts-JDK8-master/ws/core/src/main/java/com/opensymphony/xwork2/conversion/impl/AnnotationXWorkConverter.java>:25:
error: self-closing element not allowed
[ERROR] * <p/>
[ERROR] ^
[ERROR] <https://builds.apache.org/job/Struts-JDK8-master/ws/core/src/main/java/com/opensymphony/xwork2/conversion/impl/AnnotationXWorkConverter.java>:26:
error: self-closing element not allowed
[ERROR] * <p/> Using this "point" example, if your action (or another compound object
in which you are setting properties on)
[ERROR] ^
[ERROR] <https://builds.apache.org/job/Struts-JDK8-master/ws/core/src/main/java/com/opensymphony/xwork2/conversion/impl/AnnotationXWorkConverter.java>:31:
error: self-closing element not allowed
[ERROR] * <p/>
[ERROR] ^
[ERROR] <https://builds.apache.org/job/Struts-JDK8-master/ws/core/src/main/java/com/opensymphony/xwork2/conversion/impl/AnnotationXWorkConverter.java>:32:
error: self-closing element not allowed
[ERROR] * <p/><b>point = com.acme.PointConverter</b>
[ERROR] ^
[ERROR] <https://builds.apache.org/job/Struts-JDK8-master/ws/core/src/main/java/com/opensymphony/xwork2/conversion/impl/AnnotationXWorkConverter.java>:33:
error: self-closing element not allowed
[ERROR] * <p/>
[ERROR] ^
[ERROR] <https://builds.apache.org/job/Struts-JDK8-master/ws/core/src/main/java/com/opensymphony/xwork2/conversion/impl/AnnotationXWorkConverter.java>:34:
error: self-closing element not allowed
[ERROR] * <p/> Your type converter should be sure to check what class type it is being
requested to convert. Because it is used
[ERROR] ^
[ERROR] <https://builds.apache.org/job/Struts-JDK8-master/ws/core/src/main/java/com/opensymphony/xwork2/conversion/impl/AnnotationXWorkConverter.java>:37:
error: self-closing element not allowed
[ERROR] * <p/>
[ERROR] ^
[ERROR] <https://builds.apache.org/job/Struts-JDK8-master/ws/core/src/main/java/com/opensymphony/xwork2/conversion/impl/AnnotationXWorkConverter.java>:38:
error: self-closing element not allowed
[ERROR] * <p/> After this is done, you can now reference your point (using &lt;ww:property
value="post"/&gt; in JSP or ${point}
[ERROR] ^
[ERROR] <https://builds.apache.org/job/Struts-JDK8-master/ws/core/src/main/java/com/opensymphony/xwork2/conversion/impl/AnnotationXWorkConverter.java>:41:
error: self-closing element not allowed
[ERROR] * <p/>
[ERROR] ^
[ERROR] <https://builds.apache.org/job/Struts-JDK8-master/ws/core/src/main/java/com/opensymphony/xwork2/conversion/impl/AnnotationXWorkConverter.java>:42:
error: self-closing element not allowed
[ERROR] * <p/> In some situations you may wish to apply a type converter globally. This
can be done by editing the file
[ERROR] ^
[ERROR] <https://builds.apache.org/job/Struts-JDK8-master/ws/core/src/main/java/com/opensymphony/xwork2/conversion/impl/AnnotationXWorkConverter.java>:47:
error: self-closing element not allowed
[ERROR] * <p/>
[ERROR] ^
[ERROR] <https://builds.apache.org/job/Struts-JDK8-master/ws/core/src/main/java/com/opensymphony/xwork2/conversion/impl/AnnotationXWorkConverter.java>:48:
error: self-closing element not allowed
[ERROR] * <p/><b>com.acme.Point = com.acme.PointConverter</b>
[ERROR] ^
[ERROR] <https://builds.apache.org/job/Struts-JDK8-master/ws/core/src/main/java/com/opensymphony/xwork2/conversion/impl/AnnotationXWorkConverter.java>:49:
error: self-closing element not allowed
[ERROR] * <p/>
[ERROR] ^
[ERROR] <https://builds.apache.org/job/Struts-JDK8-master/ws/core/src/main/java/com/opensymphony/xwork2/conversion/impl/AnnotationXWorkConverter.java>:51:
error: self-closing element not allowed
[ERROR] * <p/>
[ERROR] ^
[ERROR] 
[ERROR] Command line was: /home/jenkins/jenkins-slave/tools/hudson.model.JDK/latest1.8/jre/../bin/javadoc
@options @packages
[ERROR] 
[ERROR] Refer to the generated Javadoc files in '<https://builds.apache.org/job/Struts-JDK8-master/ws/core/target/apidocs'>
dir.
[ERROR] -> [Help 1]
[ERROR] 
[ERROR] To see the full stack trace of the errors, re-run Maven with the -e switch.
[ERROR] Re-run Maven using the -X switch to enable full debug logging.
[ERROR] 
[ERROR] For more information about the errors and possible solutions, please read the following
articles:
[ERROR] [Help 1] http://cwiki.apache.org/confluence/display/MAVEN/MojoExecutionException
[ERROR] 
[ERROR] After correcting the problems, you can resume the build with the command
[ERROR]   mvn <goals> -rf :struts2-core
[JENKINS] Archiving <https://builds.apache.org/job/Struts-JDK8-master/ws/plugins/plexus/pom.xml>
to org.apache.struts/struts2-plexus-plugin/2.5-SNAPSHOT/struts2-plexus-plugin-2.5-SNAPSHOT.pom
No prior successful build to compare, so performing full copy of artifacts
[JENKINS] Archiving <https://builds.apache.org/job/Struts-JDK8-master/ws/plugins/pell-multipart/pom.xml>
to org.apache.struts/struts2-pell-multipart-plugin/2.5-SNAPSHOT/struts2-pell-multipart-plugin-2.5-SNAPSHOT.pom
No prior successful build to compare, so performing full copy of artifacts
[JENKINS] Archiving <https://builds.apache.org/job/Struts-JDK8-master/ws/plugins/java8-support/pom.xml>
to org.apache.struts/struts2-java8-support-plugin/2.5-SNAPSHOT/struts2-java8-support-plugin-2.5-SNAPSHOT.pom
No prior successful build to compare, so performing full copy of artifacts
[JENKINS] Archiving <https://builds.apache.org/job/Struts-JDK8-master/ws/plugins/jfreechart/pom.xml>
to org.apache.struts/struts2-jfreechart-plugin/2.5-SNAPSHOT/struts2-jfreechart-plugin-2.5-SNAPSHOT.pom
No prior successful build to compare, so performing full copy of artifacts
[JENKINS] Archiving <https://builds.apache.org/job/Struts-JDK8-master/ws/plugins/sitemesh/pom.xml>
to org.apache.struts/struts2-sitemesh-plugin/2.5-SNAPSHOT/struts2-sitemesh-plugin-2.5-SNAPSHOT.pom
No prior successful build to compare, so performing full copy of artifacts
[JENKINS] Archiving <https://builds.apache.org/job/Struts-JDK8-master/ws/plugins/config-browser/pom.xml>
to org.apache.struts/struts2-config-browser-plugin/2.5-SNAPSHOT/struts2-config-browser-plugin-2.5-SNAPSHOT.pom
No prior successful build to compare, so performing full copy of artifacts
[JENKINS] Archiving <https://builds.apache.org/job/Struts-JDK8-master/ws/archetypes/struts2-archetype-portlet/pom.xml>
to org.apache.struts/struts2-archetype-portlet/2.5-SNAPSHOT/struts2-archetype-portlet-2.5-SNAPSHOT.pom
No prior successful build to compare, so performing full copy of artifacts
[JENKINS] Archiving <https://builds.apache.org/job/Struts-JDK8-master/ws/bundles/demo/pom.xml>
to org.apache.struts/struts2-osgi-demo-bundle/2.5-SNAPSHOT/struts2-osgi-demo-bundle-2.5-SNAPSHOT.pom
No prior successful build to compare, so performing full copy of artifacts
[JENKINS] Archiving <https://builds.apache.org/job/Struts-JDK8-master/ws/plugins/portlet-tiles/pom.xml>
to org.apache.struts/struts2-portlet-tiles-plugin/2.5-SNAPSHOT/struts2-portlet-tiles-plugin-2.5-SNAPSHOT.pom
No prior successful build to compare, so performing full copy of artifacts
[JENKINS] Archiving <https://builds.apache.org/job/Struts-JDK8-master/ws/plugins/jasperreports/pom.xml>
to org.apache.struts/struts2-jasperreports-plugin/2.5-SNAPSHOT/struts2-jasperreports-plugin-2.5-SNAPSHOT.pom
No prior successful build to compare, so performing full copy of artifacts
[JENKINS] Archiving <https://builds.apache.org/job/Struts-JDK8-master/ws/archetypes/struts2-archetype-blank/pom.xml>
to org.apache.struts/struts2-archetype-blank/2.5-SNAPSHOT/struts2-archetype-blank-2.5-SNAPSHOT.pom
No prior successful build to compare, so performing full copy of artifacts
[JENKINS] Archiving <https://builds.apache.org/job/Struts-JDK8-master/ws/plugins/tiles3/pom.xml>
to org.apache.struts/struts2-tiles3-plugin/2.5-SNAPSHOT/struts2-tiles3-plugin-2.5-SNAPSHOT.pom
No prior successful build to compare, so performing full copy of artifacts
[JENKINS] Archiving <https://builds.apache.org/job/Struts-JDK8-master/ws/plugins/oval/pom.xml>
to org.apache.struts/struts2-oval-plugin/2.5-SNAPSHOT/struts2-oval-plugin-2.5-SNAPSHOT.pom
No prior successful build to compare, so performing full copy of artifacts
[JENKINS] Archiving <https://builds.apache.org/job/Struts-JDK8-master/ws/plugins/gxp/pom.xml>
to org.apache.struts/struts2-gxp-plugin/2.5-SNAPSHOT/struts2-gxp-plugin-2.5-SNAPSHOT.pom
No prior successful build to compare, so performing full copy of artifacts
[JENKINS] Archiving <https://builds.apache.org/job/Struts-JDK8-master/ws/plugins/convention/pom.xml>
to org.apache.struts/struts2-convention-plugin/2.5-SNAPSHOT/struts2-convention-plugin-2.5-SNAPSHOT.pom
No prior successful build to compare, so performing full copy of artifacts
[JENKINS] Archiving <https://builds.apache.org/job/Struts-JDK8-master/ws/bundles/pom.xml>
to org.apache.struts/struts2-osgi-bundles/2.5-SNAPSHOT/struts2-osgi-bundles-2.5-SNAPSHOT.pom
No prior successful build to compare, so performing full copy of artifacts
[JENKINS] Archiving <https://builds.apache.org/job/Struts-JDK8-master/ws/pom.xml> to
org.apache.struts/struts2-parent/2.5-SNAPSHOT/struts2-parent-2.5-SNAPSHOT.pom
[JENKINS] Archiving <https://builds.apache.org/job/Struts-JDK8-master/ws/target/struts2-parent-2.5-SNAPSHOT-site.xml>
to org.apache.struts/struts2-parent/2.5-20150618.100412-17/struts2-parent-2.5-20150618.100412-17-site.xml
Sending artifact delta relative to Struts-JDK8-master » Struts 2 #1
Archived 2 artifacts
Archive block size is 32768
Received 0 blocks and 39470 bytes
Compression is 0.0%
Took 0.17 sec
[JENKINS] Archiving <https://builds.apache.org/job/Struts-JDK8-master/ws/plugins/osgi/pom.xml>
to org.apache.struts/struts2-osgi-plugin/2.5-SNAPSHOT/struts2-osgi-plugin-2.5-SNAPSHOT.pom
No prior successful build to compare, so performing full copy of artifacts
[JENKINS] Archiving <https://builds.apache.org/job/Struts-JDK8-master/ws/assembly/pom.xml>
to org.apache.struts/struts2-assembly/2.5-SNAPSHOT/struts2-assembly-2.5-SNAPSHOT.pom
No prior successful build to compare, so performing full copy of artifacts
[JENKINS] Archiving <https://builds.apache.org/job/Struts-JDK8-master/ws/apps/showcase/pom.xml>
to org.apache.struts/struts2-showcase/2.5-SNAPSHOT/struts2-showcase-2.5-SNAPSHOT.pom
No prior successful build to compare, so performing full copy of artifacts
[JENKINS] Archiving <https://builds.apache.org/job/Struts-JDK8-master/ws/plugins/cdi/pom.xml>
to org.apache.struts/struts2-cdi-plugin/2.5-SNAPSHOT/struts2-cdi-plugin-2.5-SNAPSHOT.pom
No prior successful build to compare, so performing full copy of artifacts
[JENKINS] Archiving <https://builds.apache.org/job/Struts-JDK8-master/ws/plugins/rest/pom.xml>
to org.apache.struts/struts2-rest-plugin/2.5-SNAPSHOT/struts2-rest-plugin-2.5-SNAPSHOT.pom
No prior successful build to compare, so performing full copy of artifacts
[JENKINS] Archiving <https://builds.apache.org/job/Struts-JDK8-master/ws/core/pom.xml>
to org.apache.struts/struts2-core/2.5-SNAPSHOT/struts2-core-2.5-SNAPSHOT.pom
[JENKINS] Archiving <https://builds.apache.org/job/Struts-JDK8-master/ws/core/target/struts2-core-2.5-SNAPSHOT-sources.jar>
to org.apache.struts/struts2-core/2.5-SNAPSHOT/struts2-core-2.5-SNAPSHOT-sources.jar
No prior successful build to compare, so performing full copy of artifacts
[JENKINS] Archiving <https://builds.apache.org/job/Struts-JDK8-master/ws/plugins/tiles/pom.xml>
to org.apache.struts/struts2-tiles-plugin/2.5-SNAPSHOT/struts2-tiles-plugin-2.5-SNAPSHOT.pom
No prior successful build to compare, so performing full copy of artifacts
[JENKINS] Archiving <https://builds.apache.org/job/Struts-JDK8-master/ws/archetypes/struts2-archetype-dbportlet/pom.xml>
to org.apache.struts/struts2-archetype-dbportlet/2.5-SNAPSHOT/struts2-archetype-dbportlet-2.5-SNAPSHOT.pom
No prior successful build to compare, so performing full copy of artifacts
[JENKINS] Archiving <https://builds.apache.org/job/Struts-JDK8-master/ws/archetypes/struts2-archetype-convention/pom.xml>
to org.apache.struts/struts2-archetype-convention/2.5-SNAPSHOT/struts2-archetype-convention-2.5-SNAPSHOT.pom
No prior successful build to compare, so performing full copy of artifacts
[JENKINS] Archiving <https://builds.apache.org/job/Struts-JDK8-master/ws/archetypes/pom.xml>
to org.apache.struts/struts2-archetypes/2.5-SNAPSHOT/struts2-archetypes-2.5-SNAPSHOT.pom
No prior successful build to compare, so performing full copy of artifacts
[JENKINS] Archiving <https://builds.apache.org/job/Struts-JDK8-master/ws/bom/pom.xml>
to org.apache.struts/struts2-bom/2.5-SNAPSHOT/struts2-bom-2.5-SNAPSHOT.pom
Sending artifact delta relative to Struts-JDK8-master » Struts 2 Bill of Materials #1
Archived 1 artifacts
Archive block size is 32768
Received 0 blocks and 7820 bytes
Compression is 0.0%
Took 96 ms
[JENKINS] Archiving <https://builds.apache.org/job/Struts-JDK8-master/ws/plugins/embeddedjsp/pom.xml>
to org.apache.struts/struts2-embeddedjsp-plugin/2.5-SNAPSHOT/struts2-embeddedjsp-plugin-2.5-SNAPSHOT.pom
No prior successful build to compare, so performing full copy of artifacts
[JENKINS] Archiving <https://builds.apache.org/job/Struts-JDK8-master/ws/plugins/pom.xml>
to org.apache.struts/struts2-plugins/2.5-SNAPSHOT/struts2-plugins-2.5-SNAPSHOT.pom
No prior successful build to compare, so performing full copy of artifacts
[JENKINS] Archiving <https://builds.apache.org/job/Struts-JDK8-master/ws/apps/rest-showcase/pom.xml>
to org.apache.struts/struts2-rest-showcase/2.5-SNAPSHOT/struts2-rest-showcase-2.5-SNAPSHOT.pom
No prior successful build to compare, so performing full copy of artifacts
[JENKINS] Archiving <https://builds.apache.org/job/Struts-JDK8-master/ws/plugins/javatemplates/pom.xml>
to org.apache.struts/struts2-javatemplates-plugin/2.5-SNAPSHOT/struts2-javatemplates-plugin-2.5-SNAPSHOT.pom
No prior successful build to compare, so performing full copy of artifacts
[JENKINS] Archiving <https://builds.apache.org/job/Struts-JDK8-master/ws/bundles/admin/pom.xml>
to org.apache.struts/struts2-osgi-admin-bundle/2.5-SNAPSHOT/struts2-osgi-admin-bundle-2.5-SNAPSHOT.pom
No prior successful build to compare, so performing full copy of artifacts
[JENKINS] Archiving <https://builds.apache.org/job/Struts-JDK8-master/ws/apps/pom.xml>
to org.apache.struts/struts2-apps/2.5-SNAPSHOT/struts2-apps-2.5-SNAPSHOT.pom
No prior successful build to compare, so performing full copy of artifacts
[JENKINS] Archiving <https://builds.apache.org/job/Struts-JDK8-master/ws/plugins/sitegraph/pom.xml>
to org.apache.struts/struts2-sitegraph-plugin/2.5-SNAPSHOT/struts2-sitegraph-plugin-2.5-SNAPSHOT.pom
No prior successful build to compare, so performing full copy of artifacts
[JENKINS] Archiving <https://builds.apache.org/job/Struts-JDK8-master/ws/plugins/testng/pom.xml>
to org.apache.struts/struts2-testng-plugin/2.5-SNAPSHOT/struts2-testng-plugin-2.5-SNAPSHOT.pom
No prior successful build to compare, so performing full copy of artifacts
[JENKINS] Archiving <https://builds.apache.org/job/Struts-JDK8-master/ws/apps/portlet/pom.xml>
to org.apache.struts/struts2-portlet/2.5-SNAPSHOT/struts2-portlet-2.5-SNAPSHOT.pom
No prior successful build to compare, so performing full copy of artifacts
[JENKINS] Archiving <https://builds.apache.org/job/Struts-JDK8-master/ws/plugins/json/pom.xml>
to org.apache.struts/struts2-json-plugin/2.5-SNAPSHOT/struts2-json-plugin-2.5-SNAPSHOT.pom
No prior successful build to compare, so performing full copy of artifacts
[JENKINS] Archiving <https://builds.apache.org/job/Struts-JDK8-master/ws/plugins/junit/pom.xml>
to org.apache.struts/struts2-junit-plugin/2.5-SNAPSHOT/struts2-junit-plugin-2.5-SNAPSHOT.pom
No prior successful build to compare, so performing full copy of artifacts
[JENKINS] Archiving <https://builds.apache.org/job/Struts-JDK8-master/ws/plugins/dwr/pom.xml>
to org.apache.struts/struts2-dwr-plugin/2.5-SNAPSHOT/struts2-dwr-plugin-2.5-SNAPSHOT.pom
No prior successful build to compare, so performing full copy of artifacts
[JENKINS] Archiving <https://builds.apache.org/job/Struts-JDK8-master/ws/archetypes/struts2-archetype-plugin/pom.xml>
to org.apache.struts/struts2-archetype-plugin/2.5-SNAPSHOT/struts2-archetype-plugin-2.5-SNAPSHOT.pom
No prior successful build to compare, so performing full copy of artifacts
[JENKINS] Archiving <https://builds.apache.org/job/Struts-JDK8-master/ws/plugins/bean-validation/pom.xml>
to org.apache.struts/struts2-bean-validation-plugin/2.5-SNAPSHOT/struts2-bean-validation-plugin-2.5-SNAPSHOT.pom
No prior successful build to compare, so performing full copy of artifacts
[JENKINS] Archiving <https://builds.apache.org/job/Struts-JDK8-master/ws/archetypes/struts2-archetype-angularjs/pom.xml>
to org.apache.struts/struts2-archetype-angularjs/2.5-SNAPSHOT/struts2-archetype-angularjs-2.5-SNAPSHOT.pom
No prior successful build to compare, so performing full copy of artifacts
[JENKINS] Archiving <https://builds.apache.org/job/Struts-JDK8-master/ws/plugins/portlet/pom.xml>
to org.apache.struts/struts2-portlet-plugin/2.5-SNAPSHOT/struts2-portlet-plugin-2.5-SNAPSHOT.pom
No prior successful build to compare, so performing full copy of artifacts
[JENKINS] Archiving <https://builds.apache.org/job/Struts-JDK8-master/ws/plugins/spring/pom.xml>
to org.apache.struts/struts2-spring-plugin/2.5-SNAPSHOT/struts2-spring-plugin-2.5-SNAPSHOT.pom
No prior successful build to compare, so performing full copy of artifacts
[JENKINS] Archiving <https://builds.apache.org/job/Struts-JDK8-master/ws/archetypes/struts2-archetype-starter/pom.xml>
to org.apache.struts/struts2-archetype-starter/2.5-SNAPSHOT/struts2-archetype-starter-2.5-SNAPSHOT.pom
No prior successful build to compare, so performing full copy of artifacts
channel stopped
[locks-and-latches] Releasing all the locks
[locks-and-latches] All the locks released
Updating WW-4443
Updating WW-4077

---------------------------------------------------------------------
To unsubscribe, e-mail: dev-unsubscribe@struts.apache.org
For additional commands, e-mail: dev-help@struts.apache.org


Mime
View raw message