struts-dev mailing list archives

Site index · List index
Message view « Date » · « Thread »
Top « Date » · « Thread »
From Apache Jenkins Server <jenk...@builds.apache.org>
Subject Build failed in Jenkins: Struts-JDK6-develop #76
Date Thu, 21 Aug 2014 20:23:19 GMT
See <https://builds.apache.org/job/Struts-JDK6-develop/76/changes>

Changes:

[l.fugaro] This update enables struts to be used as JBoss AS 7/WildFly 8/JBoss EAP 6 module.

[l.fugaro] Added pom's version as 2.3.16.4-SNAPSHOT

[l.fugaro] Removed unused code, comments and variables. Also, added delegatedClassLoaderMap
to handle delegatedClassLoader as per Tomcat.

[l.fugaro] Deleted internal versioning.

[l.fugaro] Updates as stated in PR#20 comments.

[l.fugaro] Updates as stated in PR#20 comments.

[l.fugaro] Updates as stated in PR#20 comments - removed test method testDefaultMessageOverride.

[l.fugaro] Updates as stated in PR#20 comments - synchronized code block inside addDefaultResourceBundle
method using XWORK_MESSAGES_BUNDLE.

[l.fugaro] Added the FIXME notation

[l.fugaro] Restored the ordering feature.

[l.fugaro] Previous commit restored the ordering feature, thus testFindTextInChildProperty
test also has been restored.

[aleksandr.7m] WW-4387 - using original key type for contains method.

[Lukasz Lenart] WW-4389 Solves typo in error message and introduces new message variable

[Lukasz Lenart] WW-4389 Replaces question mark with exclamation

[Lukasz Lenart] WW-4391 FreemarkerResult uses response content encoding in first place

------------------------------------------
[...truncated 13351 lines...]
Compression is 0.0%
Took 97 ms
[JENKINS] Archiving <https://builds.apache.org/job/Struts-JDK6-develop/ws/plugins/gxp/pom.xml>
to org.apache.struts/struts2-gxp-plugin/2.3.18-SNAPSHOT/struts2-gxp-plugin-2.3.18-SNAPSHOT.pom
[JENKINS] Archiving <https://builds.apache.org/job/Struts-JDK6-develop/ws/plugins/gxp/target/struts2-gxp-plugin-2.3.18-SNAPSHOT.jar>
to org.apache.struts/struts2-gxp-plugin/2.3.18-SNAPSHOT/struts2-gxp-plugin-2.3.18-SNAPSHOT.jar
[JENKINS] Archiving <https://builds.apache.org/job/Struts-JDK6-develop/ws/plugins/gxp/target/struts2-gxp-plugin-2.3.18-SNAPSHOT-sources.jar>
to org.apache.struts/struts2-gxp-plugin/2.3.18-SNAPSHOT/struts2-gxp-plugin-2.3.18-SNAPSHOT-sources.jar
[JENKINS] Archiving <https://builds.apache.org/job/Struts-JDK6-develop/ws/plugins/gxp/target/struts2-gxp-plugin-2.3.18-SNAPSHOT-javadoc.jar>
to org.apache.struts/struts2-gxp-plugin/2.3.18-SNAPSHOT/struts2-gxp-plugin-2.3.18-SNAPSHOT-javadoc.jar
Sending artifact delta relative to Struts-JDK6-develop ? Struts 2 GXP Plugin #75
Archived 4 artifacts
Archive block size is 32768
Received 0 blocks and 109210 bytes
Compression is 0.0%
Took 0.2 sec
[JENKINS] Archiving <https://builds.apache.org/job/Struts-JDK6-develop/ws/plugins/convention/pom.xml>
to org.apache.struts/struts2-convention-plugin/2.3.18-SNAPSHOT/struts2-convention-plugin-2.3.18-SNAPSHOT.pom
[JENKINS] Archiving <https://builds.apache.org/job/Struts-JDK6-develop/ws/plugins/convention/target/struts2-convention-plugin-2.3.18-SNAPSHOT.jar>
to org.apache.struts/struts2-convention-plugin/2.3.18-SNAPSHOT/struts2-convention-plugin-2.3.18-SNAPSHOT.jar
[JENKINS] Archiving <https://builds.apache.org/job/Struts-JDK6-develop/ws/plugins/convention/target/struts2-convention-plugin-2.3.18-SNAPSHOT-sources.jar>
to org.apache.struts/struts2-convention-plugin/2.3.18-SNAPSHOT/struts2-convention-plugin-2.3.18-SNAPSHOT-sources.jar
[JENKINS] Archiving <https://builds.apache.org/job/Struts-JDK6-develop/ws/plugins/convention/target/struts2-convention-plugin-2.3.18-SNAPSHOT-javadoc.jar>
to org.apache.struts/struts2-convention-plugin/2.3.18-SNAPSHOT/struts2-convention-plugin-2.3.18-SNAPSHOT-javadoc.jar
Sending artifact delta relative to Struts-JDK6-develop ? Struts 2 Convention Plugin #75
Archived 4 artifacts
Archive block size is 32768
Received 0 blocks and 329428 bytes
Compression is 0.0%
Took 0.2 sec
[JENKINS] Archiving <https://builds.apache.org/job/Struts-JDK6-develop/ws/bundles/pom.xml>
to org.apache.struts/struts2-osgi-bundles/2.3.18-SNAPSHOT/struts2-osgi-bundles-2.3.18-SNAPSHOT.pom
Sending artifact delta relative to Struts-JDK6-develop ? Struts OSGi Bundles #75
Archived 1 artifacts
Archive block size is 32768
Received 0 blocks and 2981 bytes
Compression is 0.0%
Took 2.2 sec
[JENKINS] Archiving <https://builds.apache.org/job/Struts-JDK6-develop/ws/pom.xml> to
org.apache.struts/struts2-parent/2.3.18-SNAPSHOT/struts2-parent-2.3.18-SNAPSHOT.pom
[JENKINS] Archiving <https://builds.apache.org/job/Struts-JDK6-develop/ws/target/struts2-parent-2.3.18-SNAPSHOT-site.xml>
to org.apache.struts/struts2-parent/2.3.18-SNAPSHOT/struts2-parent-2.3.18-SNAPSHOT-site.xml
Sending artifact delta relative to Struts-JDK6-develop ? Struts 2 #75
Archived 2 artifacts
Archive block size is 32768
Received 1 blocks and 7726 bytes
Compression is 80.9%
Took 0.16 sec
[JENKINS] Archiving <https://builds.apache.org/job/Struts-JDK6-develop/ws/plugins/osgi/pom.xml>
to org.apache.struts/struts2-osgi-plugin/2.3.18-SNAPSHOT/struts2-osgi-plugin-2.3.18-SNAPSHOT.pom
[JENKINS] Archiving <https://builds.apache.org/job/Struts-JDK6-develop/ws/plugins/osgi/target/struts2-osgi-plugin-2.3.18-SNAPSHOT.jar>
to org.apache.struts/struts2-osgi-plugin/2.3.18-SNAPSHOT/struts2-osgi-plugin-2.3.18-SNAPSHOT.jar
[JENKINS] Archiving <https://builds.apache.org/job/Struts-JDK6-develop/ws/plugins/osgi/target/struts2-osgi-plugin-2.3.18-SNAPSHOT-sources.jar>
to org.apache.struts/struts2-osgi-plugin/2.3.18-SNAPSHOT/struts2-osgi-plugin-2.3.18-SNAPSHOT-sources.jar
[JENKINS] Archiving <https://builds.apache.org/job/Struts-JDK6-develop/ws/plugins/osgi/target/struts2-osgi-plugin-2.3.18-SNAPSHOT-javadoc.jar>
to org.apache.struts/struts2-osgi-plugin/2.3.18-SNAPSHOT/struts2-osgi-plugin-2.3.18-SNAPSHOT-javadoc.jar
Sending artifact delta relative to Struts-JDK6-develop ? Struts 2 OSGi Plugin #75
Archived 4 artifacts
Archive block size is 32768
Received 0 blocks and 247521 bytes
Compression is 0.0%
Took 2.5 sec
[JENKINS] Archiving <https://builds.apache.org/job/Struts-JDK6-develop/ws/assembly/pom.xml>
to org.apache.struts/struts2-assembly/2.3.18-SNAPSHOT/struts2-assembly-2.3.18-SNAPSHOT.pom
[JENKINS] Archiving <https://builds.apache.org/job/Struts-JDK6-develop/ws/assembly/target/assembly/out/struts-2.3.18-SNAPSHOT-all.zip>
to org.apache.struts/struts2-assembly/2.3.18-SNAPSHOT/struts2-assembly-2.3.18-SNAPSHOT-all.zip
[JENKINS] Archiving <https://builds.apache.org/job/Struts-JDK6-develop/ws/assembly/target/assembly/out/struts-2.3.18-SNAPSHOT-lib.zip>
to org.apache.struts/struts2-assembly/2.3.18-SNAPSHOT/struts2-assembly-2.3.18-SNAPSHOT-lib.zip
[JENKINS] Archiving <https://builds.apache.org/job/Struts-JDK6-develop/ws/assembly/target/assembly/out/struts-2.3.18-SNAPSHOT-apps.zip>
to org.apache.struts/struts2-assembly/2.3.18-SNAPSHOT/struts2-assembly-2.3.18-SNAPSHOT-apps.zip
[JENKINS] Archiving <https://builds.apache.org/job/Struts-JDK6-develop/ws/assembly/target/assembly/out/struts-2.3.18-SNAPSHOT-src.zip>
to org.apache.struts/struts2-assembly/2.3.18-SNAPSHOT/struts2-assembly-2.3.18-SNAPSHOT-src.zip
[JENKINS] Archiving <https://builds.apache.org/job/Struts-JDK6-develop/ws/assembly/target/assembly/out/struts-2.3.18-SNAPSHOT-docs.zip>
to org.apache.struts/struts2-assembly/2.3.18-SNAPSHOT/struts2-assembly-2.3.18-SNAPSHOT-docs.zip
Sending artifact delta relative to Struts-JDK6-develop ? Struts 2 Assembly #75
Archived 6 artifacts
Archive block size is 32768
Received 972 blocks and 124703141 bytes
Compression is 20.3%
Took 1 min 41 sec
[JENKINS] Archiving <https://builds.apache.org/job/Struts-JDK6-develop/ws/apps/showcase/pom.xml>
to org.apache.struts/struts2-showcase/2.3.18-SNAPSHOT/struts2-showcase-2.3.18-SNAPSHOT.pom
[JENKINS] Archiving <https://builds.apache.org/job/Struts-JDK6-develop/ws/apps/showcase/target/struts2-showcase.war>
to org.apache.struts/struts2-showcase/2.3.18-SNAPSHOT/struts2-showcase-2.3.18-SNAPSHOT.war
[JENKINS] Archiving <https://builds.apache.org/job/Struts-JDK6-develop/ws/apps/showcase/target/struts2-showcase-sources.jar>
to org.apache.struts/struts2-showcase/2.3.18-SNAPSHOT/struts2-showcase-2.3.18-SNAPSHOT-sources.jar
[JENKINS] Archiving <https://builds.apache.org/job/Struts-JDK6-develop/ws/apps/showcase/target/struts2-showcase-javadoc.jar>
to org.apache.struts/struts2-showcase/2.3.18-SNAPSHOT/struts2-showcase-2.3.18-SNAPSHOT-javadoc.jar
Sending artifact delta relative to Struts-JDK6-develop ? Struts 2 Showcase Webapp #75
Archived 4 artifacts
Archive block size is 32768
Received 234 blocks and 6245782 bytes
Compression is 55.1%
Took 6.1 sec
[JENKINS] Archiving <https://builds.apache.org/job/Struts-JDK6-develop/ws/plugins/dojo/pom.xml>
to org.apache.struts/struts2-dojo-plugin/2.3.18-SNAPSHOT/struts2-dojo-plugin-2.3.18-SNAPSHOT.pom
[JENKINS] Archiving <https://builds.apache.org/job/Struts-JDK6-develop/ws/plugins/dojo/target/struts2-dojo-plugin-2.3.18-SNAPSHOT.jar>
to org.apache.struts/struts2-dojo-plugin/2.3.18-SNAPSHOT/struts2-dojo-plugin-2.3.18-SNAPSHOT.jar
[JENKINS] Archiving <https://builds.apache.org/job/Struts-JDK6-develop/ws/plugins/dojo/target/struts2-dojo-plugin-2.3.18-SNAPSHOT-sources.jar>
to org.apache.struts/struts2-dojo-plugin/2.3.18-SNAPSHOT/struts2-dojo-plugin-2.3.18-SNAPSHOT-sources.jar
[JENKINS] Archiving <https://builds.apache.org/job/Struts-JDK6-develop/ws/plugins/dojo/target/struts2-dojo-plugin-2.3.18-SNAPSHOT-javadoc.jar>
to org.apache.struts/struts2-dojo-plugin/2.3.18-SNAPSHOT/struts2-dojo-plugin-2.3.18-SNAPSHOT-javadoc.jar
Sending artifact delta relative to Struts-JDK6-develop ? Struts 2 Dojo Plugin #75
Archived 4 artifacts
Archive block size is 32768
Received 32 blocks and 2841546 bytes
Compression is 27.0%
Took 3 sec
[JENKINS] Archiving <https://builds.apache.org/job/Struts-JDK6-develop/ws/plugins/rest/pom.xml>
to org.apache.struts/struts2-rest-plugin/2.3.18-SNAPSHOT/struts2-rest-plugin-2.3.18-SNAPSHOT.pom
[JENKINS] Archiving <https://builds.apache.org/job/Struts-JDK6-develop/ws/plugins/rest/target/struts2-rest-plugin-2.3.18-SNAPSHOT.jar>
to org.apache.struts/struts2-rest-plugin/2.3.18-SNAPSHOT/struts2-rest-plugin-2.3.18-SNAPSHOT.jar
[JENKINS] Archiving <https://builds.apache.org/job/Struts-JDK6-develop/ws/plugins/rest/target/struts2-rest-plugin-2.3.18-SNAPSHOT-sources.jar>
to org.apache.struts/struts2-rest-plugin/2.3.18-SNAPSHOT/struts2-rest-plugin-2.3.18-SNAPSHOT-sources.jar
[JENKINS] Archiving <https://builds.apache.org/job/Struts-JDK6-develop/ws/plugins/rest/target/struts2-rest-plugin-2.3.18-SNAPSHOT-javadoc.jar>
to org.apache.struts/struts2-rest-plugin/2.3.18-SNAPSHOT/struts2-rest-plugin-2.3.18-SNAPSHOT-javadoc.jar
Sending artifact delta relative to Struts-JDK6-develop ? Struts 2 REST Plugin #75
Archived 4 artifacts
Archive block size is 32768
Received 0 blocks and 208212 bytes
Compression is 0.0%
Took 3 sec
[JENKINS] Archiving <https://builds.apache.org/job/Struts-JDK6-develop/ws/archetypes/struts2-archetype-convention/pom.xml>
to org.apache.struts/struts2-archetype-convention/2.3.18-SNAPSHOT/struts2-archetype-convention-2.3.18-SNAPSHOT.pom
[JENKINS] Archiving <https://builds.apache.org/job/Struts-JDK6-develop/ws/archetypes/struts2-archetype-convention/target/struts2-archetype-convention-2.3.18-SNAPSHOT.jar>
to org.apache.struts/struts2-archetype-convention/2.3.18-SNAPSHOT/struts2-archetype-convention-2.3.18-SNAPSHOT.jar
[JENKINS] Archiving <https://builds.apache.org/job/Struts-JDK6-develop/ws/archetypes/struts2-archetype-convention/target/struts2-archetype-convention-2.3.18-SNAPSHOT-sources.jar>
to org.apache.struts/struts2-archetype-convention/2.3.18-SNAPSHOT/struts2-archetype-convention-2.3.18-SNAPSHOT-sources.jar
Sending artifact delta relative to Struts-JDK6-develop ? Struts 2 Archetypes - Blank Convention
#75
Archived 3 artifacts
Archive block size is 32768
Received 0 blocks and 49718 bytes
Compression is 0.0%
Took 0.11 sec
[JENKINS] Archiving <https://builds.apache.org/job/Struts-JDK6-develop/ws/plugins/pom.xml>
to org.apache.struts/struts2-plugins/2.3.18-SNAPSHOT/struts2-plugins-2.3.18-SNAPSHOT.pom
Sending artifact delta relative to Struts-JDK6-develop ? Struts Plugins #75
Archived 1 artifacts
Archive block size is 32768
Received 0 blocks and 3108 bytes
Compression is 0.0%
Took 72 ms
[JENKINS] Archiving <https://builds.apache.org/job/Struts-JDK6-develop/ws/plugins/sitegraph/pom.xml>
to org.apache.struts/struts2-sitegraph-plugin/2.3.18-SNAPSHOT/struts2-sitegraph-plugin-2.3.18-SNAPSHOT.pom
[JENKINS] Archiving <https://builds.apache.org/job/Struts-JDK6-develop/ws/plugins/sitegraph/target/struts2-sitegraph-plugin-2.3.18-SNAPSHOT.jar>
to org.apache.struts/struts2-sitegraph-plugin/2.3.18-SNAPSHOT/struts2-sitegraph-plugin-2.3.18-SNAPSHOT.jar
[JENKINS] Archiving <https://builds.apache.org/job/Struts-JDK6-develop/ws/plugins/sitegraph/target/struts2-sitegraph-plugin-2.3.18-SNAPSHOT-sources.jar>
to org.apache.struts/struts2-sitegraph-plugin/2.3.18-SNAPSHOT/struts2-sitegraph-plugin-2.3.18-SNAPSHOT-sources.jar
[JENKINS] Archiving <https://builds.apache.org/job/Struts-JDK6-develop/ws/plugins/sitegraph/target/struts2-sitegraph-plugin-2.3.18-SNAPSHOT-javadoc.jar>
to org.apache.struts/struts2-sitegraph-plugin/2.3.18-SNAPSHOT/struts2-sitegraph-plugin-2.3.18-SNAPSHOT-javadoc.jar
Sending artifact delta relative to Struts-JDK6-develop ? Struts 2 Sitegraph Plugin #75
Archived 4 artifacts
Archive block size is 32768
Received 0 blocks and 221183 bytes
Compression is 0.0%
Took 0.14 sec
[JENKINS] Archiving <https://builds.apache.org/job/Struts-JDK6-develop/ws/apps/portlet/pom.xml>
to org.apache.struts/struts2-portlet/2.3.18-SNAPSHOT/struts2-portlet-2.3.18-SNAPSHOT.pom
[JENKINS] Archiving <https://builds.apache.org/job/Struts-JDK6-develop/ws/apps/portlet/target/struts2-portlet.war>
to org.apache.struts/struts2-portlet/2.3.18-SNAPSHOT/struts2-portlet-2.3.18-SNAPSHOT.war
[JENKINS] Archiving <https://builds.apache.org/job/Struts-JDK6-develop/ws/apps/portlet/target/struts2-portlet-sources.jar>
to org.apache.struts/struts2-portlet/2.3.18-SNAPSHOT/struts2-portlet-2.3.18-SNAPSHOT-sources.jar
[JENKINS] Archiving <https://builds.apache.org/job/Struts-JDK6-develop/ws/apps/portlet/target/struts2-portlet-javadoc.jar>
to org.apache.struts/struts2-portlet/2.3.18-SNAPSHOT/struts2-portlet-2.3.18-SNAPSHOT-javadoc.jar
Sending artifact delta relative to Struts-JDK6-develop ? Struts 2 Portlet Webapp #75
Archived 4 artifacts
Archive block size is 32768
Received 191 blocks and 2613022 bytes
Compression is 70.5%
Took 2.7 sec
[JENKINS] Archiving <https://builds.apache.org/job/Struts-JDK6-develop/ws/plugins/testng/pom.xml>
to org.apache.struts/struts2-testng-plugin/2.3.18-SNAPSHOT/struts2-testng-plugin-2.3.18-SNAPSHOT.pom
[JENKINS] Archiving <https://builds.apache.org/job/Struts-JDK6-develop/ws/plugins/testng/target/struts2-testng-plugin-2.3.18-SNAPSHOT.jar>
to org.apache.struts/struts2-testng-plugin/2.3.18-SNAPSHOT/struts2-testng-plugin-2.3.18-SNAPSHOT.jar
[JENKINS] Archiving <https://builds.apache.org/job/Struts-JDK6-develop/ws/plugins/testng/target/struts2-testng-plugin-2.3.18-SNAPSHOT-sources.jar>
to org.apache.struts/struts2-testng-plugin/2.3.18-SNAPSHOT/struts2-testng-plugin-2.3.18-SNAPSHOT-sources.jar
[JENKINS] Archiving <https://builds.apache.org/job/Struts-JDK6-develop/ws/plugins/testng/target/struts2-testng-plugin-2.3.18-SNAPSHOT-javadoc.jar>
to org.apache.struts/struts2-testng-plugin/2.3.18-SNAPSHOT/struts2-testng-plugin-2.3.18-SNAPSHOT-javadoc.jar
Sending artifact delta relative to Struts-JDK6-develop ? Struts 2 TestNG Plugin #75
Archived 4 artifacts
Archive block size is 32768
Received 0 blocks and 46976 bytes
Compression is 0.0%
Took 2 sec
[JENKINS] Archiving <https://builds.apache.org/job/Struts-JDK6-develop/ws/plugins/codebehind/pom.xml>
to org.apache.struts/struts2-codebehind-plugin/2.3.18-SNAPSHOT/struts2-codebehind-plugin-2.3.18-SNAPSHOT.pom
[JENKINS] Archiving <https://builds.apache.org/job/Struts-JDK6-develop/ws/plugins/codebehind/target/struts2-codebehind-plugin-2.3.18-SNAPSHOT.jar>
to org.apache.struts/struts2-codebehind-plugin/2.3.18-SNAPSHOT/struts2-codebehind-plugin-2.3.18-SNAPSHOT.jar
[JENKINS] Archiving <https://builds.apache.org/job/Struts-JDK6-develop/ws/plugins/codebehind/target/struts2-codebehind-plugin-2.3.18-SNAPSHOT-sources.jar>
to org.apache.struts/struts2-codebehind-plugin/2.3.18-SNAPSHOT/struts2-codebehind-plugin-2.3.18-SNAPSHOT-sources.jar
[JENKINS] Archiving <https://builds.apache.org/job/Struts-JDK6-develop/ws/plugins/codebehind/target/struts2-codebehind-plugin-2.3.18-SNAPSHOT-javadoc.jar>
to org.apache.struts/struts2-codebehind-plugin/2.3.18-SNAPSHOT/struts2-codebehind-plugin-2.3.18-SNAPSHOT-javadoc.jar
Sending artifact delta relative to Struts-JDK6-develop ? Struts 2 Codebehind Plugin #75
Archived 4 artifacts
Archive block size is 32768
Received 0 blocks and 133865 bytes
Compression is 0.0%
Took 0.18 sec
[JENKINS] Archiving <https://builds.apache.org/job/Struts-JDK6-develop/ws/plugins/dwr/pom.xml>
to org.apache.struts/struts2-dwr-plugin/2.3.18-SNAPSHOT/struts2-dwr-plugin-2.3.18-SNAPSHOT.pom
[JENKINS] Archiving <https://builds.apache.org/job/Struts-JDK6-develop/ws/plugins/dwr/target/struts2-dwr-plugin-2.3.18-SNAPSHOT.jar>
to org.apache.struts/struts2-dwr-plugin/2.3.18-SNAPSHOT/struts2-dwr-plugin-2.3.18-SNAPSHOT.jar
[JENKINS] Archiving <https://builds.apache.org/job/Struts-JDK6-develop/ws/plugins/dwr/target/struts2-dwr-plugin-2.3.18-SNAPSHOT-sources.jar>
to org.apache.struts/struts2-dwr-plugin/2.3.18-SNAPSHOT/struts2-dwr-plugin-2.3.18-SNAPSHOT-sources.jar
[JENKINS] Archiving <https://builds.apache.org/job/Struts-JDK6-develop/ws/plugins/dwr/target/struts2-dwr-plugin-2.3.18-SNAPSHOT-javadoc.jar>
to org.apache.struts/struts2-dwr-plugin/2.3.18-SNAPSHOT/struts2-dwr-plugin-2.3.18-SNAPSHOT-javadoc.jar
Sending artifact delta relative to Struts-JDK6-develop ? Struts 2 DWR Plugin #75
Archived 4 artifacts
Archive block size is 32768
Received 0 blocks and 49974 bytes
Compression is 0.0%
Took 81 ms
[JENKINS] Archiving <https://builds.apache.org/job/Struts-JDK6-develop/ws/plugins/portlet/pom.xml>
to org.apache.struts/struts2-portlet-plugin/2.3.18-SNAPSHOT/struts2-portlet-plugin-2.3.18-SNAPSHOT.pom
[JENKINS] Archiving <https://builds.apache.org/job/Struts-JDK6-develop/ws/plugins/portlet/target/struts2-portlet-plugin-2.3.18-SNAPSHOT.jar>
to org.apache.struts/struts2-portlet-plugin/2.3.18-SNAPSHOT/struts2-portlet-plugin-2.3.18-SNAPSHOT.jar
[JENKINS] Archiving <https://builds.apache.org/job/Struts-JDK6-develop/ws/plugins/portlet/target/struts2-portlet-plugin-2.3.18-SNAPSHOT-sources.jar>
to org.apache.struts/struts2-portlet-plugin/2.3.18-SNAPSHOT/struts2-portlet-plugin-2.3.18-SNAPSHOT-sources.jar
[JENKINS] Archiving <https://builds.apache.org/job/Struts-JDK6-develop/ws/plugins/portlet/target/struts2-portlet-plugin-2.3.18-SNAPSHOT-javadoc.jar>
to org.apache.struts/struts2-portlet-plugin/2.3.18-SNAPSHOT/struts2-portlet-plugin-2.3.18-SNAPSHOT-javadoc.jar
Sending artifact delta relative to Struts-JDK6-develop ? Struts 2 Portlet Plugin #75
Archived 4 artifacts
Archive block size is 32768
Received 0 blocks and 469677 bytes
Compression is 0.0%
Took 0.25 sec
[JENKINS] Archiving <https://builds.apache.org/job/Struts-JDK6-develop/ws/plugins/spring/pom.xml>
to org.apache.struts/struts2-spring-plugin/2.3.18-SNAPSHOT/struts2-spring-plugin-2.3.18-SNAPSHOT.pom
[JENKINS] Archiving <https://builds.apache.org/job/Struts-JDK6-develop/ws/plugins/spring/target/struts2-spring-plugin-2.3.18-SNAPSHOT.jar>
to org.apache.struts/struts2-spring-plugin/2.3.18-SNAPSHOT/struts2-spring-plugin-2.3.18-SNAPSHOT.jar
[JENKINS] Archiving <https://builds.apache.org/job/Struts-JDK6-develop/ws/plugins/spring/target/struts2-spring-plugin-2.3.18-SNAPSHOT-sources.jar>
to org.apache.struts/struts2-spring-plugin/2.3.18-SNAPSHOT/struts2-spring-plugin-2.3.18-SNAPSHOT-sources.jar
[JENKINS] Archiving <https://builds.apache.org/job/Struts-JDK6-develop/ws/plugins/spring/target/struts2-spring-plugin-2.3.18-SNAPSHOT-javadoc.jar>
to org.apache.struts/struts2-spring-plugin/2.3.18-SNAPSHOT/struts2-spring-plugin-2.3.18-SNAPSHOT-javadoc.jar
Sending artifact delta relative to Struts-JDK6-develop ? Struts 2 Spring Plugin #75
Archived 4 artifacts
Archive block size is 32768
Received 0 blocks and 89114 bytes
Compression is 0.0%
Took 96 ms
[JENKINS] Archiving <https://builds.apache.org/job/Struts-JDK6-develop/ws/apps/blank/pom.xml>
to org.apache.struts/struts2-blank/2.3.18-SNAPSHOT/struts2-blank-2.3.18-SNAPSHOT.pom
[JENKINS] Archiving <https://builds.apache.org/job/Struts-JDK6-develop/ws/apps/blank/target/struts2-blank.war>
to org.apache.struts/struts2-blank/2.3.18-SNAPSHOT/struts2-blank-2.3.18-SNAPSHOT.war
[JENKINS] Archiving <https://builds.apache.org/job/Struts-JDK6-develop/ws/apps/blank/target/struts2-blank-sources.jar>
to org.apache.struts/struts2-blank/2.3.18-SNAPSHOT/struts2-blank-2.3.18-SNAPSHOT-sources.jar
[JENKINS] Archiving <https://builds.apache.org/job/Struts-JDK6-develop/ws/apps/blank/target/struts2-blank-javadoc.jar>
to org.apache.struts/struts2-blank/2.3.18-SNAPSHOT/struts2-blank-2.3.18-SNAPSHOT-javadoc.jar
Sending artifact delta relative to Struts-JDK6-develop ? Struts 2 Blank Webapp #75
Archived 4 artifacts
Archive block size is 32768
Received 75 blocks and 1775756 bytes
Compression is 58.1%
Took 2.7 sec
[JENKINS] Archiving <https://builds.apache.org/job/Struts-JDK6-develop/ws/archetypes/struts2-archetype-starter/pom.xml>
to org.apache.struts/struts2-archetype-starter/2.3.18-SNAPSHOT/struts2-archetype-starter-2.3.18-SNAPSHOT.pom
[JENKINS] Archiving <https://builds.apache.org/job/Struts-JDK6-develop/ws/archetypes/struts2-archetype-starter/target/struts2-archetype-starter-2.3.18-SNAPSHOT.jar>
to org.apache.struts/struts2-archetype-starter/2.3.18-SNAPSHOT/struts2-archetype-starter-2.3.18-SNAPSHOT.jar
[JENKINS] Archiving <https://builds.apache.org/job/Struts-JDK6-develop/ws/archetypes/struts2-archetype-starter/target/struts2-archetype-starter-2.3.18-SNAPSHOT-sources.jar>
to org.apache.struts/struts2-archetype-starter/2.3.18-SNAPSHOT/struts2-archetype-starter-2.3.18-SNAPSHOT-sources.jar
Sending artifact delta relative to Struts-JDK6-develop ? Struts 2 Archetypes - Starter #75
Archived 3 artifacts
Archive block size is 32768
Received 0 blocks and 105624 bytes
Compression is 0.0%
Took 98 ms
channel stopped
[locks-and-latches] Releasing all the locks
[locks-and-latches] All the locks released
Maven RedeployPublisher use remote ubuntu-1 maven settings from : /home/jenkins/.m2/settings.xml
[INFO] Deployment in https://repository.apache.org/content/repositories/snapshots (id=apache.snapshots.https,uniqueVersion=true)
Deploying the main artifact struts2-apps-2.3.18-SNAPSHOT.pom
Downloading: https://repository.apache.org/content/repositories/snapshots/org/apache/struts/struts2-apps/2.3.18-SNAPSHOT/maven-metadata.xml
[WARNING] Checksum validation failed, could not read expected checksum: Failed to transfer
file: https://repository.apache.org/content/repositories/snapshots/org/apache/struts/struts2-apps/2.3.18-SNAPSHOT/maven-metadata.xml.sha1.
Return code is: 502 , ReasonPhrase:Proxy Error. for https://repository.apache.org/content/repositories/snapshots/org/apache/struts/struts2-apps/2.3.18-SNAPSHOT/maven-metadata.xml
[WARNING] Checksum validation failed, could not read expected checksum: Failed to transfer
file: https://repository.apache.org/content/repositories/snapshots/org/apache/struts/struts2-apps/2.3.18-SNAPSHOT/maven-metadata.xml.sha1.
Return code is: 502 , ReasonPhrase:Proxy Error. for https://repository.apache.org/content/repositories/snapshots/org/apache/struts/struts2-apps/2.3.18-SNAPSHOT/maven-metadata.xml
Downloaded: https://repository.apache.org/content/repositories/snapshots/org/apache/struts/struts2-apps/2.3.18-SNAPSHOT/maven-metadata.xml
(610 B at 0.0 KB/sec)
Uploading: https://repository.apache.org/content/repositories/snapshots/org/apache/struts/struts2-apps/2.3.18-SNAPSHOT/struts2-apps-2.3.18-20140821.201754-32.pom
Uploaded: https://repository.apache.org/content/repositories/snapshots/org/apache/struts/struts2-apps/2.3.18-SNAPSHOT/struts2-apps-2.3.18-20140821.201754-32.pom
(10 KB at 0.1 KB/sec)
Downloading: https://repository.apache.org/content/repositories/snapshots/org/apache/struts/struts2-apps/maven-metadata.xml
Downloaded: https://repository.apache.org/content/repositories/snapshots/org/apache/struts/struts2-apps/maven-metadata.xml
(788 B at 0.0 KB/sec)
Uploading: https://repository.apache.org/content/repositories/snapshots/org/apache/struts/struts2-apps/2.3.18-SNAPSHOT/maven-metadata.xml
Uploading: https://repository.apache.org/content/repositories/snapshots/org/apache/struts/struts2-apps/maven-metadata.xml
ERROR: Failed to deploy metadata: Could not transfer metadata org.apache.struts:struts2-apps:2.3.18-SNAPSHOT/maven-metadata.xml
from/to apache.snapshots.https (https://repository.apache.org/content/repositories/snapshots):
Failed to transfer file: https://repository.apache.org/content/repositories/snapshots/org/apache/struts/struts2-apps/2.3.18-SNAPSHOT/maven-metadata.xml.
Return code is: 502, ReasonPhrase: Proxy Error.
org.apache.maven.artifact.deployer.ArtifactDeploymentException: Failed to deploy metadata:
Could not transfer metadata org.apache.struts:struts2-apps:2.3.18-SNAPSHOT/maven-metadata.xml
from/to apache.snapshots.https (https://repository.apache.org/content/repositories/snapshots):
Failed to transfer file: https://repository.apache.org/content/repositories/snapshots/org/apache/struts/struts2-apps/2.3.18-SNAPSHOT/maven-metadata.xml.
Return code is: 502, ReasonPhrase: Proxy Error.
	at org.apache.maven.artifact.deployer.DefaultArtifactDeployer.deploy(DefaultArtifactDeployer.java:143)
	at hudson.maven.reporters.MavenArtifactRecord.deploy(MavenArtifactRecord.java:193)
	at hudson.maven.RedeployPublisher.perform(RedeployPublisher.java:176)
	at hudson.tasks.BuildStepMonitor$1.perform(BuildStepMonitor.java:20)
	at hudson.model.AbstractBuild$AbstractBuildExecution.perform(AbstractBuild.java:804)
	at hudson.model.AbstractBuild$AbstractBuildExecution.performAllBuildSteps(AbstractBuild.java:776)
	at hudson.maven.MavenModuleSetBuild$MavenModuleSetBuildExecution.post2(MavenModuleSetBuild.java:1040)
	at hudson.model.AbstractBuild$AbstractBuildExecution.post(AbstractBuild.java:725)
	at hudson.model.Run.execute(Run.java:1701)
	at hudson.maven.MavenModuleSetBuild.run(MavenModuleSetBuild.java:529)
	at hudson.model.ResourceController.execute(ResourceController.java:88)
	at hudson.model.Executor.run(Executor.java:231)
Caused by: org.eclipse.aether.deployment.DeploymentException: Failed to deploy metadata: Could
not transfer metadata org.apache.struts:struts2-apps:2.3.18-SNAPSHOT/maven-metadata.xml from/to
apache.snapshots.https (https://repository.apache.org/content/repositories/snapshots): Failed
to transfer file: https://repository.apache.org/content/repositories/snapshots/org/apache/struts/struts2-apps/2.3.18-SNAPSHOT/maven-metadata.xml.
Return code is: 502, ReasonPhrase: Proxy Error.
	at org.eclipse.aether.internal.impl.DefaultDeployer.deploy(DefaultDeployer.java:372)
	at org.eclipse.aether.internal.impl.DefaultDeployer.deploy(DefaultDeployer.java:269)
	at org.eclipse.aether.internal.impl.DefaultRepositorySystem.deploy(DefaultRepositorySystem.java:413)
	at org.apache.maven.artifact.deployer.DefaultArtifactDeployer.deploy(DefaultArtifactDeployer.java:139)
	... 11 more
Caused by: org.eclipse.aether.transfer.MetadataTransferException: Could not transfer metadata
org.apache.struts:struts2-apps:2.3.18-SNAPSHOT/maven-metadata.xml from/to apache.snapshots.https
(https://repository.apache.org/content/repositories/snapshots): Failed to transfer file: https://repository.apache.org/content/repositories/snapshots/org/apache/struts/struts2-apps/2.3.18-SNAPSHOT/maven-metadata.xml.
Return code is: 502, ReasonPhrase: Proxy Error.
	at org.eclipse.aether.connector.wagon.WagonRepositoryConnector$5.wrap(WagonRepositoryConnector.java:995)
	at org.eclipse.aether.connector.wagon.WagonRepositoryConnector$5.wrap(WagonRepositoryConnector.java:983)
	at org.eclipse.aether.connector.wagon.WagonRepositoryConnector$PutTask.run(WagonRepositoryConnector.java:895)
	at org.eclipse.aether.connector.wagon.WagonRepositoryConnector.put(WagonRepositoryConnector.java:530)
	at org.eclipse.aether.internal.impl.DefaultDeployer.deploy(DefaultDeployer.java:366)
	... 14 more
Caused by: org.apache.maven.wagon.TransferFailedException: Failed to transfer file: https://repository.apache.org/content/repositories/snapshots/org/apache/struts/struts2-apps/2.3.18-SNAPSHOT/maven-metadata.xml.
Return code is: 502, ReasonPhrase: Proxy Error.
	at org.apache.maven.wagon.shared.http4.AbstractHttpClientWagon.put(AbstractHttpClientWagon.java:626)
	at org.apache.maven.wagon.shared.http4.AbstractHttpClientWagon.put(AbstractHttpClientWagon.java:524)
	at org.apache.maven.wagon.shared.http4.AbstractHttpClientWagon.put(AbstractHttpClientWagon.java:505)
	at org.apache.maven.wagon.shared.http4.AbstractHttpClientWagon.put(AbstractHttpClientWagon.java:485)
	at org.eclipse.aether.connector.wagon.WagonRepositoryConnector$PutTask.run(WagonRepositoryConnector.java:871)
	... 16 more
[INFO] Deployment failed after 7 min 50 sec
Build step 'Deploy artifacts to Maven repository' changed build result to FAILURE
Updating WW-4389
Updating WW-4387
Updating WW-4391

---------------------------------------------------------------------
To unsubscribe, e-mail: dev-unsubscribe@struts.apache.org
For additional commands, e-mail: dev-help@struts.apache.org


Mime
View raw message