struts-dev mailing list archives

Site index · List index
Message view « Date » · « Thread »
Top « Date » · « Thread »
From Apache Jenkins Server <jenk...@builds.apache.org>
Subject Build failed in Jenkins: Struts-examples-JDK7-develop #2
Date Thu, 10 Jul 2014 08:10:39 GMT
See <https://builds.apache.org/job/Struts-examples-JDK7-develop/2/changes>

Changes:

[Lukasz Lenart] WW-3764 WW-1832 Adds small demo app to demonstrate possible usage of struts.ui.templateDir

[Lukasz Lenart] Upgrade Struts to 2.3.18-SNAPSHOT

------------------------------------------
[...truncated 39 lines...]
[INFO] Coding Struts 2 Action
[INFO] Form Processing
[INFO] Form validation
[INFO] Message resource
[INFO] Exception handling
[INFO] Debugging Struts
[INFO] form_tags
[INFO] form_xml_validation
[INFO] Control Tags
[INFO] wildcard method selection
[INFO] Struts 2 Themes
[INFO] spring_struts
[INFO] annotations
[INFO] Struts 2 Interceptors
[INFO] Unit Testing
[INFO] http_session
[INFO] Preparable Interface
[INFO] exclude_parameters
[INFO] REST to Action Mapper Example Application
[INFO] Bean Validation
[INFO] Struts 2 Themes Override
[INFO]                                                                         
[INFO] ------------------------------------------------------------------------
[INFO] Building Struts 2 Examples 1.0.0
[INFO] ------------------------------------------------------------------------
[INFO]                                                                         
[INFO] ------------------------------------------------------------------------
[INFO] Building basic_struts 1.0.0
[INFO] ------------------------------------------------------------------------
[WARNING] The POM for org.apache.struts:struts2-core:jar:2.3.18-SNAPSHOT is missing, no dependency
information available
[INFO] ------------------------------------------------------------------------
[INFO] Reactor Summary:
[INFO] 
[INFO] Struts 2 Examples ................................. SUCCESS [0.327s]
[INFO] basic_struts ...................................... FAILURE [1.111s]
[INFO] Hello World Struts 2 Example Application .......... SKIPPED
[INFO] using_tags ........................................ SKIPPED
[INFO] Coding Struts 2 Action ............................ SKIPPED
[INFO] Form Processing ................................... SKIPPED
[INFO] Form validation ................................... SKIPPED
[INFO] Message resource .................................. SKIPPED
[INFO] Exception handling ................................ SKIPPED
[INFO] Debugging Struts .................................. SKIPPED
[INFO] form_tags ......................................... SKIPPED
[INFO] form_xml_validation ............................... SKIPPED
[INFO] Control Tags ...................................... SKIPPED
[INFO] wildcard method selection ......................... SKIPPED
[INFO] Struts 2 Themes ................................... SKIPPED
[INFO] spring_struts ..................................... SKIPPED
[INFO] annotations ....................................... SKIPPED
[INFO] Struts 2 Interceptors ............................. SKIPPED
[INFO] Unit Testing ...................................... SKIPPED
[INFO] http_session ...................................... SKIPPED
[INFO] Preparable Interface .............................. SKIPPED
[INFO] exclude_parameters ................................ SKIPPED
[INFO] REST to Action Mapper Example Application ......... SKIPPED
[INFO] Bean Validation ................................... SKIPPED
[INFO] Struts 2 Themes Override .......................... SKIPPED
[INFO] ------------------------------------------------------------------------
[INFO] BUILD FAILURE
[INFO] ------------------------------------------------------------------------
[INFO] Total time: 22.649s
[INFO] Finished at: Thu Jul 10 08:09:14 UTC 2014
[INFO] Final Memory: 7M/122M
[INFO] ------------------------------------------------------------------------
Waiting for Jenkins to finish collecting data[ERROR] Failed to execute goal on project basic_struts:
Could not resolve dependencies for project struts.apache.org:basic_struts:war:1.0.0: Could
not find artifact org.apache.struts:struts2-core:jar:2.3.18-SNAPSHOT -> [Help 1]

[ERROR] 
[ERROR] To see the full stack trace of the errors, re-run Maven with the -e switch.
[ERROR] Re-run Maven using the -X switch to enable full debug logging.
[ERROR] 
[ERROR] For more information about the errors and possible solutions, please read the following
articles:
[ERROR] [Help 1] http://cwiki.apache.org/confluence/display/MAVEN/DependencyResolutionException
[ERROR] 
[ERROR] After correcting the problems, you can resume the build with the command
[ERROR]   mvn <goals> -rf :basic_struts
[JENKINS] Archiving <https://builds.apache.org/job/Struts-examples-JDK7-develop/ws/using_tags/pom.xml>
to struts.apache.org/using_tags/1.0.0/using_tags-1.0.0.pom
Sending artifact delta relative to Struts-examples-JDK7-develop ? using_tags #1
Archived 1 artifacts
Archive block size is 32768
Received 0 blocks and 755 bytes
Compression is 0.0%
Took 0.23 sec
[JENKINS] Archiving <https://builds.apache.org/job/Struts-examples-JDK7-develop/ws/themes/pom.xml>
to struts.apache.org/themes/1.0.0/themes-1.0.0.pom
Sending artifact delta relative to Struts-examples-JDK7-develop ? Struts 2 Themes #1
Archived 1 artifacts
Archive block size is 32768
Received 0 blocks and 1419 bytes
Compression is 0.0%
Took 1.5 sec
[JENKINS] Archiving <https://builds.apache.org/job/Struts-examples-JDK7-develop/ws/control_tags/pom.xml>
to struts.apache.org/control_tags/1.0.0/control_tags-1.0.0.pom
Sending artifact delta relative to Struts-examples-JDK7-develop ? Control Tags #1
Archived 1 artifacts
Archive block size is 32768
Received 0 blocks and 761 bytes
Compression is 0.0%
Took 0.26 sec
[JENKINS] Archiving <https://builds.apache.org/job/Struts-examples-JDK7-develop/ws/interceptors/pom.xml>
to struts.apache.org/interceptors/1.0.0/interceptors-1.0.0.pom
Sending artifact delta relative to Struts-examples-JDK7-develop ? Struts 2 Interceptors #1
Archived 1 artifacts
Archive block size is 32768
Received 0 blocks and 782 bytes
Compression is 0.0%
Took 0.43 sec
[JENKINS] Archiving <https://builds.apache.org/job/Struts-examples-JDK7-develop/ws/helloworld/pom.xml>
to struts.apache.org/helloworld/1.0.0/helloworld-1.0.0.pom
Sending artifact delta relative to Struts-examples-JDK7-develop ? Hello World Struts 2 Example
Application #1
Archived 1 artifacts
Archive block size is 32768
Received 0 blocks and 756 bytes
Compression is 0.0%
Took 0.26 sec
[JENKINS] Archiving <https://builds.apache.org/job/Struts-examples-JDK7-develop/ws/restful2actionmapper/pom.xml>
to struts.apache.org/restful2actionmapper/1.0.0/restful2actionmapper-1.0.0.pom
Sending artifact delta relative to Struts-examples-JDK7-develop ? REST to Action Mapper Example
Application #1
Archived 1 artifacts
Archive block size is 32768
Received 0 blocks and 807 bytes
Compression is 0.0%
Took 1.6 sec
[JENKINS] Archiving <https://builds.apache.org/job/Struts-examples-JDK7-develop/ws/http_session/pom.xml>
to struts.apache.org/http_session/1.0.0/http_session-1.0.0.pom
Sending artifact delta relative to Struts-examples-JDK7-develop ? http_session #1
Archived 1 artifacts
Archive block size is 32768
Received 0 blocks and 758 bytes
Compression is 0.0%
Took 0.41 sec
[JENKINS] Archiving <https://builds.apache.org/job/Struts-examples-JDK7-develop/ws/themes_override/pom.xml>
to struts.apache.org/themes_override/1.0.0/themes_override-1.0.0.pom
No prior successful build to compare, so performing full copy of artifacts
[JENKINS] Archiving <https://builds.apache.org/job/Struts-examples-JDK7-develop/ws/bean_validation/pom.xml>
to struts.apache.org/bean_validation/1.0.0/bean_validation-1.0.0.pom
Sending artifact delta relative to Struts-examples-JDK7-develop ? Bean Validation #1
Archived 1 artifacts
Archive block size is 32768
Received 0 blocks and 1092 bytes
Compression is 0.0%
Took 0.27 sec
[JENKINS] Archiving <https://builds.apache.org/job/Struts-examples-JDK7-develop/ws/form_processing/pom.xml>
to struts.apache.org/form_processing/1.0.0/form_processing-1.0.0.pom
Sending artifact delta relative to Struts-examples-JDK7-develop ? Form Processing #1
Archived 1 artifacts
Archive block size is 32768
Received 0 blocks and 780 bytes
Compression is 0.0%
Took 0.35 sec
[JENKINS] Archiving <https://builds.apache.org/job/Struts-examples-JDK7-develop/ws/wildcard_method_selection/pom.xml>
to struts.apache.org/wildcard_method_selection/1.0.0/wildcard_method_selection-1.0.0.pom
Sending artifact delta relative to Struts-examples-JDK7-develop ? wildcard method selection
#1
Archived 1 artifacts
Archive block size is 32768
Received 0 blocks and 841 bytes
Compression is 0.0%
Took 2.1 sec
[JENKINS] Archiving <https://builds.apache.org/job/Struts-examples-JDK7-develop/ws/pom.xml>
to struts.apache.org/struts2examples/1.0.0/struts2examples-1.0.0.pom
Sending artifact delta relative to Struts-examples-JDK7-develop ? Struts 2 Examples #1
Archived 1 artifacts
Archive block size is 32768
Received 0 blocks and 3769 bytes
Compression is 0.0%
Took 0.18 sec
[JENKINS] Archiving <https://builds.apache.org/job/Struts-examples-JDK7-develop/ws/form_xml_validation/pom.xml>
to struts.apache.org/form_xml_validation/1.0.0/form_xml_validation-1.0.0.pom
Sending artifact delta relative to Struts-examples-JDK7-develop ? form_xml_validation #1
Archived 1 artifacts
Archive block size is 32768
Received 0 blocks and 806 bytes
Compression is 0.0%
Took 0.28 sec
[JENKINS] Archiving <https://builds.apache.org/job/Struts-examples-JDK7-develop/ws/annotations/pom.xml>
to struts.apache.org/annotations/1.0.0/annotations-1.0.0.pom
Sending artifact delta relative to Struts-examples-JDK7-develop ? annotations #1
Archived 1 artifacts
Archive block size is 32768
Received 0 blocks and 936 bytes
Compression is 0.0%
Took 1.4 sec
[JENKINS] Archiving <https://builds.apache.org/job/Struts-examples-JDK7-develop/ws/form_validation/pom.xml>
to struts.apache.org/form_validation/1.0.0/form_validation-1.0.0.pom
Sending artifact delta relative to Struts-examples-JDK7-develop ? Form validation #1
Archived 1 artifacts
Archive block size is 32768
Received 0 blocks and 780 bytes
Compression is 0.0%
Took 0.26 sec
[JENKINS] Archiving <https://builds.apache.org/job/Struts-examples-JDK7-develop/ws/coding_actions/pom.xml>
to struts.apache.org/coding_actions/1.0.0/coding_actions-1.0.0.pom
Sending artifact delta relative to Struts-examples-JDK7-develop ? Coding Struts 2 Action #1
Archived 1 artifacts
Archive block size is 32768
Received 0 blocks and 780 bytes
Compression is 0.0%
Took 0.28 sec
[JENKINS] Archiving <https://builds.apache.org/job/Struts-examples-JDK7-develop/ws/debugging_struts/pom.xml>
to struts.apache.org/debugging_struts/1.0.0/debugging_struts-1.0.0.pom
Sending artifact delta relative to Struts-examples-JDK7-develop ? Debugging Struts #1
Archived 1 artifacts
Archive block size is 32768
Received 0 blocks and 997 bytes
Compression is 0.0%
Took 0.23 sec
[JENKINS] Archiving <https://builds.apache.org/job/Struts-examples-JDK7-develop/ws/spring_struts/pom.xml>
to struts.apache.org/spring_struts/1.0.0/spring_struts-1.0.0.pom
Sending artifact delta relative to Struts-examples-JDK7-develop ? spring_struts #1
Archived 1 artifacts
Archive block size is 32768
Received 0 blocks and 859 bytes
Compression is 0.0%
Took 0.34 sec
[JENKINS] Archiving <https://builds.apache.org/job/Struts-examples-JDK7-develop/ws/exception_handling/pom.xml>
to struts.apache.org/exception_handling/1.0.0/exception_handling-1.0.0.pom
Sending artifact delta relative to Struts-examples-JDK7-develop ? Exception handling #1
Archived 1 artifacts
Archive block size is 32768
Received 0 blocks and 797 bytes
Compression is 0.0%
Took 0.22 sec
[JENKINS] Archiving <https://builds.apache.org/job/Struts-examples-JDK7-develop/ws/message_resource/pom.xml>
to struts.apache.org/message_resource/1.0.0/message_resource-1.0.0.pom
Sending artifact delta relative to Struts-examples-JDK7-develop ? Message resource #1
Archived 1 artifacts
Archive block size is 32768
Received 0 blocks and 785 bytes
Compression is 0.0%
Took 0.25 sec
[JENKINS] Archiving <https://builds.apache.org/job/Struts-examples-JDK7-develop/ws/exclude_parameters/pom.xml>
to struts.apache.org/exclude_parameters/1.0.0/exclude_parameters-1.0.0.pom
Sending artifact delta relative to Struts-examples-JDK7-develop ? exclude_parameters #1
Archived 1 artifacts
Archive block size is 32768
Received 0 blocks and 801 bytes
Compression is 0.0%
Took 0.22 sec
[JENKINS] Archiving <https://builds.apache.org/job/Struts-examples-JDK7-develop/ws/basic_struts/pom.xml>
to struts.apache.org/basic_struts/1.0.0/basic_struts-1.0.0.pom
Sending artifact delta relative to Struts-examples-JDK7-develop ? basic_struts #1
Archived 1 artifacts
Archive block size is 32768
Received 0 blocks and 716 bytes
Compression is 0.0%
Took 1.5 sec
[JENKINS] Archiving <https://builds.apache.org/job/Struts-examples-JDK7-develop/ws/form_tags/pom.xml>
to struts.apache.org/form_tags/1.0.0/form_tags-1.0.0.pom
Sending artifact delta relative to Struts-examples-JDK7-develop ? form_tags #1
Archived 1 artifacts
Archive block size is 32768
Received 0 blocks and 742 bytes
Compression is 0.0%
Took 0.62 sec
[JENKINS] Archiving <https://builds.apache.org/job/Struts-examples-JDK7-develop/ws/preparable_interface/pom.xml>
to struts.apache.org/preparable_interface/1.0.0/preparable_interface-1.0.0.pom
Sending artifact delta relative to Struts-examples-JDK7-develop ? Preparable Interface #1
Archived 1 artifacts
Archive block size is 32768
Received 0 blocks and 812 bytes
Compression is 0.0%
Took 0.27 sec
[JENKINS] Archiving <https://builds.apache.org/job/Struts-examples-JDK7-develop/ws/unit_testing/pom.xml>
to struts.apache.org/unit_testing/1.0.0/unit_testing-1.0.0.pom
Sending artifact delta relative to Struts-examples-JDK7-develop ? Unit Testing #1
Archived 1 artifacts
Archive block size is 32768
Received 0 blocks and 1219 bytes
Compression is 0.0%
Took 0.37 sec
channel stopped
[locks-and-latches] Releasing all the locks
[locks-and-latches] All the locks released

---------------------------------------------------------------------
To unsubscribe, e-mail: dev-unsubscribe@struts.apache.org
For additional commands, e-mail: dev-help@struts.apache.org


Mime
View raw message