struts-dev mailing list archives

Site index · List index
Message view « Date » · « Thread »
Top « Date » · « Thread »
From Apache Jenkins Server <jenk...@builds.apache.org>
Subject Build failed in Jenkins: Struts-JDK6-features #48
Date Mon, 05 May 2014 05:57:56 GMT
See <https://builds.apache.org/job/Struts-JDK6-features/48/changes>

Changes:

[Lukasz Lenart] Sets -SNAPSHOT version

[Lukasz Lenart] Moves global exclude patterns into dedicated class

[Lukasz Lenart] Uses global exclude patterns to initialise excludeParams

[Lukasz Lenart] Adds test cases to test ClassLoader pollution

[Lukasz Lenart] Updates archetypes' version

[Lukasz Lenart] Updates maven-release-plugin to solve problem with tagging

[Lukasz Lenart] Updates maven-release-plugin to solve problem with tagging

[Lukasz Lenart] [maven-release-plugin] prepare release STRUTS_2_3_16_2

[Lukasz Lenart] [maven-release-plugin] prepare for next development iteration

[Lukasz Lenart] Corrects version in poms

[Lukasz Lenart] Removes version and add packaging

[Lukasz Lenart] Overrides pattern exclusion initialisation to allow test to pass

[Lukasz Lenart] Overrides pattern exclusion initialisation to allow test to pass

[Lukasz Lenart] Adds default param to reduce noise in the logs during building

------------------------------------------
[...truncated 11 lines...]
Seen branch in repository origin/master
Seen 7 remote branches
Checking out Revision a5946d0814b6245f1e83e4ff8e5f337b045991ae (origin/feature/exclude-object-class)
[locks-and-latches] Checking to see if we really have the locks
[locks-and-latches] Have all the locks, build can start
Parsing POMs
maven3-agent.jar already up to date
maven3-interceptor.jar already up to date
maven3-interceptor-commons.jar already up to date
[Struts-JDK6-features] $ /home/hudson/tools/java/latest1.6/bin/java -Xms128m -Xmx768m -XX:MaxPermSize=256m
-XX:PermSize=128m -cp /home/jenkins/jenkins-slave/maven3-agent.jar:/home/jenkins/jenkins-slave/tools/hudson.tasks.Maven_MavenInstallation/Maven_3.0.3/boot/plexus-classworlds-2.4.jar
org.jvnet.hudson.maven3.agent.Maven3Main /home/jenkins/jenkins-slave/tools/hudson.tasks.Maven_MavenInstallation/Maven_3.0.3
/home/jenkins/jenkins-slave/slave.jar /home/jenkins/jenkins-slave/maven3-interceptor.jar /home/jenkins/jenkins-slave/maven3-interceptor-commons.jar
47068
<===[JENKINS REMOTING CAPACITY]===>   channel started
Executing Maven:  -B -f <https://builds.apache.org/job/Struts-JDK6-features/ws/pom.xml>
-Dmaven.repo.local=/home/jenkins/jenkins-slave/maven-repositories/0 package -DskipAssembly
[INFO] Scanning for projects...
[WARNING] 
[WARNING] Some problems were encountered while building the effective model for org.apache.struts:struts2-core:jar:2.3.18-SNAPSHOT
[WARNING] 'reporting.plugins.plugin.version' for org.codehaus.mojo:rat-maven-plugin is missing.
@ line 81, column 21
[WARNING] 
[WARNING] It is highly recommended to fix these problems because they threaten the stability
of your build.
[WARNING] 
[WARNING] For this reason, future Maven versions might no longer support building such malformed
projects.
[WARNING] 
[INFO] ------------------------------------------------------------------------
[INFO] Reactor Build Order:
[INFO] 
[INFO] Struts 2
[INFO] XWork: Core
[INFO] Struts 2 Core
[INFO] Struts Plugins
[INFO] Struts 2 Spring Plugin
[INFO] Struts 2 Convention Plugin
[INFO] Struts 2 JUnit Plugin
[INFO] Struts 2 Webapps
[INFO] Struts 2 Blank Webapp
[INFO] Struts 2 JBoss Blank Webapp
[INFO] Struts 2 Mail Reader Webapp
[INFO] Struts 2 Portlet Plugin
[INFO] Struts 2 DWR Plugin
[INFO] Struts 2 Tiles Plugin
[INFO] Struts 2 Portlet Tiles Plugin
[INFO] Struts 2 Portlet Webapp
[INFO] Struts 2 Struts 1 Plugin
[INFO] Struts 2 Dojo Plugin
[INFO] Struts 2 JSF Plugin
[INFO] Struts 2 Configuration Browser Plugin
[INFO] Struts 2 Sitemesh Plugin
[INFO] Struts 2 JSON Plugin
[INFO] Struts 2 Showcase Webapp
[INFO] Struts 2 REST Plugin
[INFO] Struts 2 Rest Showcase Webapp
[INFO] Struts 2 Codebehind Plugin
[INFO] Struts 2 Java Templates Plugin
[INFO] Struts 2 Jasper Reports Plugin
[INFO] Struts 2 JFreeChart Plugin
[INFO] Struts 2 Pell Multipart Plugin
[INFO] Struts 2 Plexus Plugin
[INFO] Struts 2 Sitegraph Plugin
[INFO] Struts 2 TestNG Plugin
[INFO] Struts 2 OVal Plugin
[INFO] Struts 2 OSGi Plugin
[INFO] Struts 2 Embedded JSP Plugin
[INFO] Struts 2 GXP Plugin
[INFO] Struts 2 CDI Plugin
[INFO] Struts 2 Tiles 3 Plugin
[INFO] Struts OSGi Bundles
[INFO] Struts 2 OSGi Admin Bundle
[INFO] Struts 2 OSGi Demo Bundle
[INFO] Struts 2 Maven Archetypes
[INFO] Struts 2 Archetypes - Angular JS
[INFO] Struts 2 Archetypes - Blank
[INFO] Struts 2 Archetypes - Blank Convention
[INFO] Struts 2 Archetypes - Database Portlet
[INFO] Struts 2 Archetypes - Plugin
[INFO] Struts 2 Archetypes - Portlet
[INFO] Struts 2 Archetypes - Starter
[INFO]                                                                         
[INFO] ------------------------------------------------------------------------
[INFO] Building Struts 2 2.3.18-SNAPSHOT
[INFO] ------------------------------------------------------------------------
[INFO] 
[INFO] --- maven-remote-resources-plugin:1.2.1:process (default) @ struts2-parent ---
[INFO] 
[INFO] --- maven-bundle-plugin:2.1.0:manifest (bundle-manifest) @ struts2-parent ---
[WARNING] Ignoring project type pom - supportedProjectTypes = [jar, bundle]
[WARNING] Failed to getClass for org.apache.maven.plugin.source.SourceJarMojo
[INFO] 
[INFO] --- maven-source-plugin:2.1.2:jar (attach-source) @ struts2-parent ---
[INFO] 
[INFO] --- maven-site-plugin:3.1:attach-descriptor (attach-descriptor) @ struts2-parent ---
[INFO]                                                                         
[INFO] ------------------------------------------------------------------------
[INFO] Building XWork: Core 2.3.18-SNAPSHOT
[INFO] ------------------------------------------------------------------------
[INFO] 
[INFO] --- maven-remote-resources-plugin:1.2.1:process (default) @ xwork-core ---
[INFO] 
[INFO] --- maven-resources-plugin:2.5:resources (default-resources) @ xwork-core ---
[debug] execute contextualize
[INFO] Using 'UTF-8' encoding to copy filtered resources.
[INFO] Copying 17 resources
[INFO] Copying 3 resources
[INFO] 
[INFO] --- maven-compiler-plugin:2.3.2:compile (default-compile) @ xwork-core ---
[INFO] Compiling 340 source files to <https://builds.apache.org/job/Struts-JDK6-features/ws/xwork-core/target/classes>
[INFO] 
[INFO] --- maven-bundle-plugin:2.1.0:manifest (bundle-manifest) @ xwork-core ---
[INFO] 
[INFO] --- maven-resources-plugin:2.5:testResources (default-testResources) @ xwork-core ---
[debug] execute contextualize
[INFO] Using 'UTF-8' encoding to copy filtered resources.
[INFO] Copying 130 resources
[INFO] Copying 3 resources
[INFO] 
[INFO] --- maven-compiler-plugin:2.3.2:testCompile (default-testCompile) @ xwork-core ---
[INFO] Compiling 6 source files to <https://builds.apache.org/job/Struts-JDK6-features/ws/xwork-core/target/test-classes>
[INFO] -------------------------------------------------------------
[ERROR] COMPILATION ERROR : 
[INFO] -------------------------------------------------------------
[ERROR] <https://builds.apache.org/job/Struts-JDK6-features/ws/xwork-core/src/test/java/com/opensymphony/xwork2/interceptor/ParametersInterceptorTest.java>:[190,12]
method does not override or implement a method from a supertype
[ERROR] <https://builds.apache.org/job/Struts-JDK6-features/ws/xwork-core/src/test/java/com/opensymphony/xwork2/interceptor/ParametersInterceptorTest.java>:[309,12]
method does not override or implement a method from a supertype
[INFO] 2 errors 
[INFO] -------------------------------------------------------------
[INFO] ------------------------------------------------------------------------
[INFO] Reactor Summary:
[INFO] 
[INFO] Struts 2 .......................................... SUCCESS [5.991s]
[INFO] XWork: Core ....................................... FAILURE [9.890s]
[INFO] Struts 2 Core ..................................... SKIPPED
[INFO] Struts Plugins .................................... SKIPPED
[INFO] Struts 2 Spring Plugin ............................ SKIPPED
[INFO] Struts 2 Convention Plugin ........................ SKIPPED
[INFO] Struts 2 JUnit Plugin ............................. SKIPPED
[INFO] Struts 2 Webapps .................................. SKIPPED
[INFO] Struts 2 Blank Webapp ............................. SKIPPED
[INFO] Struts 2 JBoss Blank Webapp ....................... SKIPPED
[INFO] Struts 2 Mail Reader Webapp ....................... SKIPPED
[INFO] Struts 2 Portlet Plugin ........................... SKIPPED
[INFO] Struts 2 DWR Plugin ............................... SKIPPED
[INFO] Struts 2 Tiles Plugin ............................. SKIPPED
[INFO] Struts 2 Portlet Tiles Plugin ..................... SKIPPED
[INFO] Struts 2 Portlet Webapp ........................... SKIPPED
[INFO] Struts 2 Struts 1 Plugin .......................... SKIPPED
[INFO] Struts 2 Dojo Plugin .............................. SKIPPED
[INFO] Struts 2 JSF Plugin ............................... SKIPPED
[INFO] Struts 2 Configuration Browser Plugin ............. SKIPPED
[INFO] Struts 2 Sitemesh Plugin .......................... SKIPPED
[INFO] Struts 2 JSON Plugin .............................. SKIPPED
[INFO] Struts 2 Showcase Webapp .......................... SKIPPED
[INFO] Struts 2 REST Plugin .............................. SKIPPED
[INFO] Struts 2 Rest Showcase Webapp ..................... SKIPPED
[INFO] Struts 2 Codebehind Plugin ........................ SKIPPED
[INFO] Struts 2 Java Templates Plugin .................... SKIPPED
[INFO] Struts 2 Jasper Reports Plugin .................... SKIPPED
[INFO] Struts 2 JFreeChart Plugin ........................ SKIPPED
[INFO] Struts 2 Pell Multipart Plugin .................... SKIPPED
[INFO] Struts 2 Plexus Plugin ............................ SKIPPED
[INFO] Struts 2 Sitegraph Plugin ......................... SKIPPED
[INFO] Struts 2 TestNG Plugin ............................ SKIPPED
[INFO] Struts 2 OVal Plugin .............................. SKIPPED
[INFO] Struts 2 OSGi Plugin .............................. SKIPPED
[INFO] Struts 2 Embedded JSP Plugin ...................... SKIPPED
[INFO] Struts 2 GXP Plugin ............................... SKIPPED
[INFO] Struts 2 CDI Plugin ............................... SKIPPED
[INFO] Struts 2 Tiles 3 Plugin ........................... SKIPPED
[INFO] Struts OSGi Bundles ............................... SKIPPED
[INFO] Struts 2 OSGi Admin Bundle ........................ SKIPPED
[INFO] Struts 2 OSGi Demo Bundle ......................... SKIPPED
[INFO] Struts 2 Maven Archetypes ......................... SKIPPED
[INFO] Struts 2 Archetypes - Angular JS .................. SKIPPED
[INFO] Struts 2 Archetypes - Blank ....................... SKIPPED
[INFO] Struts 2 Archetypes - Blank Convention ............ SKIPPED
[INFO] Struts 2 Archetypes - Database Portlet ............ SKIPPED
[INFO] Struts 2 Archetypes - Plugin ...................... SKIPPED
[INFO] Struts 2 Archetypes - Portlet ..................... SKIPPED
[INFO] Struts 2 Archetypes - Starter ..................... SKIPPED
[INFO] ------------------------------------------------------------------------
[INFO] BUILD FAILURE
[INFO] ------------------------------------------------------------------------
[INFO] Total time: 24.123s
[INFO] Finished at: Mon May 05 05:55:52 UTC 2014
[INFO] Final Memory: 34M/219M
[INFO] ------------------------------------------------------------------------
Waiting for Jenkins to finish collecting data[ERROR] Failed to execute goal org.apache.maven.plugins:maven-compiler-plugin:2.3.2:testCompile
(default-testCompile) on project xwork-core: Compilation failure: Compilation failure:
[ERROR] <https://builds.apache.org/job/Struts-JDK6-features/ws/xwork-core/src/test/java/com/opensymphony/xwork2/interceptor/ParametersInterceptorTest.java>:[190,12]
method does not override or implement a method from a supertype
[ERROR] <https://builds.apache.org/job/Struts-JDK6-features/ws/xwork-core/src/test/java/com/opensymphony/xwork2/interceptor/ParametersInterceptorTest.java>:[309,12]
method does not override or implement a method from a supertype
[ERROR] -> [Help 1]
[ERROR] 
[ERROR] To see the full stack trace of the errors, re-run Maven with the -e switch.
[ERROR] Re-run Maven using the -X switch to enable full debug logging.
[ERROR] 
[ERROR] For more information about the errors and possible solutions, please read the following
articles:
[ERROR] [Help 1] http://cwiki.apache.org/confluence/display/MAVEN/MojoFailureException
[ERROR] 
[ERROR] After correcting the problems, you can resume the build with the command
[ERROR]   mvn <goals> -rf :xwork-core

[JENKINS] Archiving <https://builds.apache.org/job/Struts-JDK6-features/ws/plugins/portlet/pom.xml>
to org.apache.struts/struts2-portlet-plugin/2.3.18-SNAPSHOT/struts2-portlet-plugin-2.3.18-SNAPSHOT.pom
[JENKINS] Archiving <https://builds.apache.org/job/Struts-JDK6-features/ws/apps/mailreader/pom.xml>
to org.apache.struts/struts2-mailreader/2.3.18-SNAPSHOT/struts2-mailreader-2.3.18-SNAPSHOT.pom
[JENKINS] Archiving <https://builds.apache.org/job/Struts-JDK6-features/ws/archetypes/struts2-archetype-blank/pom.xml>
to org.apache.struts/struts2-archetype-blank/2.3.18-SNAPSHOT/struts2-archetype-blank-2.3.18-SNAPSHOT.pom
[JENKINS] Archiving <https://builds.apache.org/job/Struts-JDK6-features/ws/core/pom.xml>
to org.apache.struts/struts2-core/2.3.18-SNAPSHOT/struts2-core-2.3.18-SNAPSHOT.pom
[JENKINS] Archiving <https://builds.apache.org/job/Struts-JDK6-features/ws/archetypes/struts2-archetype-portlet/pom.xml>
to org.apache.struts/struts2-archetype-portlet/2.3.18-SNAPSHOT/struts2-archetype-portlet-2.3.18-SNAPSHOT.pom
[JENKINS] Archiving <https://builds.apache.org/job/Struts-JDK6-features/ws/xwork-core/pom.xml>
to org.apache.struts.xwork/xwork-core/2.3.18-SNAPSHOT/xwork-core-2.3.18-SNAPSHOT.pom
[JENKINS] Archiving <https://builds.apache.org/job/Struts-JDK6-features/ws/apps/rest-showcase/pom.xml>
to org.apache.struts/struts2-rest-showcase/2.3.18-SNAPSHOT/struts2-rest-showcase-2.3.18-SNAPSHOT.pom
[JENKINS] Archiving <https://builds.apache.org/job/Struts-JDK6-features/ws/plugins/gxp/pom.xml>
to org.apache.struts/struts2-gxp-plugin/2.3.18-SNAPSHOT/struts2-gxp-plugin-2.3.18-SNAPSHOT.pom
[JENKINS] Archiving <https://builds.apache.org/job/Struts-JDK6-features/ws/apps/portlet/pom.xml>
to org.apache.struts/struts2-portlet/2.3.18-SNAPSHOT/struts2-portlet-2.3.18-SNAPSHOT.pom
[JENKINS] Archiving <https://builds.apache.org/job/Struts-JDK6-features/ws/plugins/testng/pom.xml>
to org.apache.struts/struts2-testng-plugin/2.3.18-SNAPSHOT/struts2-testng-plugin-2.3.18-SNAPSHOT.pom
[JENKINS] Archiving <https://builds.apache.org/job/Struts-JDK6-features/ws/plugins/dojo/pom.xml>
to org.apache.struts/struts2-dojo-plugin/2.3.18-SNAPSHOT/struts2-dojo-plugin-2.3.18-SNAPSHOT.pom
[JENKINS] Archiving <https://builds.apache.org/job/Struts-JDK6-features/ws/plugins/convention/pom.xml>
to org.apache.struts/struts2-convention-plugin/2.3.18-SNAPSHOT/struts2-convention-plugin-2.3.18-SNAPSHOT.pom
[JENKINS] Archiving <https://builds.apache.org/job/Struts-JDK6-features/ws/pom.xml>
to org.apache.struts/struts2-parent/2.3.18-SNAPSHOT/struts2-parent-2.3.18-SNAPSHOT.pom
[JENKINS] Archiving <https://builds.apache.org/job/Struts-JDK6-features/ws/target/struts2-parent-2.3.18-SNAPSHOT-site.xml>
to org.apache.struts/struts2-parent/2.3.18-SNAPSHOT/struts2-parent-2.3.18-SNAPSHOT-site.xml
[JENKINS] Archiving <https://builds.apache.org/job/Struts-JDK6-features/ws/plugins/jasperreports/pom.xml>
to org.apache.struts/struts2-jasperreports-plugin/2.3.18-SNAPSHOT/struts2-jasperreports-plugin-2.3.18-SNAPSHOT.pom
[JENKINS] Archiving <https://builds.apache.org/job/Struts-JDK6-features/ws/plugins/struts1/pom.xml>
to org.apache.struts/struts2-struts1-plugin/2.3.18-SNAPSHOT/struts2-struts1-plugin-2.3.18-SNAPSHOT.pom
[JENKINS] Archiving <https://builds.apache.org/job/Struts-JDK6-features/ws/plugins/rest/pom.xml>
to org.apache.struts/struts2-rest-plugin/2.3.18-SNAPSHOT/struts2-rest-plugin-2.3.18-SNAPSHOT.pom
[JENKINS] Archiving <https://builds.apache.org/job/Struts-JDK6-features/ws/archetypes/struts2-archetype-dbportlet/pom.xml>
to org.apache.struts/struts2-archetype-dbportlet/2.3.18-SNAPSHOT/struts2-archetype-dbportlet-2.3.18-SNAPSHOT.pom
[JENKINS] Archiving <https://builds.apache.org/job/Struts-JDK6-features/ws/archetypes/pom.xml>
to org.apache.struts/struts2-archetypes/2.3.18-SNAPSHOT/struts2-archetypes-2.3.18-SNAPSHOT.pom
[JENKINS] Archiving <https://builds.apache.org/job/Struts-JDK6-features/ws/plugins/config-browser/pom.xml>
to org.apache.struts/struts2-config-browser-plugin/2.3.18-SNAPSHOT/struts2-config-browser-plugin-2.3.18-SNAPSHOT.pom
[JENKINS] Archiving <https://builds.apache.org/job/Struts-JDK6-features/ws/plugins/jsf/pom.xml>
to org.apache.struts/struts2-jsf-plugin/2.3.18-SNAPSHOT/struts2-jsf-plugin-2.3.18-SNAPSHOT.pom
[JENKINS] Archiving <https://builds.apache.org/job/Struts-JDK6-features/ws/bundles/admin/pom.xml>
to org.apache.struts/struts2-osgi-admin-bundle/2.3.18-SNAPSHOT/struts2-osgi-admin-bundle-2.3.18-SNAPSHOT.pom
[JENKINS] Archiving <https://builds.apache.org/job/Struts-JDK6-features/ws/plugins/pom.xml>
to org.apache.struts/struts2-plugins/2.3.18-SNAPSHOT/struts2-plugins-2.3.18-SNAPSHOT.pom
[JENKINS] Archiving <https://builds.apache.org/job/Struts-JDK6-features/ws/plugins/plexus/pom.xml>
to org.apache.struts/struts2-plexus-plugin/2.3.18-SNAPSHOT/struts2-plexus-plugin-2.3.18-SNAPSHOT.pom
[JENKINS] Archiving <https://builds.apache.org/job/Struts-JDK6-features/ws/plugins/json/pom.xml>
to org.apache.struts/struts2-json-plugin/2.3.18-SNAPSHOT/struts2-json-plugin-2.3.18-SNAPSHOT.pom
[JENKINS] Archiving <https://builds.apache.org/job/Struts-JDK6-features/ws/plugins/codebehind/pom.xml>
to org.apache.struts/struts2-codebehind-plugin/2.3.18-SNAPSHOT/struts2-codebehind-plugin-2.3.18-SNAPSHOT.pom
[JENKINS] Archiving <https://builds.apache.org/job/Struts-JDK6-features/ws/plugins/jfreechart/pom.xml>
to org.apache.struts/struts2-jfreechart-plugin/2.3.18-SNAPSHOT/struts2-jfreechart-plugin-2.3.18-SNAPSHOT.pom
[JENKINS] Archiving <https://builds.apache.org/job/Struts-JDK6-features/ws/bundles/demo/pom.xml>
to org.apache.struts/struts2-osgi-demo-bundle/2.3.18-SNAPSHOT/struts2-osgi-demo-bundle-2.3.18-SNAPSHOT.pom
[JENKINS] Archiving <https://builds.apache.org/job/Struts-JDK6-features/ws/plugins/junit/pom.xml>
to org.apache.struts/struts2-junit-plugin/2.3.18-SNAPSHOT/struts2-junit-plugin-2.3.18-SNAPSHOT.pom
[JENKINS] Archiving <https://builds.apache.org/job/Struts-JDK6-features/ws/plugins/portlet-tiles/pom.xml>
to org.apache.struts/struts2-portlet-tiles-plugin/2.3.18-SNAPSHOT/struts2-portlet-tiles-plugin-2.3.18-SNAPSHOT.pom
[JENKINS] Archiving <https://builds.apache.org/job/Struts-JDK6-features/ws/plugins/osgi/pom.xml>
to org.apache.struts/struts2-osgi-plugin/2.3.18-SNAPSHOT/struts2-osgi-plugin-2.3.18-SNAPSHOT.pom
[JENKINS] Archiving <https://builds.apache.org/job/Struts-JDK6-features/ws/plugins/dwr/pom.xml>
to org.apache.struts/struts2-dwr-plugin/2.3.18-SNAPSHOT/struts2-dwr-plugin-2.3.18-SNAPSHOT.pom
[JENKINS] Archiving <https://builds.apache.org/job/Struts-JDK6-features/ws/plugins/javatemplates/pom.xml>
to org.apache.struts/struts2-javatemplates-plugin/2.3.18-SNAPSHOT/struts2-javatemplates-plugin-2.3.18-SNAPSHOT.pom
[JENKINS] Archiving <https://builds.apache.org/job/Struts-JDK6-features/ws/apps/blank/pom.xml>
to org.apache.struts/struts2-blank/2.3.18-SNAPSHOT/struts2-blank-2.3.18-SNAPSHOT.pom
[JENKINS] Archiving <https://builds.apache.org/job/Struts-JDK6-features/ws/archetypes/struts2-archetype-starter/pom.xml>
to org.apache.struts/struts2-archetype-starter/2.3.18-SNAPSHOT/struts2-archetype-starter-2.3.18-SNAPSHOT.pom
[JENKINS] Archiving <https://builds.apache.org/job/Struts-JDK6-features/ws/apps/pom.xml>
to org.apache.struts/struts2-apps/2.3.18-SNAPSHOT/struts2-apps-2.3.18-SNAPSHOT.pom
[JENKINS] Archiving <https://builds.apache.org/job/Struts-JDK6-features/ws/plugins/tiles3/pom.xml>
to org.apache.struts/struts2-tiles3-plugin/2.3.18-SNAPSHOT/struts2-tiles3-plugin-2.3.18-SNAPSHOT.pom
[JENKINS] Archiving <https://builds.apache.org/job/Struts-JDK6-features/ws/plugins/oval/pom.xml>
to org.apache.struts/struts2-oval-plugin/2.3.18-SNAPSHOT/struts2-oval-plugin-2.3.18-SNAPSHOT.pom
[JENKINS] Archiving <https://builds.apache.org/job/Struts-JDK6-features/ws/archetypes/struts2-archetype-angularjs/pom.xml>
to org.apache.struts/struts2-archetype-angularjs/2.3.18-SNAPSHOT/struts2-archetype-angularjs-2.3.18-SNAPSHOT.pom
[JENKINS] Archiving <https://builds.apache.org/job/Struts-JDK6-features/ws/archetypes/struts2-archetype-convention/pom.xml>
to org.apache.struts/struts2-archetype-convention/2.3.18-SNAPSHOT/struts2-archetype-convention-2.3.18-SNAPSHOT.pom
[JENKINS] Archiving <https://builds.apache.org/job/Struts-JDK6-features/ws/apps/showcase/pom.xml>
to org.apache.struts/struts2-showcase/2.3.18-SNAPSHOT/struts2-showcase-2.3.18-SNAPSHOT.pom
[JENKINS] Archiving <https://builds.apache.org/job/Struts-JDK6-features/ws/bundles/pom.xml>
to org.apache.struts/struts2-osgi-bundles/2.3.18-SNAPSHOT/struts2-osgi-bundles-2.3.18-SNAPSHOT.pom
[JENKINS] Archiving <https://builds.apache.org/job/Struts-JDK6-features/ws/apps/jboss-blank/pom.xml>
to org.apache.struts/struts2-jboss-blank/2.3.18-SNAPSHOT/struts2-jboss-blank-2.3.18-SNAPSHOT.pom
[JENKINS] Archiving <https://builds.apache.org/job/Struts-JDK6-features/ws/plugins/pell-multipart/pom.xml>
to org.apache.struts/struts2-pell-multipart-plugin/2.3.18-SNAPSHOT/struts2-pell-multipart-plugin-2.3.18-SNAPSHOT.pom
[JENKINS] Archiving <https://builds.apache.org/job/Struts-JDK6-features/ws/archetypes/struts2-archetype-plugin/pom.xml>
to org.apache.struts/struts2-archetype-plugin/2.3.18-SNAPSHOT/struts2-archetype-plugin-2.3.18-SNAPSHOT.pom
[JENKINS] Archiving <https://builds.apache.org/job/Struts-JDK6-features/ws/plugins/sitemesh/pom.xml>
to org.apache.struts/struts2-sitemesh-plugin/2.3.18-SNAPSHOT/struts2-sitemesh-plugin-2.3.18-SNAPSHOT.pom
[JENKINS] Archiving <https://builds.apache.org/job/Struts-JDK6-features/ws/plugins/sitegraph/pom.xml>
to org.apache.struts/struts2-sitegraph-plugin/2.3.18-SNAPSHOT/struts2-sitegraph-plugin-2.3.18-SNAPSHOT.pom
[JENKINS] Archiving <https://builds.apache.org/job/Struts-JDK6-features/ws/plugins/cdi/pom.xml>
to org.apache.struts/struts2-cdi-plugin/2.3.18-SNAPSHOT/struts2-cdi-plugin-2.3.18-SNAPSHOT.pom
[JENKINS] Archiving <https://builds.apache.org/job/Struts-JDK6-features/ws/plugins/tiles/pom.xml>
to org.apache.struts/struts2-tiles-plugin/2.3.18-SNAPSHOT/struts2-tiles-plugin-2.3.18-SNAPSHOT.pom
[JENKINS] Archiving <https://builds.apache.org/job/Struts-JDK6-features/ws/plugins/spring/pom.xml>
to org.apache.struts/struts2-spring-plugin/2.3.18-SNAPSHOT/struts2-spring-plugin-2.3.18-SNAPSHOT.pom
[JENKINS] Archiving <https://builds.apache.org/job/Struts-JDK6-features/ws/plugins/embeddedjsp/pom.xml>
to org.apache.struts/struts2-embeddedjsp-plugin/2.3.18-SNAPSHOT/struts2-embeddedjsp-plugin-2.3.18-SNAPSHOT.pom
channel stopped
[locks-and-latches] Releasing all the locks
[locks-and-latches] All the locks released

---------------------------------------------------------------------
To unsubscribe, e-mail: dev-unsubscribe@struts.apache.org
For additional commands, e-mail: dev-help@struts.apache.org


Mime
View raw message