struts-dev mailing list archives

Site index · List index
Message view « Date » · « Thread »
Top « Date » · « Thread »
From Apache Jenkins Server <jenk...@builds.apache.org>
Subject Build failed in Jenkins: Struts-JDK6-master #885
Date Fri, 07 Mar 2014 00:57:09 GMT
See <https://builds.apache.org/job/Struts-JDK6-master/885/>

------------------------------------------
[...truncated 4586 lines...]
Generating <https://builds.apache.org/job/Struts-JDK6-master/ws/core/target/apidocs/org/apache/struts2/util//class-use/PrefixTrie.html...>
Generating <https://builds.apache.org/job/Struts-JDK6-master/ws/core/target/apidocs/org/apache/struts2/util//class-use/TextProviderHelper.html...>
Generating <https://builds.apache.org/job/Struts-JDK6-master/ws/core/target/apidocs/org/apache/struts2/util//class-use/DateFormatter.html...>
Generating <https://builds.apache.org/job/Struts-JDK6-master/ws/core/target/apidocs/org/apache/struts2/util//class-use/AppendIteratorFilter.html...>
Generating <https://builds.apache.org/job/Struts-JDK6-master/ws/core/target/apidocs/org/apache/struts2/util//class-use/InvocationSessionStore.html...>
Generating <https://builds.apache.org/job/Struts-JDK6-master/ws/core/target/apidocs/org/apache/struts2/util//class-use/TabbedPane.html...>
Generating <https://builds.apache.org/job/Struts-JDK6-master/ws/core/target/apidocs/org/apache/struts2/util//class-use/Timer.html...>
Generating <https://builds.apache.org/job/Struts-JDK6-master/ws/core/target/apidocs/org/apache/struts2/util//class-use/RegexPatternMatcher.html...>
Generating <https://builds.apache.org/job/Struts-JDK6-master/ws/core/target/apidocs/org/apache/struts2/util//class-use/ContainUtil.html...>
Generating <https://builds.apache.org/job/Struts-JDK6-master/ws/core/target/apidocs/org/apache/struts2/util//class-use/ComponentUtils.html...>
Generating <https://builds.apache.org/job/Struts-JDK6-master/ws/core/target/apidocs/org/apache/struts2/util//class-use/AttributeMap.html...>
Generating <https://builds.apache.org/job/Struts-JDK6-master/ws/core/target/apidocs/org/apache/struts2/util//class-use/StrutsUtil.html...>
Generating <https://builds.apache.org/job/Struts-JDK6-master/ws/core/target/apidocs/org/apache/struts2/util//class-use/FastByteArrayOutputStream.html...>
Generating <https://builds.apache.org/job/Struts-JDK6-master/ws/core/target/apidocs/org/apache/struts2/util//class-use/SubsetIteratorFilter.html...>
Generating <https://builds.apache.org/job/Struts-JDK6-master/ws/core/target/apidocs/org/apache/struts2/util//class-use/SubsetIteratorFilter.Decider.html...>
Generating <https://builds.apache.org/job/Struts-JDK6-master/ws/core/target/apidocs/org/apache/struts2/util//class-use/ListEntry.html...>
Generating <https://builds.apache.org/job/Struts-JDK6-master/ws/core/target/apidocs/org/apache/struts2/util//class-use/StrutsTypeConverter.html...>
Generating <https://builds.apache.org/job/Struts-JDK6-master/ws/core/target/apidocs/org/apache/struts2/util//class-use/MergeIteratorFilter.html...>
Generating <https://builds.apache.org/job/Struts-JDK6-master/ws/core/target/apidocs/org/apache/struts2/util/fs//class-use/JBossFileManager.html...>
Generating <https://builds.apache.org/job/Struts-JDK6-master/ws/core/target/apidocs/org/apache/struts2/servlet/interceptor//class-use/ServletPrincipalProxy.html...>
Generating <https://builds.apache.org/job/Struts-JDK6-master/ws/core/target/apidocs/org/apache/struts2//package-use.html...>
Generating <https://builds.apache.org/job/Struts-JDK6-master/ws/core/target/apidocs/org/apache/struts2/components//package-use.html...>
Generating <https://builds.apache.org/job/Struts-JDK6-master/ws/core/target/apidocs/org/apache/struts2/components/template//package-use.html...>
Generating <https://builds.apache.org/job/Struts-JDK6-master/ws/core/target/apidocs/org/apache/struts2/config//package-use.html...>
Generating <https://builds.apache.org/job/Struts-JDK6-master/ws/core/target/apidocs/org/apache/struts2/dispatcher//package-use.html...>
Generating <https://builds.apache.org/job/Struts-JDK6-master/ws/core/target/apidocs/org/apache/struts2/dispatcher/mapper//package-use.html...>
Generating <https://builds.apache.org/job/Struts-JDK6-master/ws/core/target/apidocs/org/apache/struts2/dispatcher/multipart//package-use.html...>
Generating <https://builds.apache.org/job/Struts-JDK6-master/ws/core/target/apidocs/org/apache/struts2/dispatcher/ng//package-use.html...>
Generating <https://builds.apache.org/job/Struts-JDK6-master/ws/core/target/apidocs/org/apache/struts2/dispatcher/ng/filter//package-use.html...>
Generating <https://builds.apache.org/job/Struts-JDK6-master/ws/core/target/apidocs/org/apache/struts2/dispatcher/ng/listener//package-use.html...>
Generating <https://builds.apache.org/job/Struts-JDK6-master/ws/core/target/apidocs/org/apache/struts2/dispatcher/ng/servlet//package-use.html...>
Generating <https://builds.apache.org/job/Struts-JDK6-master/ws/core/target/apidocs/org/apache/struts2/factory//package-use.html...>
Generating <https://builds.apache.org/job/Struts-JDK6-master/ws/core/target/apidocs/org/apache/struts2/impl//package-use.html...>
Generating <https://builds.apache.org/job/Struts-JDK6-master/ws/core/target/apidocs/org/apache/struts2/interceptor//package-use.html...>
Generating <https://builds.apache.org/job/Struts-JDK6-master/ws/core/target/apidocs/org/apache/struts2/interceptor/debugging//package-use.html...>
Generating <https://builds.apache.org/job/Struts-JDK6-master/ws/core/target/apidocs/org/apache/struts2/interceptor/validation//package-use.html...>
Generating <https://builds.apache.org/job/Struts-JDK6-master/ws/core/target/apidocs/org/apache/struts2/servlet/interceptor//package-use.html...>
Generating <https://builds.apache.org/job/Struts-JDK6-master/ws/core/target/apidocs/org/apache/struts2/util//package-use.html...>
Generating <https://builds.apache.org/job/Struts-JDK6-master/ws/core/target/apidocs/org/apache/struts2/util/fs//package-use.html...>
Generating <https://builds.apache.org/job/Struts-JDK6-master/ws/core/target/apidocs/org/apache/struts2/views//package-use.html...>
Generating <https://builds.apache.org/job/Struts-JDK6-master/ws/core/target/apidocs/org/apache/struts2/views/annotations//package-use.html...>
Generating <https://builds.apache.org/job/Struts-JDK6-master/ws/core/target/apidocs/org/apache/struts2/views/freemarker//package-use.html...>
Generating <https://builds.apache.org/job/Struts-JDK6-master/ws/core/target/apidocs/org/apache/struts2/views/freemarker/tags//package-use.html...>
Generating <https://builds.apache.org/job/Struts-JDK6-master/ws/core/target/apidocs/org/apache/struts2/views/jsp//package-use.html...>
Generating <https://builds.apache.org/job/Struts-JDK6-master/ws/core/target/apidocs/org/apache/struts2/views/jsp/iterator//package-use.html...>
Generating <https://builds.apache.org/job/Struts-JDK6-master/ws/core/target/apidocs/org/apache/struts2/views/jsp/ui//package-use.html...>
Generating <https://builds.apache.org/job/Struts-JDK6-master/ws/core/target/apidocs/org/apache/struts2/views/util//package-use.html...>
Generating <https://builds.apache.org/job/Struts-JDK6-master/ws/core/target/apidocs/org/apache/struts2/views/velocity//package-use.html...>
Generating <https://builds.apache.org/job/Struts-JDK6-master/ws/core/target/apidocs/org/apache/struts2/views/velocity/components//package-use.html...>
Generating <https://builds.apache.org/job/Struts-JDK6-master/ws/core/target/apidocs/org/apache/struts2/views/xslt//package-use.html...>
Building index for all the packages and classes...
Generating <https://builds.apache.org/job/Struts-JDK6-master/ws/core/target/apidocs/overview-tree.html...>
Generating <https://builds.apache.org/job/Struts-JDK6-master/ws/core/target/apidocs/index-all.html...>
Generating <https://builds.apache.org/job/Struts-JDK6-master/ws/core/target/apidocs/deprecated-list.html...>
Building index for all classes...
Generating <https://builds.apache.org/job/Struts-JDK6-master/ws/core/target/apidocs/allclasses-frame.html...>
Generating <https://builds.apache.org/job/Struts-JDK6-master/ws/core/target/apidocs/allclasses-noframe.html...>
Generating <https://builds.apache.org/job/Struts-JDK6-master/ws/core/target/apidocs/index.html...>
Generating <https://builds.apache.org/job/Struts-JDK6-master/ws/core/target/apidocs/overview-summary.html...>
Generating <https://builds.apache.org/job/Struts-JDK6-master/ws/core/target/apidocs/help-doc.html...>
Generating <https://builds.apache.org/job/Struts-JDK6-master/ws/core/target/apidocs/stylesheet.css...>
30 warnings
[WARNING] Javadoc Warnings
[WARNING] <https://builds.apache.org/job/Struts-JDK6-master/ws/core/src/main/java/org/apache/struts2/dispatcher/Dispatcher.java>:812:
warning - @return tag has no arguments.
[WARNING] <https://builds.apache.org/job/Struts-JDK6-master/ws/core/src/main/java/org/apache/struts2/dispatcher/PostbackResult.java>:176:
warning - @return tag cannot be used in method with void return type.
[WARNING] <https://builds.apache.org/job/Struts-JDK6-master/ws/core/src/main/java/org/apache/struts2/dispatcher/ServletActionRedirectResult.java>:128:
warning - Tag @link: reference not found: ActionMapperFactory
[WARNING] <https://builds.apache.org/job/Struts-JDK6-master/ws/core/src/main/java/org/apache/struts2/components/Form.java>:399:
warning - @return tag has no arguments.
[WARNING] <https://builds.apache.org/job/Struts-JDK6-master/ws/core/src/main/java/org/apache/struts2/components/TextArea.java>:53:
warning - Tag @see: reference not found: TabbedPanel
[WARNING] <https://builds.apache.org/job/Struts-JDK6-master/ws/core/src/main/java/org/apache/struts2/components/UpDownSelect.java>:83:
warning - @s.tag is an unknown tag.
[WARNING] <https://builds.apache.org/job/Struts-JDK6-master/ws/core/src/main/java/org/apache/struts2/components/UrlRenderer.java>:38:
warning - @param argument "urlComponent" is not a parameter name.
[WARNING] <https://builds.apache.org/job/Struts-JDK6-master/ws/core/src/main/java/org/apache/struts2/components/UrlRenderer.java>:45:
warning - @param argument "urlComponent" is not a parameter name.
[WARNING] <https://builds.apache.org/job/Struts-JDK6-master/ws/core/src/main/java/org/apache/struts2/views/xslt/AdapterFactory.java>:116:
warning - @return tag has no arguments.
[WARNING] <https://builds.apache.org/job/Struts-JDK6-master/ws/core/src/main/java/org/apache/struts2/views/jsp/iterator/IteratorGeneratorTag.java>:156:
warning - @s.tagattribute is an unknown tag.
[WARNING] <https://builds.apache.org/job/Struts-JDK6-master/ws/core/src/main/java/org/apache/struts2/views/jsp/iterator/IteratorGeneratorTag.java>:165:
warning - @s.tagattribute is an unknown tag.
[WARNING] <https://builds.apache.org/job/Struts-JDK6-master/ws/core/src/main/java/org/apache/struts2/views/jsp/iterator/SortIteratorTag.java>:92:
warning - @s.tag is an unknown tag.
[WARNING] <https://builds.apache.org/job/Struts-JDK6-master/ws/core/src/main/java/org/apache/struts2/views/jsp/iterator/SubsetIteratorTag.java>:154:
warning - @s.tag is an unknown tag.
[WARNING] <https://builds.apache.org/job/Struts-JDK6-master/ws/core/src/main/java/org/apache/struts2/views/jsp/iterator/SubsetIteratorTag.java>:184:
warning - @s.tagattribute is an unknown tag.
[WARNING] <https://builds.apache.org/job/Struts-JDK6-master/ws/core/src/main/java/org/apache/struts2/interceptor/PrincipalProxy.java>:70:
warning - Tag @link: reference not found: org.apache.struts2.servlet.ServletRequestAware
[WARNING] <https://builds.apache.org/job/Struts-JDK6-master/ws/core/src/main/java/org/apache/struts2/interceptor/PrincipalProxy.java>:70:
warning - Tag @link: reference not found: org.apache.struts2.servlet.ServletRequestAware
[WARNING] <https://builds.apache.org/job/Struts-JDK6-master/ws/core/src/main/java/org/apache/struts2/config/ServletContextSingleton.java>:40:
warning - Tag @link: reference not found: org.apache.struts2.lifecycle.SessionLifecycleListener
[WARNING] <https://builds.apache.org/job/Struts-JDK6-master/ws/core/src/main/java/org/apache/struts2/util/ContainUtil.java>:71:
warning - @return tag has no arguments.
[WARNING] <https://builds.apache.org/job/Struts-JDK6-master/ws/core/src/main/java/org/apache/struts2/util/fs/JBossFileManager.java>:123:
warning - @return tag has no arguments.
[WARNING] <https://builds.apache.org/job/Struts-JDK6-master/ws/core/src/main/java/org/apache/struts2/servlet/interceptor/ServletPrincipalProxy.java>:88:
warning - Tag @link: reference not found: org.apache.struts2.servlet.ServletRequestAware
[WARNING] <https://builds.apache.org/job/Struts-JDK6-master/ws/core/src/main/java/org/apache/struts2/servlet/interceptor/ServletPrincipalProxy.java>:88:
warning - Tag @link: reference not found: org.apache.struts2.servlet.ServletRequestAware
[WARNING] <https://builds.apache.org/job/Struts-JDK6-master/ws/core/src/main/java/org/apache/struts2/dispatcher/ServletActionRedirectResult.java>:128:
warning - Tag @link: reference not found: ActionMapperFactory
[WARNING] <https://builds.apache.org/job/Struts-JDK6-master/ws/core/src/main/java/org/apache/struts2/dispatcher/ServletActionRedirectResult.java>:128:
warning - Tag @link: reference not found: ActionMapperFactory
[WARNING] <https://builds.apache.org/job/Struts-JDK6-master/ws/core/src/main/java/org/apache/struts2/dispatcher/ServletActionRedirectResult.java>:128:
warning - Tag @link: reference not found: ActionMapperFactory
[WARNING] <https://builds.apache.org/job/Struts-JDK6-master/ws/core/src/main/java/org/apache/struts2/dispatcher/ServletActionRedirectResult.java>:128:
warning - Tag @link: reference not found: ActionMapperFactory
[WARNING] <https://builds.apache.org/job/Struts-JDK6-master/ws/core/src/main/java/org/apache/struts2/interceptor/PrincipalProxy.java>:70:
warning - Tag @link: reference not found: org.apache.struts2.servlet.ServletRequestAware
[WARNING] <https://builds.apache.org/job/Struts-JDK6-master/ws/core/src/main/java/org/apache/struts2/servlet/interceptor/ServletPrincipalProxy.java>:88:
warning - Tag @link: reference not found: org.apache.struts2.servlet.ServletRequestAware
[WARNING] <https://builds.apache.org/job/Struts-JDK6-master/ws/core/src/main/java/org/apache/struts2/dispatcher/ServletActionRedirectResult.java>:128:
warning - Tag @link: reference not found: ActionMapperFactory
[WARNING] <https://builds.apache.org/job/Struts-JDK6-master/ws/core/src/main/java/org/apache/struts2/interceptor/PrincipalProxy.java>:70:
warning - Tag @link: reference not found: org.apache.struts2.servlet.ServletRequestAware
[WARNING] <https://builds.apache.org/job/Struts-JDK6-master/ws/core/src/main/java/org/apache/struts2/servlet/interceptor/ServletPrincipalProxy.java>:88:
warning - Tag @link: reference not found: org.apache.struts2.servlet.ServletRequestAware
[INFO] Building jar: <https://builds.apache.org/job/Struts-JDK6-master/ws/core/target/struts2-core-2.3.16.1-javadoc.jar>
[INFO] 
[INFO] --- maven-remote-resources-plugin:1.2.1:process (default) @ struts2-core ---
[INFO] 
[INFO] --- maven-resources-plugin:2.5:resources (default-resources) @ struts2-core ---
[debug] execute contextualize
[INFO] Using 'UTF-8' encoding to copy filtered resources.
[INFO] Copying 176 resources
[INFO] Copying 3 resources
[INFO] 
[INFO] --- maven-compiler-plugin:2.3.2:compile (default-compile) @ struts2-core ---
[INFO] Compiling 383 source files to <https://builds.apache.org/job/Struts-JDK6-master/ws/core/target/classes>
[INFO] -------------------------------------------------------------
[ERROR] COMPILATION ERROR : 
[INFO] -------------------------------------------------------------
[ERROR] <https://builds.apache.org/job/Struts-JDK6-master/ws/core/src/main/java/org/apache/struts2/RequestUtils.java>:[122,37]
cannot find symbol
symbol  : method parse(java.lang.String)
location: class org.apache.commons.lang3.time.FastDateFormat
[INFO] 1 error
[INFO] -------------------------------------------------------------
[INFO] ------------------------------------------------------------------------
[INFO] Reactor Summary:
[INFO] 
[INFO] Struts 2 .......................................... SUCCESS [22.051s]
[INFO] XWork: Core ....................................... SUCCESS [43.265s]
[INFO] Struts 2 Core ..................................... FAILURE [12.969s]
[INFO] Struts Plugins .................................... SKIPPED
[INFO] Struts 2 Spring Plugin ............................ SKIPPED
[INFO] Struts 2 Convention Plugin ........................ SKIPPED
[INFO] Struts 2 JUnit Plugin ............................. SKIPPED
[INFO] Struts 2 Webapps .................................. SKIPPED
[INFO] Blank Webapp ...................................... SKIPPED
[INFO] JBoss Blank Webapp ................................ SKIPPED
[INFO] Mail Reader Webapp ................................ SKIPPED
[INFO] Struts 2 Portlet Plugin ........................... SKIPPED
[INFO] Struts 2 DWR Plugin ............................... SKIPPED
[INFO] Struts 2 Tiles Plugin ............................. SKIPPED
[INFO] Struts 2 Portlet Tiles Plugin ..................... SKIPPED
[INFO] Struts 2 Portlet Webapp ........................... SKIPPED
[INFO] Struts 2 Struts 1 Plugin .......................... SKIPPED
[INFO] Struts 2 Dojo Plugin .............................. SKIPPED
[INFO] Struts 2 JSF Plugin ............................... SKIPPED
[INFO] Struts 2 Configuration Browser Plugin ............. SKIPPED
[INFO] Struts 2 Sitemesh Plugin .......................... SKIPPED
[INFO] Struts 2 JSON Plugin .............................. SKIPPED
[INFO] Struts 2 Showcase Webapp .......................... SKIPPED
[INFO] Struts 2 REST Plugin .............................. SKIPPED
[INFO] Struts 2 Rest Showcase Webapp ..................... SKIPPED
[INFO] Struts 2 Codebehind Plugin ........................ SKIPPED
[INFO] Struts 2 Java Templates Plugin .................... SKIPPED
[INFO] Struts 2 Jasper Reports Plugin .................... SKIPPED
[INFO] Struts 2 JFreeChart Plugin ........................ SKIPPED
[INFO] Struts 2 Pell Multipart Plugin .................... SKIPPED
[INFO] Struts 2 Plexus Plugin ............................ SKIPPED
[INFO] Struts 2 Sitegraph Plugin ......................... SKIPPED
[INFO] Struts 2 TestNG Plugin ............................ SKIPPED
[INFO] Struts 2 OVal Plugin .............................. SKIPPED
[INFO] Struts 2 OSGi Plugin .............................. SKIPPED
[INFO] Struts 2 Embedded JSP Plugin ...................... SKIPPED
[INFO] Struts 2 GXP Plugin ............................... SKIPPED
[INFO] Struts 2 CDI Plugin ............................... SKIPPED
[INFO] Struts 2 Tiles 3 Plugin ........................... SKIPPED
[INFO] Struts OSGi Bundles ............................... SKIPPED
[INFO] Struts 2 OSGi Admin Bundle ........................ SKIPPED
[INFO] Struts 2 OSGi Demo Bundle ......................... SKIPPED
[INFO] Struts 2 Maven Archetypes ......................... SKIPPED
[INFO] Struts 2 Archetypes - Angular JS .................. SKIPPED
[INFO] Struts 2 Archetypes - Blank ....................... SKIPPED
[INFO] Struts 2 Archetypes - Blank Convention ............ SKIPPED
[INFO] Struts 2 Archetypes - Database Portlet ............ SKIPPED
[INFO] Struts 2 Archetypes - Plugin ...................... SKIPPED
[INFO] Struts 2 Archetypes - Portlet ..................... SKIPPED
[INFO] Struts 2 Archetypes - Starter ..................... SKIPPED
[INFO] Struts 2 Assembly ................................. SKIPPED
[INFO] ------------------------------------------------------------------------
[INFO] BUILD FAILURE
[INFO] ------------------------------------------------------------------------
[INFO] Total time: 1:27.365s
[INFO] Finished at: Fri Mar 07 00:56:14 UTC 2014
[INFO] Final Memory: 43M/191M
[INFO] ------------------------------------------------------------------------
Waiting for Jenkins to finish collecting data[ERROR] Failed to execute goal org.apache.maven.plugins:maven-compiler-plugin:2.3.2:compile
(default-compile) on project struts2-core: Compilation failure
[ERROR] <https://builds.apache.org/job/Struts-JDK6-master/ws/core/src/main/java/org/apache/struts2/RequestUtils.java>:[122,37]
cannot find symbol
[ERROR] symbol  : method parse(java.lang.String)
[ERROR] location: class org.apache.commons.lang3.time.FastDateFormat
[ERROR] -> [Help 1]
[ERROR] 
[ERROR] To see the full stack trace of the errors, re-run Maven with the -e switch.
[ERROR] Re-run Maven using the -X switch to enable full debug logging.
[ERROR] 
[ERROR] For more information about the errors and possible solutions, please read the following
articles:
[ERROR] [Help 1] http://cwiki.apache.org/confluence/display/MAVEN/MojoFailureException
[ERROR] 
[ERROR] After correcting the problems, you can resume the build with the command
[ERROR]   mvn <goals> -rf :struts2-core

[JENKINS] Archiving <https://builds.apache.org/job/Struts-JDK6-master/ws/plugins/pell-multipart/pom.xml>
to org.apache.struts/struts2-pell-multipart-plugin/2.3.16.1/struts2-pell-multipart-plugin-2.3.16.1.pom
[JENKINS] Archiving <https://builds.apache.org/job/Struts-JDK6-master/ws/plugins/jfreechart/pom.xml>
to org.apache.struts/struts2-jfreechart-plugin/2.3.16.1/struts2-jfreechart-plugin-2.3.16.1.pom
[JENKINS] Archiving <https://builds.apache.org/job/Struts-JDK6-master/ws/plugins/sitemesh/pom.xml>
to org.apache.struts/struts2-sitemesh-plugin/2.3.16.1/struts2-sitemesh-plugin-2.3.16.1.pom
[JENKINS] Archiving <https://builds.apache.org/job/Struts-JDK6-master/ws/archetypes/struts2-archetype-portlet/pom.xml>
to org.apache.struts/struts2-archetype-portlet/2.3.16.1/struts2-archetype-portlet-2.3.16.1.pom
[JENKINS] Archiving <https://builds.apache.org/job/Struts-JDK6-master/ws/bundles/demo/pom.xml>
to org.apache.struts/struts2-osgi-demo-bundle/2.3.16.1/struts2-osgi-demo-bundle-2.3.16.1.pom
[JENKINS] Archiving <https://builds.apache.org/job/Struts-JDK6-master/ws/plugins/portlet-tiles/pom.xml>
to org.apache.struts/struts2-portlet-tiles-plugin/2.3.16.1/struts2-portlet-tiles-plugin-2.3.16.1.pom
[JENKINS] Archiving <https://builds.apache.org/job/Struts-JDK6-master/ws/plugins/jasperreports/pom.xml>
to org.apache.struts/struts2-jasperreports-plugin/2.3.16.1/struts2-jasperreports-plugin-2.3.16.1.pom
[JENKINS] Archiving <https://builds.apache.org/job/Struts-JDK6-master/ws/plugins/oval/pom.xml>
to org.apache.struts/struts2-oval-plugin/2.3.16.1/struts2-oval-plugin-2.3.16.1.pom
[JENKINS] Archiving <https://builds.apache.org/job/Struts-JDK6-master/ws/plugins/tiles3/pom.xml>
to org.apache.struts/struts2-tiles3-plugin/2.3.16.1/struts2-tiles3-plugin-2.3.16.1.pom
[JENKINS] Archiving <https://builds.apache.org/job/Struts-JDK6-master/ws/xwork-core/pom.xml>
to org.apache.struts.xwork/xwork-core/2.3.16.1/xwork-core-2.3.16.1.pom
[JENKINS] Archiving <https://builds.apache.org/job/Struts-JDK6-master/ws/xwork-core/target/xwork-core-2.3.16.1.jar>
to org.apache.struts.xwork/xwork-core/2.3.16.1/xwork-core-2.3.16.1.jar
[JENKINS] Archiving <https://builds.apache.org/job/Struts-JDK6-master/ws/xwork-core/target/xwork-core-2.3.16.1-sources.jar>
to org.apache.struts.xwork/xwork-core/2.3.16.1/xwork-core-2.3.16.1-sources.jar
[JENKINS] Archiving <https://builds.apache.org/job/Struts-JDK6-master/ws/xwork-core/target/xwork-core-2.3.16.1-javadoc.jar>
to org.apache.struts.xwork/xwork-core/2.3.16.1/xwork-core-2.3.16.1-javadoc.jar
[JENKINS] Archiving <https://builds.apache.org/job/Struts-JDK6-master/ws/apps/jboss-blank/pom.xml>
to org.apache.struts/struts2-jboss-blank/2.3.16.1/struts2-jboss-blank-2.3.16.1.pom
[JENKINS] Archiving <https://builds.apache.org/job/Struts-JDK6-master/ws/plugins/cdi/pom.xml>
to org.apache.struts/struts2-cdi-plugin/2.3.16.1/struts2-cdi-plugin-2.3.16.1.pom
[JENKINS] Archiving <https://builds.apache.org/job/Struts-JDK6-master/ws/core/pom.xml>
to org.apache.struts/struts2-core/2.3.16.1/struts2-core-2.3.16.1.pom
[JENKINS] Archiving <https://builds.apache.org/job/Struts-JDK6-master/ws/core/target/struts2-core-2.3.16.1-sources.jar>
to org.apache.struts/struts2-core/2.3.16.1/struts2-core-2.3.16.1-sources.jar
[JENKINS] Archiving <https://builds.apache.org/job/Struts-JDK6-master/ws/core/target/struts2-core-2.3.16.1-javadoc.jar>
to org.apache.struts/struts2-core/2.3.16.1/struts2-core-2.3.16.1-javadoc.jar
[JENKINS] Archiving <https://builds.apache.org/job/Struts-JDK6-master/ws/plugins/tiles/pom.xml>
to org.apache.struts/struts2-tiles-plugin/2.3.16.1/struts2-tiles-plugin-2.3.16.1.pom
[JENKINS] Archiving <https://builds.apache.org/job/Struts-JDK6-master/ws/archetypes/struts2-archetype-dbportlet/pom.xml>
to org.apache.struts/struts2-archetype-dbportlet/2.3.16.1/struts2-archetype-dbportlet-2.3.16.1.pom
[JENKINS] Archiving <https://builds.apache.org/job/Struts-JDK6-master/ws/archetypes/pom.xml>
to org.apache.struts/struts2-archetypes/2.3.16.1/struts2-archetypes-2.3.16.1.pom
[JENKINS] Archiving <https://builds.apache.org/job/Struts-JDK6-master/ws/plugins/embeddedjsp/pom.xml>
to org.apache.struts/struts2-embeddedjsp-plugin/2.3.16.1/struts2-embeddedjsp-plugin-2.3.16.1.pom
[JENKINS] Archiving <https://builds.apache.org/job/Struts-JDK6-master/ws/plugins/javatemplates/pom.xml>
to org.apache.struts/struts2-javatemplates-plugin/2.3.16.1/struts2-javatemplates-plugin-2.3.16.1.pom
[JENKINS] Archiving <https://builds.apache.org/job/Struts-JDK6-master/ws/apps/rest-showcase/pom.xml>
to org.apache.struts/struts2-rest-showcase/2.3.16.1/struts2-rest-showcase-2.3.16.1.pom
[JENKINS] Archiving <https://builds.apache.org/job/Struts-JDK6-master/ws/bundles/admin/pom.xml>
to org.apache.struts/struts2-osgi-admin-bundle/2.3.16.1/struts2-osgi-admin-bundle-2.3.16.1.pom
[JENKINS] Archiving <https://builds.apache.org/job/Struts-JDK6-master/ws/apps/pom.xml>
to org.apache.struts/struts2-apps/2.3.16.1/struts2-apps-2.3.16.1.pom
[JENKINS] Archiving <https://builds.apache.org/job/Struts-JDK6-master/ws/plugins/junit/pom.xml>
to org.apache.struts/struts2-junit-plugin/2.3.16.1/struts2-junit-plugin-2.3.16.1.pom
[JENKINS] Archiving <https://builds.apache.org/job/Struts-JDK6-master/ws/plugins/json/pom.xml>
to org.apache.struts/struts2-json-plugin/2.3.16.1/struts2-json-plugin-2.3.16.1.pom
[JENKINS] Archiving <https://builds.apache.org/job/Struts-JDK6-master/ws/archetypes/struts2-archetype-plugin/pom.xml>
to org.apache.struts/struts2-archetype-plugin/2.3.16.1/struts2-archetype-plugin-2.3.16.1.pom
[JENKINS] Archiving <https://builds.apache.org/job/Struts-JDK6-master/ws/apps/mailreader/pom.xml>
to org.apache.struts/struts2-mailreader/2.3.16.1/struts2-mailreader-2.3.16.1.pom
[JENKINS] Archiving <https://builds.apache.org/job/Struts-JDK6-master/ws/archetypes/struts2-archetype-angularjs/pom.xml>
to org.apache.struts/struts2-archetype-angularjs/2.3.16.1/struts2-archetype-angularjs-2.3.16.1.pom
[JENKINS] Archiving <https://builds.apache.org/job/Struts-JDK6-master/ws/plugins/plexus/pom.xml>
to org.apache.struts/struts2-plexus-plugin/2.3.16.1/struts2-plexus-plugin-2.3.16.1.pom
[JENKINS] Archiving <https://builds.apache.org/job/Struts-JDK6-master/ws/plugins/jsf/pom.xml>
to org.apache.struts/struts2-jsf-plugin/2.3.16.1/struts2-jsf-plugin-2.3.16.1.pom
[JENKINS] Archiving <https://builds.apache.org/job/Struts-JDK6-master/ws/plugins/config-browser/pom.xml>
to org.apache.struts/struts2-config-browser-plugin/2.3.16.1/struts2-config-browser-plugin-2.3.16.1.pom
[JENKINS] Archiving <https://builds.apache.org/job/Struts-JDK6-master/ws/plugins/struts1/pom.xml>
to org.apache.struts/struts2-struts1-plugin/2.3.16.1/struts2-struts1-plugin-2.3.16.1.pom
[JENKINS] Archiving <https://builds.apache.org/job/Struts-JDK6-master/ws/archetypes/struts2-archetype-blank/pom.xml>
to org.apache.struts/struts2-archetype-blank/2.3.16.1/struts2-archetype-blank-2.3.16.1.pom
[JENKINS] Archiving <https://builds.apache.org/job/Struts-JDK6-master/ws/plugins/gxp/pom.xml>
to org.apache.struts/struts2-gxp-plugin/2.3.16.1/struts2-gxp-plugin-2.3.16.1.pom
[JENKINS] Archiving <https://builds.apache.org/job/Struts-JDK6-master/ws/plugins/convention/pom.xml>
to org.apache.struts/struts2-convention-plugin/2.3.16.1/struts2-convention-plugin-2.3.16.1.pom
[JENKINS] Archiving <https://builds.apache.org/job/Struts-JDK6-master/ws/bundles/pom.xml>
to org.apache.struts/struts2-osgi-bundles/2.3.16.1/struts2-osgi-bundles-2.3.16.1.pom
[JENKINS] Archiving <https://builds.apache.org/job/Struts-JDK6-master/ws/pom.xml> to
org.apache.struts/struts2-parent/2.3.16.1/struts2-parent-2.3.16.1.pom
[JENKINS] Archiving <https://builds.apache.org/job/Struts-JDK6-master/ws/target/struts2-parent-2.3.16.1-site.xml>
to org.apache.struts/struts2-parent/2.3.16.1/struts2-parent-2.3.16.1-site.xml
[JENKINS] Archiving <https://builds.apache.org/job/Struts-JDK6-master/ws/plugins/osgi/pom.xml>
to org.apache.struts/struts2-osgi-plugin/2.3.16.1/struts2-osgi-plugin-2.3.16.1.pom
[JENKINS] Archiving <https://builds.apache.org/job/Struts-JDK6-master/ws/assembly/pom.xml>
to org.apache.struts/struts2-assembly/2.3.16.1/struts2-assembly-2.3.16.1.pom
[JENKINS] Archiving <https://builds.apache.org/job/Struts-JDK6-master/ws/apps/showcase/pom.xml>
to org.apache.struts/struts2-showcase/2.3.16.1/struts2-showcase-2.3.16.1.pom
[JENKINS] Archiving <https://builds.apache.org/job/Struts-JDK6-master/ws/plugins/dojo/pom.xml>
to org.apache.struts/struts2-dojo-plugin/2.3.16.1/struts2-dojo-plugin-2.3.16.1.pom
[JENKINS] Archiving <https://builds.apache.org/job/Struts-JDK6-master/ws/plugins/rest/pom.xml>
to org.apache.struts/struts2-rest-plugin/2.3.16.1/struts2-rest-plugin-2.3.16.1.pom
[JENKINS] Archiving <https://builds.apache.org/job/Struts-JDK6-master/ws/archetypes/struts2-archetype-convention/pom.xml>
to org.apache.struts/struts2-archetype-convention/2.3.16.1/struts2-archetype-convention-2.3.16.1.pom
[JENKINS] Archiving <https://builds.apache.org/job/Struts-JDK6-master/ws/plugins/pom.xml>
to org.apache.struts/struts2-plugins/2.3.16.1/struts2-plugins-2.3.16.1.pom
[JENKINS] Archiving <https://builds.apache.org/job/Struts-JDK6-master/ws/plugins/sitegraph/pom.xml>
to org.apache.struts/struts2-sitegraph-plugin/2.3.16.1/struts2-sitegraph-plugin-2.3.16.1.pom
[JENKINS] Archiving <https://builds.apache.org/job/Struts-JDK6-master/ws/apps/portlet/pom.xml>
to org.apache.struts/struts2-portlet/2.3.16.1/struts2-portlet-2.3.16.1.pom
[JENKINS] Archiving <https://builds.apache.org/job/Struts-JDK6-master/ws/plugins/testng/pom.xml>
to org.apache.struts/struts2-testng-plugin/2.3.16.1/struts2-testng-plugin-2.3.16.1.pom
[JENKINS] Archiving <https://builds.apache.org/job/Struts-JDK6-master/ws/plugins/codebehind/pom.xml>
to org.apache.struts/struts2-codebehind-plugin/2.3.16.1/struts2-codebehind-plugin-2.3.16.1.pom
[JENKINS] Archiving <https://builds.apache.org/job/Struts-JDK6-master/ws/plugins/dwr/pom.xml>
to org.apache.struts/struts2-dwr-plugin/2.3.16.1/struts2-dwr-plugin-2.3.16.1.pom
[JENKINS] Archiving <https://builds.apache.org/job/Struts-JDK6-master/ws/plugins/portlet/pom.xml>
to org.apache.struts/struts2-portlet-plugin/2.3.16.1/struts2-portlet-plugin-2.3.16.1.pom
[JENKINS] Archiving <https://builds.apache.org/job/Struts-JDK6-master/ws/plugins/spring/pom.xml>
to org.apache.struts/struts2-spring-plugin/2.3.16.1/struts2-spring-plugin-2.3.16.1.pom
[JENKINS] Archiving <https://builds.apache.org/job/Struts-JDK6-master/ws/apps/blank/pom.xml>
to org.apache.struts/struts2-blank/2.3.16.1/struts2-blank-2.3.16.1.pom
[JENKINS] Archiving <https://builds.apache.org/job/Struts-JDK6-master/ws/archetypes/struts2-archetype-starter/pom.xml>
to org.apache.struts/struts2-archetype-starter/2.3.16.1/struts2-archetype-starter-2.3.16.1.pom
channel stopped
[locks-and-latches] Releasing all the locks
[locks-and-latches] All the locks released

---------------------------------------------------------------------
To unsubscribe, e-mail: dev-unsubscribe@struts.apache.org
For additional commands, e-mail: dev-help@struts.apache.org


Mime
View raw message