struts-dev mailing list archives

Site index · List index
Message view « Date » · « Thread »
Top « Date » · « Thread »
From Apache Jenkins Server <jenk...@builds.apache.org>
Subject Build failed in Jenkins: Struts2-JDK6 #850
Date Sat, 30 Nov 2013 11:41:31 GMT
See <https://builds.apache.org/job/Struts2-JDK6/850/changes>

Changes:

[Lukasz Lenart] Updates version of archetypes to match the release

------------------------------------------
[...truncated 13892 lines...]
Generating <https://builds.apache.org/job/Struts2-JDK6/ws/struts2/plugins/json/target/apidocs/org/apache/struts2/json/smd//package-frame.html...>
Generating <https://builds.apache.org/job/Struts2-JDK6/ws/struts2/plugins/json/target/apidocs/org/apache/struts2/json/smd//package-summary.html...>
Generating <https://builds.apache.org/job/Struts2-JDK6/ws/struts2/plugins/json/target/apidocs/org/apache/struts2/json/smd//package-tree.html...>
Generating <https://builds.apache.org/job/Struts2-JDK6/ws/struts2/plugins/json/target/apidocs/constant-values.html...>
Generating <https://builds.apache.org/job/Struts2-JDK6/ws/struts2/plugins/json/target/apidocs/serialized-form.html...>
Generating <https://builds.apache.org/job/Struts2-JDK6/ws/struts2/plugins/json/target/apidocs/org/apache/struts2/json//class-use/SerializationParams.html...>
Generating <https://builds.apache.org/job/Struts2-JDK6/ws/struts2/plugins/json/target/apidocs/org/apache/struts2/json//class-use/JSONInterceptor.html...>
Generating <https://builds.apache.org/job/Struts2-JDK6/ws/struts2/plugins/json/target/apidocs/org/apache/struts2/json//class-use/JSONPopulator.html...>
Generating <https://builds.apache.org/job/Struts2-JDK6/ws/struts2/plugins/json/target/apidocs/org/apache/struts2/json//class-use/JSONException.html...>
Generating <https://builds.apache.org/job/Struts2-JDK6/ws/struts2/plugins/json/target/apidocs/org/apache/struts2/json//class-use/JSONUtil.html...>
Generating <https://builds.apache.org/job/Struts2-JDK6/ws/struts2/plugins/json/target/apidocs/org/apache/struts2/json//class-use/JSONUtil.ClassVisitor.html...>
Generating <https://builds.apache.org/job/Struts2-JDK6/ws/struts2/plugins/json/target/apidocs/org/apache/struts2/json//class-use/JSONReader.html...>
Generating <https://builds.apache.org/job/Struts2-JDK6/ws/struts2/plugins/json/target/apidocs/org/apache/struts2/json//class-use/JSONResult.html...>
Generating <https://builds.apache.org/job/Struts2-JDK6/ws/struts2/plugins/json/target/apidocs/org/apache/struts2/json//class-use/JSONValidationInterceptor.html...>
Generating <https://builds.apache.org/job/Struts2-JDK6/ws/struts2/plugins/json/target/apidocs/org/apache/struts2/json//class-use/JSONWriter.html...>
Generating <https://builds.apache.org/job/Struts2-JDK6/ws/struts2/plugins/json/target/apidocs/org/apache/struts2/json//class-use/JSONWriter.JSONAnnotationFinder.html...>
Generating <https://builds.apache.org/job/Struts2-JDK6/ws/struts2/plugins/json/target/apidocs/org/apache/struts2/json//class-use/JSONCleaner.html...>
Generating <https://builds.apache.org/job/Struts2-JDK6/ws/struts2/plugins/json/target/apidocs/org/apache/struts2/json//class-use/JSONCleaner.Filter.html...>
Generating <https://builds.apache.org/job/Struts2-JDK6/ws/struts2/plugins/json/target/apidocs/org/apache/struts2/json/rpc//class-use/RPCResponse.html...>
Generating <https://builds.apache.org/job/Struts2-JDK6/ws/struts2/plugins/json/target/apidocs/org/apache/struts2/json/rpc//class-use/RPCError.html...>
Generating <https://builds.apache.org/job/Struts2-JDK6/ws/struts2/plugins/json/target/apidocs/org/apache/struts2/json/rpc//class-use/RPCErrorCode.html...>
Generating <https://builds.apache.org/job/Struts2-JDK6/ws/struts2/plugins/json/target/apidocs/org/apache/struts2/json/bridge//class-use/FieldBridge.html...>
Generating <https://builds.apache.org/job/Struts2-JDK6/ws/struts2/plugins/json/target/apidocs/org/apache/struts2/json/bridge//class-use/ParameterizedBridge.html...>
Generating <https://builds.apache.org/job/Struts2-JDK6/ws/struts2/plugins/json/target/apidocs/org/apache/struts2/json/bridge//class-use/StringBridge.html...>
Generating <https://builds.apache.org/job/Struts2-JDK6/ws/struts2/plugins/json/target/apidocs/org/apache/struts2/json/smd//class-use/SMDMethod.html...>
Generating <https://builds.apache.org/job/Struts2-JDK6/ws/struts2/plugins/json/target/apidocs/org/apache/struts2/json/smd//class-use/SMDGenerator.html...>
Generating <https://builds.apache.org/job/Struts2-JDK6/ws/struts2/plugins/json/target/apidocs/org/apache/struts2/json/smd//class-use/SMDMethodParameter.html...>
Generating <https://builds.apache.org/job/Struts2-JDK6/ws/struts2/plugins/json/target/apidocs/org/apache/struts2/json/smd//class-use/SMD.html...>
Generating <https://builds.apache.org/job/Struts2-JDK6/ws/struts2/plugins/json/target/apidocs/org/apache/struts2/json/annotations//class-use/JSONFieldBridge.html...>
Generating <https://builds.apache.org/job/Struts2-JDK6/ws/struts2/plugins/json/target/apidocs/org/apache/struts2/json/annotations//class-use/JSON.html...>
Generating <https://builds.apache.org/job/Struts2-JDK6/ws/struts2/plugins/json/target/apidocs/org/apache/struts2/json/annotations//class-use/JSONParameter.html...>
Generating <https://builds.apache.org/job/Struts2-JDK6/ws/struts2/plugins/json/target/apidocs/org/apache/struts2/json/annotations//class-use/SMDMethod.html...>
Generating <https://builds.apache.org/job/Struts2-JDK6/ws/struts2/plugins/json/target/apidocs/org/apache/struts2/json/annotations//class-use/SMDMethodParameter.html...>
Generating <https://builds.apache.org/job/Struts2-JDK6/ws/struts2/plugins/json/target/apidocs/org/apache/struts2/json/annotations//class-use/SMD.html...>
Generating <https://builds.apache.org/job/Struts2-JDK6/ws/struts2/plugins/json/target/apidocs/org/apache/struts2/json//package-use.html...>
Generating <https://builds.apache.org/job/Struts2-JDK6/ws/struts2/plugins/json/target/apidocs/org/apache/struts2/json/annotations//package-use.html...>
Generating <https://builds.apache.org/job/Struts2-JDK6/ws/struts2/plugins/json/target/apidocs/org/apache/struts2/json/bridge//package-use.html...>
Generating <https://builds.apache.org/job/Struts2-JDK6/ws/struts2/plugins/json/target/apidocs/org/apache/struts2/json/rpc//package-use.html...>
Generating <https://builds.apache.org/job/Struts2-JDK6/ws/struts2/plugins/json/target/apidocs/org/apache/struts2/json/smd//package-use.html...>
Building index for all the packages and classes...
Generating <https://builds.apache.org/job/Struts2-JDK6/ws/struts2/plugins/json/target/apidocs/overview-tree.html...>
Generating <https://builds.apache.org/job/Struts2-JDK6/ws/struts2/plugins/json/target/apidocs/index-all.html...>
Generating <https://builds.apache.org/job/Struts2-JDK6/ws/struts2/plugins/json/target/apidocs/deprecated-list.html...>
Building index for all classes...
Generating <https://builds.apache.org/job/Struts2-JDK6/ws/struts2/plugins/json/target/apidocs/allclasses-frame.html...>
Generating <https://builds.apache.org/job/Struts2-JDK6/ws/struts2/plugins/json/target/apidocs/allclasses-noframe.html...>
Generating <https://builds.apache.org/job/Struts2-JDK6/ws/struts2/plugins/json/target/apidocs/index.html...>
Generating <https://builds.apache.org/job/Struts2-JDK6/ws/struts2/plugins/json/target/apidocs/overview-summary.html...>
Generating <https://builds.apache.org/job/Struts2-JDK6/ws/struts2/plugins/json/target/apidocs/help-doc.html...>
Generating <https://builds.apache.org/job/Struts2-JDK6/ws/struts2/plugins/json/target/apidocs/stylesheet.css...>
1 warning
[WARNING] Javadoc Warnings
[WARNING] <https://builds.apache.org/job/Struts2-JDK6/ws/struts2/plugins/json/src/main/java/org/apache/struts2/json/JSONUtil.java>:276:
warning - @SMDMethod is an unknown tag.
[INFO] Building jar: <https://builds.apache.org/job/Struts2-JDK6/ws/struts2/plugins/json/target/struts2-json-plugin-2.3.16-SNAPSHOT-javadoc.jar>
[INFO] 
[INFO] --- maven-remote-resources-plugin:1.2.1:process (default) @ struts2-json-plugin ---
[INFO] 
[INFO] --- maven-resources-plugin:2.5:resources (default-resources) @ struts2-json-plugin
---
[debug] execute contextualize
[INFO] Using 'UTF-8' encoding to copy filtered resources.
[INFO] Copying 3 resources
[INFO] Copying 3 resources
[INFO] 
[INFO] --- maven-compiler-plugin:2.3.2:compile (default-compile) @ struts2-json-plugin ---
[INFO] Compiling 26 source files to <https://builds.apache.org/job/Struts2-JDK6/ws/struts2/plugins/json/target/classes>
[INFO] 
[INFO] --- maven-bundle-plugin:2.1.0:manifest (bundle-manifest) @ struts2-json-plugin ---
[WARNING] Warning in manifest for org.apache.struts:struts2-json-plugin:jar:2.3.16-SNAPSHOT
: Superfluous export-package instructions: [org.apache, org.apache.struts2, org]
[INFO] 
[INFO] --- maven-resources-plugin:2.5:testResources (default-testResources) @ struts2-json-plugin
---
[debug] execute contextualize
[INFO] Using 'UTF-8' encoding to copy filtered resources.
[INFO] Copying 41 resources
[INFO] Copying 3 resources
[INFO] 
[INFO] --- maven-compiler-plugin:2.3.2:testCompile (default-testCompile) @ struts2-json-plugin
---
[INFO] Compiling 27 source files to <https://builds.apache.org/job/Struts2-JDK6/ws/struts2/plugins/json/target/test-classes>
[INFO] 
[INFO] --- maven-surefire-plugin:2.3.1:test (default-test) @ struts2-json-plugin ---
[INFO] Surefire report directory: <https://builds.apache.org/job/Struts2-JDK6/ws/struts2/plugins/json/target/surefire-reports>

-------------------------------------------------------
 T E S T S
-------------------------------------------------------
Running org.apache.struts2.json.JSONUtilTest
Tests run: 1, Failures: 0, Errors: 0, Skipped: 0, Time elapsed: 0.028 sec
Running org.apache.struts2.json.JSONWriterTest
Tests run: 3, Failures: 0, Errors: 0, Skipped: 0, Time elapsed: 0.796 sec
Running org.apache.struts2.json.JSONReaderTest
Tests run: 4, Failures: 0, Errors: 0, Skipped: 0, Time elapsed: 0.008 sec
Running org.apache.struts2.json.JSONEnumTest
Tests run: 2, Failures: 0, Errors: 0, Skipped: 0, Time elapsed: 0.006 sec
Running org.apache.struts2.json.JSONValidationInterceptorTest
Tests run: 3, Failures: 0, Errors: 0, Skipped: 0, Time elapsed: 0.431 sec
Running org.apache.struts2.json.JSONCleanerTest
Tests run: 4, Failures: 0, Errors: 0, Skipped: 0, Time elapsed: 0.006 sec
Running org.apache.struts2.json.JSONInterceptorTest
SEVERE:   [41:58.205] Request with content type of 'application/json-rpc' was received but
SMD is not enabled for this interceptor. Set 'enableSMD' to true to enable it
SEVERE:   [41:58.269] Method doSomething could not be found in action class.
SEVERE:   [41:58.406] 'method' is required for JSON RPC
SEVERE:   [41:58.460] Method methodWithoutAnnotation could not be found in action class.
Tests run: 17, Failures: 0, Errors: 0, Skipped: 0, Time elapsed: 1.132 sec
Running org.apache.struts2.json.SMDMethodInterfaceTest
Tests run: 3, Failures: 0, Errors: 0, Skipped: 0, Time elapsed: 0.007 sec
Running org.apache.struts2.json.JSONResultTest
Tests run: 24, Failures: 0, Errors: 0, Skipped: 0, Time elapsed: 0.969 sec
Running org.apache.struts2.json.JSONPopulatorTest
Tests run: 6, Failures: 0, Errors: 0, Skipped: 0, Time elapsed: 0.01 sec

Results :

Tests run: 67, Failures: 0, Errors: 0, Skipped: 0

[JENKINS] Recording test results
[INFO] 
[INFO] --- maven-jar-plugin:2.3.1:jar (default-jar) @ struts2-json-plugin ---
[INFO] Building jar: <https://builds.apache.org/job/Struts2-JDK6/ws/struts2/plugins/json/target/struts2-json-plugin-2.3.16-SNAPSHOT.jar>
[WARNING] Failed to getClass for org.apache.maven.plugin.source.SourceJarMojo
[INFO] 
[INFO] --- maven-source-plugin:2.1.2:jar (attach-source) @ struts2-json-plugin ---
[INFO] META-INF already added, skipping
[INFO] META-INF already added, skipping
[INFO] META-INF/NOTICE already added, skipping
[INFO] META-INF/LICENSE already added, skipping
[INFO] META-INF/DEPENDENCIES already added, skipping
[INFO] Building jar: <https://builds.apache.org/job/Struts2-JDK6/ws/struts2/plugins/json/target/struts2-json-plugin-2.3.16-SNAPSHOT-sources.jar>
[INFO] META-INF already added, skipping
[INFO] META-INF already added, skipping
[INFO] META-INF/NOTICE already added, skipping
[INFO] META-INF/LICENSE already added, skipping
[INFO] META-INF/DEPENDENCIES already added, skipping
[WARNING] Artifact org.apache.struts:struts2-json-plugin:java-source:sources:2.3.16-SNAPSHOT
already attached to project, ignoring duplicate
[INFO] 
[INFO] --- maven-site-plugin:3.1:attach-descriptor (attach-descriptor) @ struts2-json-plugin
---
[INFO] 
[INFO] --- maven-install-plugin:2.3.1:install (default-install) @ struts2-json-plugin ---
[INFO] Installing <https://builds.apache.org/job/Struts2-JDK6/ws/struts2/plugins/json/target/struts2-json-plugin-2.3.16-SNAPSHOT.jar>
to /home/jenkins/jenkins-slave/maven-repositories/1/org/apache/struts/struts2-json-plugin/2.3.16-SNAPSHOT/struts2-json-plugin-2.3.16-SNAPSHOT.jar
[INFO] Installing <https://builds.apache.org/job/Struts2-JDK6/ws/struts2/plugins/json/pom.xml>
to /home/jenkins/jenkins-slave/maven-repositories/1/org/apache/struts/struts2-json-plugin/2.3.16-SNAPSHOT/struts2-json-plugin-2.3.16-SNAPSHOT.pom
[INFO] Installing <https://builds.apache.org/job/Struts2-JDK6/ws/struts2/plugins/json/target/struts2-json-plugin-2.3.16-SNAPSHOT-sources.jar>
to /home/jenkins/jenkins-slave/maven-repositories/1/org/apache/struts/struts2-json-plugin/2.3.16-SNAPSHOT/struts2-json-plugin-2.3.16-SNAPSHOT-sources.jar
[INFO] Installing <https://builds.apache.org/job/Struts2-JDK6/ws/struts2/plugins/json/target/struts2-json-plugin-2.3.16-SNAPSHOT-javadoc.jar>
to /home/jenkins/jenkins-slave/maven-repositories/1/org/apache/struts/struts2-json-plugin/2.3.16-SNAPSHOT/struts2-json-plugin-2.3.16-SNAPSHOT-javadoc.jar
Build timed out (after 85 minutes). Marking the build as failed.
[INFO] ------------------------------------------------------------------------
[INFO] Reactor Summary:
[INFO] 
[INFO] Struts 2 .......................................... SUCCESS [27.639s]
[INFO] XWork: Core ....................................... SUCCESS [53.343s]
[INFO] Struts 2 Core ..................................... SUCCESS [1:21.572s]
[INFO] Struts Plugins .................................... SUCCESS [9.945s]
[INFO] Struts 2 Spring Plugin ............................ SUCCESS [11.940s]
[INFO] Struts 2 Convention Plugin ........................ SUCCESS [16.392s]
[INFO] Struts 2 JUnit Plugin ............................. SUCCESS [13.811s]
[INFO] Webapps ........................................... SUCCESS [7.553s]
[INFO] Blank Webapp ...................................... SUCCESS [13.240s]
[INFO] JBoss Blank Webapp ................................ SUCCESS [12.985s]
[INFO] Mail Reader Webapp ................................ SUCCESS [10.117s]
[INFO] Struts 2 Portlet Plugin ........................... SUCCESS [16.542s]
[INFO] Struts 2 DWR Plugin ............................... SUCCESS [9.879s]
[INFO] Struts 2 Tiles Plugin ............................. SUCCESS [8.951s]
[INFO] Struts 2 Portlet Tiles Plugin ..................... SUCCESS [8.399s]
[INFO] Portlet Webapp .................................... SUCCESS [25.599s]
[INFO] Struts 2 Struts 1 Plugin .......................... SUCCESS [11.674s]
[INFO] Struts 2 Dojo Plugin .............................. SUCCESS [23.443s]
[INFO] Struts 2 JSF Plugin ............................... SUCCESS [9.227s]
[INFO] Struts 2 Configuration Browser Plugin ............. SUCCESS [8.862s]
[INFO] Struts 2 Sitemesh Plugin .......................... SUCCESS [10.924s]
[INFO] Struts 2 JSON Plugin .............................. FAILURE [3:28.969s]
[INFO] Showcase Webapp ................................... SKIPPED
[INFO] Struts 2 REST Plugin .............................. SKIPPED
[INFO] Struts 2 Rest Showcase Example .................... SKIPPED
[INFO] Struts 2 Codebehind Plugin ........................ SKIPPED
[INFO] Struts 2 Java Templates Plugin .................... SKIPPED
[INFO] Struts 2 Jasper Reports Plugin .................... SKIPPED
[INFO] Struts 2 JFreeChart Plugin ........................ SKIPPED
[INFO] Struts 2 Pell Multipart Plugin .................... SKIPPED
[INFO] Struts 2 Plexus Plugin ............................ SKIPPED
[INFO] Struts 2 Sitegraph Plugin ......................... SKIPPED
[INFO] Struts 2 TestNG Plugin ............................ SKIPPED
[INFO] Struts 2 OVal Plugin .............................. SKIPPED
[INFO] Struts 2 OSGi Plugin .............................. SKIPPED
[INFO] Struts 2 Embedded JSP Plugin ...................... SKIPPED
[INFO] Struts 2 GXP Plugin ............................... SKIPPED
[INFO] Struts 2 CDI Plugin ............................... SKIPPED
[INFO] Struts 2 Tiles 3 Plugin ........................... SKIPPED
[INFO] Struts OSGi Bundles ............................... SKIPPED
[INFO] Struts 2 OSGi Admin Bundle ........................ SKIPPED
[INFO] Struts 2 OSGi Demo Bundle ......................... SKIPPED
[INFO] Struts 2 Maven Archetypes ......................... SKIPPED
[INFO] Struts 2 Archetypes - Angular JS .................. SKIPPED
[INFO] Struts 2 Archetypes - Blank ....................... SKIPPED
[INFO] Struts 2 Archetypes - Blank Convention ............ SKIPPED
[INFO] Struts 2 Archetypes - Database Portlet ............ SKIPPED
[INFO] Struts 2 Archetypes - Plugin ...................... SKIPPED
[INFO] Struts 2 Archetypes - Portlet ..................... SKIPPED
[INFO] Struts 2 Archetypes - Starter ..................... SKIPPED
[INFO] ------------------------------------------------------------------------
[INFO] BUILD FAILURE
[INFO] ------------------------------------------------------------------------
[INFO] Total time: 1:24:09.845s
[INFO] Finished at: Sat Nov 30 10:45:12 UTC 2013
[INFO] Final Memory: 92M/182M
[INFO] ------------------------------------------------------------------------
[ERROR] Internal error: java.lang.IllegalStateException: Unable to call isArchivingDisabled.
Invalid object ID 43 -> [Help 1]
org.apache.maven.InternalErrorException: Internal error: java.lang.IllegalStateException:
Unable to call isArchivingDisabled. Invalid object ID 43
	at org.apache.maven.DefaultMaven.execute(DefaultMaven.java:168)
	at org.jvnet.hudson.maven3.launcher.Maven3Launcher.main(Maven3Launcher.java:117)
	at sun.reflect.NativeMethodAccessorImpl.invoke0(Native Method)
	at sun.reflect.NativeMethodAccessorImpl.invoke(NativeMethodAccessorImpl.java:39)
	at sun.reflect.DelegatingMethodAccessorImpl.invoke(DelegatingMethodAccessorImpl.java:25)
	at java.lang.reflect.Method.invoke(Method.java:597)
	at org.codehaus.plexus.classworlds.launcher.Launcher.launchStandard(Launcher.java:329)
	at org.codehaus.plexus.classworlds.launcher.Launcher.launch(Launcher.java:239)
	at org.jvnet.hudson.maven3.agent.Maven3Main.launch(Maven3Main.java:178)
	at sun.reflect.NativeMethodAccessorImpl.invoke0(Native Method)
	at sun.reflect.NativeMethodAccessorImpl.invoke(NativeMethodAccessorImpl.java:39)
	at sun.reflect.DelegatingMethodAccessorImpl.invoke(DelegatingMethodAccessorImpl.java:25)
	at java.lang.reflect.Method.invoke(Method.java:597)
	at hudson.maven.Maven3Builder.call(Maven3Builder.java:134)
	at hudson.maven.Maven3Builder.call(Maven3Builder.java:69)
	at hudson.remoting.UserRequest.perform(UserRequest.java:118)
	at hudson.remoting.UserRequest.perform(UserRequest.java:48)
	at hudson.remoting.Request$2.run(Request.java:328)
	at hudson.remoting.InterceptingExecutorService$1.call(InterceptingExecutorService.java:72)
	at java.util.concurrent.FutureTask$Sync.innerRun(FutureTask.java:303)
	at java.util.concurrent.FutureTask.run(FutureTask.java:138)
	at java.util.concurrent.ThreadPoolExecutor$Worker.runTask(ThreadPoolExecutor.java:895)
	at java.util.concurrent.ThreadPoolExecutor$Worker.run(ThreadPoolExecutor.java:918)
	at java.lang.Thread.run(Thread.java:662)
Caused by: java.lang.IllegalStateException: Unable to call isArchivingDisabled. Invalid object
ID 43
	at hudson.remoting.RemoteInvocationHandler$RPCRequest.perform(RemoteInvocationHandler.java:293)
	at hudson.remoting.RemoteInvocationHandler$RPCRequest.call(RemoteInvocationHandler.java:280)
	at hudson.remoting.RemoteInvocationHandler$RPCRequest.call(RemoteInvocationHandler.java:239)
	at hudson.remoting.UserRequest.perform(UserRequest.java:118)
	at hudson.remoting.UserRequest.perform(UserRequest.java:48)
	at hudson.remoting.Request$2.run(Request.java:328)
	at hudson.remoting.InterceptingExecutorService$1.call(InterceptingExecutorService.java:72)
	at java.util.concurrent.FutureTask$Sync.innerRun(FutureTask.java:334)
	at java.util.concurrent.FutureTask.run(FutureTask.java:166)
	at java.util.concurrent.ThreadPoolExecutor.runWorker(ThreadPoolExecutor.java:1145)
	at java.util.concurrent.ThreadPoolExecutor$Worker.run(ThreadPoolExecutor.java:615)
	at java.lang.Thread.run(Thread.java:724)
[ERROR] 
[ERROR] To see the full stack trace of the errors, re-run Maven with the -e switch.
[ERROR] Re-run Maven using the -X switch to enable full debug logging.
[ERROR] 
[ERROR] For more information about the errors and possible solutions, please read the following
articles:
[ERROR] [Help 1] http://cwiki.apache.org/confluence/display/MAVEN/InternalErrorException
channel stopped
[locks-and-latches] Releasing all the locks
[locks-and-latches] All the locks released

---------------------------------------------------------------------
To unsubscribe, e-mail: dev-unsubscribe@struts.apache.org
For additional commands, e-mail: dev-help@struts.apache.org


Mime
View raw message