struts-dev mailing list archives

Site index · List index
Message view « Date » · « Thread »
Top « Date » · « Thread »
From Apache Jenkins Server <jenk...@builds.apache.org>
Subject Build failed in Jenkins: Struts2-JDK6 #845
Date Mon, 18 Nov 2013 18:10:53 GMT
See <https://builds.apache.org/job/Struts2-JDK6/845/changes>

Changes:

[Lukasz Lenart] WW-4243 Renames based test case class to avoid using it outside of core

------------------------------------------
[...truncated 12214 lines...]
Building tree for all the packages and classes...
Generating <https://builds.apache.org/job/Struts2-JDK6/ws/struts2/apps/mailreader/target/apidocs/mailreader2//ApplicationListener.html...>
Generating <https://builds.apache.org/job/Struts2-JDK6/ws/struts2/apps/mailreader/target/apidocs/mailreader2//AuthenticationInterceptor.html...>
Generating <https://builds.apache.org/job/Struts2-JDK6/ws/struts2/apps/mailreader/target/apidocs/mailreader2//Constants.html...>
Generating <https://builds.apache.org/job/Struts2-JDK6/ws/struts2/apps/mailreader/target/apidocs/mailreader2//Login.html...>
Generating <https://builds.apache.org/job/Struts2-JDK6/ws/struts2/apps/mailreader/target/apidocs/mailreader2//Logout.html...>
Generating <https://builds.apache.org/job/Struts2-JDK6/ws/struts2/apps/mailreader/target/apidocs/mailreader2//MailreaderSupport.html...>
Generating <https://builds.apache.org/job/Struts2-JDK6/ws/struts2/apps/mailreader/target/apidocs/mailreader2//Registration.html...>
Generating <https://builds.apache.org/job/Struts2-JDK6/ws/struts2/apps/mailreader/target/apidocs/mailreader2//Subscription.html...>
Generating <https://builds.apache.org/job/Struts2-JDK6/ws/struts2/apps/mailreader/target/apidocs/mailreader2//Welcome.html...>
Generating <https://builds.apache.org/job/Struts2-JDK6/ws/struts2/apps/mailreader/target/apidocs/mailreader2//package-frame.html...>
Generating <https://builds.apache.org/job/Struts2-JDK6/ws/struts2/apps/mailreader/target/apidocs/mailreader2//package-summary.html...>
Generating <https://builds.apache.org/job/Struts2-JDK6/ws/struts2/apps/mailreader/target/apidocs/mailreader2//package-tree.html...>
Generating <https://builds.apache.org/job/Struts2-JDK6/ws/struts2/apps/mailreader/target/apidocs/constant-values.html...>
Generating <https://builds.apache.org/job/Struts2-JDK6/ws/struts2/apps/mailreader/target/apidocs/serialized-form.html...>
Generating <https://builds.apache.org/job/Struts2-JDK6/ws/struts2/apps/mailreader/target/apidocs/mailreader2//class-use/Login.html...>
Generating <https://builds.apache.org/job/Struts2-JDK6/ws/struts2/apps/mailreader/target/apidocs/mailreader2//class-use/AuthenticationInterceptor.html...>
Generating <https://builds.apache.org/job/Struts2-JDK6/ws/struts2/apps/mailreader/target/apidocs/mailreader2//class-use/Constants.html...>
Generating <https://builds.apache.org/job/Struts2-JDK6/ws/struts2/apps/mailreader/target/apidocs/mailreader2//class-use/ApplicationListener.html...>
Generating <https://builds.apache.org/job/Struts2-JDK6/ws/struts2/apps/mailreader/target/apidocs/mailreader2//class-use/Welcome.html...>
Generating <https://builds.apache.org/job/Struts2-JDK6/ws/struts2/apps/mailreader/target/apidocs/mailreader2//class-use/Logout.html...>
Generating <https://builds.apache.org/job/Struts2-JDK6/ws/struts2/apps/mailreader/target/apidocs/mailreader2//class-use/MailreaderSupport.html...>
Generating <https://builds.apache.org/job/Struts2-JDK6/ws/struts2/apps/mailreader/target/apidocs/mailreader2//class-use/Subscription.html...>
Generating <https://builds.apache.org/job/Struts2-JDK6/ws/struts2/apps/mailreader/target/apidocs/mailreader2//class-use/Registration.html...>
Generating <https://builds.apache.org/job/Struts2-JDK6/ws/struts2/apps/mailreader/target/apidocs/mailreader2//package-use.html...>
Building index for all the packages and classes...
Generating <https://builds.apache.org/job/Struts2-JDK6/ws/struts2/apps/mailreader/target/apidocs/overview-tree.html...>
Generating <https://builds.apache.org/job/Struts2-JDK6/ws/struts2/apps/mailreader/target/apidocs/index-all.html...>
Generating <https://builds.apache.org/job/Struts2-JDK6/ws/struts2/apps/mailreader/target/apidocs/deprecated-list.html...>
Building index for all classes...
Generating <https://builds.apache.org/job/Struts2-JDK6/ws/struts2/apps/mailreader/target/apidocs/allclasses-frame.html...>
Generating <https://builds.apache.org/job/Struts2-JDK6/ws/struts2/apps/mailreader/target/apidocs/allclasses-noframe.html...>
Generating <https://builds.apache.org/job/Struts2-JDK6/ws/struts2/apps/mailreader/target/apidocs/index.html...>
Generating <https://builds.apache.org/job/Struts2-JDK6/ws/struts2/apps/mailreader/target/apidocs/help-doc.html...>
Generating <https://builds.apache.org/job/Struts2-JDK6/ws/struts2/apps/mailreader/target/apidocs/stylesheet.css...>
[INFO] Building jar: <https://builds.apache.org/job/Struts2-JDK6/ws/struts2/apps/mailreader/target/struts2-mailreader-javadoc.jar>
[INFO] 
[INFO] --- maven-antrun-plugin:1.6:run (copy-sources) @ struts2-mailreader ---
[WARNING] Parameter tasks is deprecated, use target instead
[INFO] Executing tasks

main:
     [copy] Copying 22 files to <https://builds.apache.org/job/Struts2-JDK6/ws/struts2/apps/mailreader/target/struts2-mailreader/WEB-INF/src/java>
     [copy] Copying 3 files to <https://builds.apache.org/job/Struts2-JDK6/ws/struts2/apps/mailreader/target/struts2-mailreader/WEB-INF/src/java>
[INFO] Executed tasks
[INFO] 
[INFO] --- maven-remote-resources-plugin:1.2.1:process (default) @ struts2-mailreader ---
[INFO] 
[INFO] --- maven-resources-plugin:2.5:resources (default-resources) @ struts2-mailreader ---
[debug] execute contextualize
[INFO] Using 'UTF-8' encoding to copy filtered resources.
[INFO] Copying 13 resources
[INFO] Copying 3 resources
[INFO] 
[INFO] --- maven-compiler-plugin:2.3.2:compile (default-compile) @ struts2-mailreader ---
[INFO] Compiling 9 source files to <https://builds.apache.org/job/Struts2-JDK6/ws/struts2/apps/mailreader/target/classes>
[INFO] 
[INFO] --- maven-bundle-plugin:2.1.0:manifest (bundle-manifest) @ struts2-mailreader ---
[WARNING] Ignoring project type war - supportedProjectTypes = [jar, bundle]
[INFO] 
[INFO] --- maven-resources-plugin:2.5:testResources (default-testResources) @ struts2-mailreader
---
[debug] execute contextualize
[INFO] Using 'UTF-8' encoding to copy filtered resources.
[INFO] skip non existing resourceDirectory <https://builds.apache.org/job/Struts2-JDK6/ws/struts2/apps/mailreader/src/test/resources>
[INFO] Copying 3 resources
[INFO] 
[INFO] --- maven-compiler-plugin:2.3.2:testCompile (default-testCompile) @ struts2-mailreader
---
[INFO] No sources to compile
[INFO] 
[INFO] --- maven-surefire-plugin:2.3.1:test (default-test) @ struts2-mailreader ---
[INFO] Surefire report directory: <https://builds.apache.org/job/Struts2-JDK6/ws/struts2/apps/mailreader/target/surefire-reports>

-------------------------------------------------------
 T E S T S
-------------------------------------------------------
There are no tests to run.

Results :

Tests run: 0, Failures: 0, Errors: 0, Skipped: 0

[JENKINS] Recording test results
[INFO] 
[INFO] --- maven-war-plugin:2.1:war (default-war) @ struts2-mailreader ---
[INFO] Packaging webapp
[INFO] Assembling webapp [struts2-mailreader] in [<https://builds.apache.org/job/Struts2-JDK6/ws/struts2/apps/mailreader/target/struts2-mailreader]>
[INFO] Processing war project
[INFO] Copying webapp webResources [<https://builds.apache.org/job/Struts2-JDK6/ws/struts2/apps/mailreader/src/main/resources]>
to [<https://builds.apache.org/job/Struts2-JDK6/ws/struts2/apps/mailreader/target/struts2-mailreader]>
[INFO] Copying webapp resources [<https://builds.apache.org/job/Struts2-JDK6/ws/struts2/apps/mailreader/src/main/webapp]>
[INFO] Webapp assembled in [72 msecs]
[INFO] Building war: <https://builds.apache.org/job/Struts2-JDK6/ws/struts2/apps/mailreader/target/struts2-mailreader.war>
[INFO] WEB-INF/web.xml already added, skipping
[WARNING] Failed to getClass for org.apache.maven.plugin.source.SourceJarMojo
[INFO] 
[INFO] --- maven-source-plugin:2.1.2:jar (attach-source) @ struts2-mailreader ---
[INFO] alternate_ja.properties already added, skipping
[INFO] struts.xml already added, skipping
[INFO] mailreader-support.xml already added, skipping
[INFO] mailreader2/Subscription-validation.xml already added, skipping
[INFO] mailreader2/Subscription-Subscription_save-validation.xml already added, skipping
[INFO] mailreader2/MailreaderSupport_ja.properties already added, skipping
[INFO] mailreader2/MailreaderSupport_ru.properties already added, skipping
[INFO] mailreader2/Registration-Registration_save-validation.xml already added, skipping
[INFO] mailreader2/MailreaderSupport.properties already added, skipping
[INFO] mailreader2/Registration-validation.xml already added, skipping
[INFO] mailreader2/Login-validation.xml already added, skipping
[INFO] alternate.properties already added, skipping
[INFO] mailreader-default.xml already added, skipping
[INFO] META-INF already added, skipping
[INFO] META-INF/LICENSE already added, skipping
[INFO] META-INF/NOTICE already added, skipping
[INFO] META-INF/DEPENDENCIES already added, skipping
[INFO] Building jar: <https://builds.apache.org/job/Struts2-JDK6/ws/struts2/apps/mailreader/target/struts2-mailreader-sources.jar>
[INFO] alternate_ja.properties already added, skipping
[INFO] struts.xml already added, skipping
[INFO] mailreader-support.xml already added, skipping
[INFO] mailreader2/Subscription-validation.xml already added, skipping
[INFO] mailreader2/Subscription-Subscription_save-validation.xml already added, skipping
[INFO] mailreader2/MailreaderSupport_ja.properties already added, skipping
[INFO] mailreader2/MailreaderSupport_ru.properties already added, skipping
[INFO] mailreader2/Registration-Registration_save-validation.xml already added, skipping
[INFO] mailreader2/MailreaderSupport.properties already added, skipping
[INFO] mailreader2/Registration-validation.xml already added, skipping
[INFO] mailreader2/Login-validation.xml already added, skipping
[INFO] alternate.properties already added, skipping
[INFO] mailreader-default.xml already added, skipping
[INFO] META-INF already added, skipping
[INFO] META-INF/LICENSE already added, skipping
[INFO] META-INF/NOTICE already added, skipping
[INFO] META-INF/DEPENDENCIES already added, skipping
[WARNING] Artifact org.apache.struts:struts2-mailreader:java-source:sources:2.3.16-SNAPSHOT
already attached to project, ignoring duplicate
[INFO] 
[INFO] --- maven-site-plugin:3.1:attach-descriptor (attach-descriptor) @ struts2-mailreader
---
[INFO] 
[INFO] --- maven-install-plugin:2.3.1:install (default-install) @ struts2-mailreader ---
[INFO] Installing <https://builds.apache.org/job/Struts2-JDK6/ws/struts2/apps/mailreader/target/struts2-mailreader.war>
to /home/jenkins/jenkins-slave/maven-repositories/0/org/apache/struts/struts2-mailreader/2.3.16-SNAPSHOT/struts2-mailreader-2.3.16-SNAPSHOT.war
[INFO] Installing <https://builds.apache.org/job/Struts2-JDK6/ws/struts2/apps/mailreader/pom.xml>
to /home/jenkins/jenkins-slave/maven-repositories/0/org/apache/struts/struts2-mailreader/2.3.16-SNAPSHOT/struts2-mailreader-2.3.16-SNAPSHOT.pom
[INFO] Installing <https://builds.apache.org/job/Struts2-JDK6/ws/struts2/apps/mailreader/target/struts2-mailreader-sources.jar>
to /home/jenkins/jenkins-slave/maven-repositories/0/org/apache/struts/struts2-mailreader/2.3.16-SNAPSHOT/struts2-mailreader-2.3.16-SNAPSHOT-sources.jar
[INFO] Installing <https://builds.apache.org/job/Struts2-JDK6/ws/struts2/apps/mailreader/target/struts2-mailreader-javadoc.jar>
to /home/jenkins/jenkins-slave/maven-repositories/0/org/apache/struts/struts2-mailreader/2.3.16-SNAPSHOT/struts2-mailreader-2.3.16-SNAPSHOT-javadoc.jar
Build timed out (after 85 minutes). Marking the build as failed.
[INFO] ------------------------------------------------------------------------
[INFO] Reactor Summary:
[INFO] 
[INFO] Struts 2 .......................................... SUCCESS [1:12.553s]
[INFO] XWork: Core ....................................... SUCCESS [1:23.814s]
[INFO] Struts 2 Core ..................................... SUCCESS [2:01.691s]
[INFO] Struts Plugins .................................... SUCCESS [33.794s]
[INFO] Struts 2 Spring Plugin ............................ SUCCESS [45.218s]
[INFO] Struts 2 Convention Plugin ........................ SUCCESS [1:22.551s]
[INFO] Struts 2 JUnit Plugin ............................. SUCCESS [1:37.686s]
[INFO] Webapps ........................................... SUCCESS [1:07.485s]
[INFO] Blank Webapp ...................................... SUCCESS [1:08.577s]
[INFO] JBoss Blank Webapp ................................ SUCCESS [23.010s]
[INFO] Mail Reader Webapp ................................ FAILURE [2:11.742s]
[INFO] Struts 2 Portlet Plugin ........................... SKIPPED
[INFO] Struts 2 DWR Plugin ............................... SKIPPED
[INFO] Struts 2 Tiles Plugin ............................. SKIPPED
[INFO] Struts 2 Portlet Tiles Plugin ..................... SKIPPED
[INFO] Portlet Webapp .................................... SKIPPED
[INFO] Struts 2 Struts 1 Plugin .......................... SKIPPED
[INFO] Struts 2 Dojo Plugin .............................. SKIPPED
[INFO] Struts 2 JSF Plugin ............................... SKIPPED
[INFO] Struts 2 Configuration Browser Plugin ............. SKIPPED
[INFO] Struts 2 Sitemesh Plugin .......................... SKIPPED
[INFO] Struts 2 JSON Plugin .............................. SKIPPED
[INFO] Showcase Webapp ................................... SKIPPED
[INFO] Struts 2 REST Plugin .............................. SKIPPED
[INFO] Struts 2 Rest Showcase Example .................... SKIPPED
[INFO] Struts 2 Codebehind Plugin ........................ SKIPPED
[INFO] Struts 2 Java Templates Plugin .................... SKIPPED
[INFO] Struts 2 Jasper Reports Plugin .................... SKIPPED
[INFO] Struts 2 JFreeChart Plugin ........................ SKIPPED
[INFO] Struts 2 Pell Multipart Plugin .................... SKIPPED
[INFO] Struts 2 Plexus Plugin ............................ SKIPPED
[INFO] Struts 2 Sitegraph Plugin ......................... SKIPPED
[INFO] Struts 2 TestNG Plugin ............................ SKIPPED
[INFO] Struts 2 OVal Plugin .............................. SKIPPED
[INFO] Struts 2 OSGi Plugin .............................. SKIPPED
[INFO] Struts 2 Embedded JSP Plugin ...................... SKIPPED
[INFO] Struts 2 GXP Plugin ............................... SKIPPED
[INFO] Struts 2 CDI Plugin ............................... SKIPPED
[INFO] Struts 2 Tiles 3 Plugin ........................... SKIPPED
[INFO] Struts OSGi Bundles ............................... SKIPPED
[INFO] Struts 2 OSGi Admin Bundle ........................ SKIPPED
[INFO] Struts 2 OSGi Demo Bundle ......................... SKIPPED
[INFO] Struts 2 Maven Archetypes ......................... SKIPPED
[INFO] Struts 2 Archetypes - Angular JS .................. SKIPPED
[INFO] Struts 2 Archetypes - Blank ....................... SKIPPED
[INFO] Struts 2 Archetypes - Blank Convention ............ SKIPPED
[INFO] Struts 2 Archetypes - Database Portlet ............ SKIPPED
[INFO] Struts 2 Archetypes - Plugin ...................... SKIPPED
[INFO] Struts 2 Archetypes - Portlet ..................... SKIPPED
[INFO] Struts 2 Archetypes - Starter ..................... SKIPPED
[INFO] ------------------------------------------------------------------------
[INFO] BUILD FAILURE
[INFO] ------------------------------------------------------------------------
[INFO] Total time: 1:18:11.627s
[INFO] Finished at: Mon Nov 18 14:28:22 UTC 2013
[INFO] Final Memory: 96M/223M
[INFO] ------------------------------------------------------------------------
[ERROR] Internal error: java.lang.IllegalStateException: Unable to call isArchivingDisabled.
Invalid object ID 43 -> [Help 1]
org.apache.maven.InternalErrorException: Internal error: java.lang.IllegalStateException:
Unable to call isArchivingDisabled. Invalid object ID 43
	at org.apache.maven.DefaultMaven.execute(DefaultMaven.java:168)
	at org.jvnet.hudson.maven3.launcher.Maven3Launcher.main(Maven3Launcher.java:117)
	at sun.reflect.NativeMethodAccessorImpl.invoke0(Native Method)
	at sun.reflect.NativeMethodAccessorImpl.invoke(NativeMethodAccessorImpl.java:39)
	at sun.reflect.DelegatingMethodAccessorImpl.invoke(DelegatingMethodAccessorImpl.java:25)
	at java.lang.reflect.Method.invoke(Method.java:597)
	at org.codehaus.plexus.classworlds.launcher.Launcher.launchStandard(Launcher.java:329)
	at org.codehaus.plexus.classworlds.launcher.Launcher.launch(Launcher.java:239)
	at org.jvnet.hudson.maven3.agent.Maven3Main.launch(Maven3Main.java:178)
	at sun.reflect.NativeMethodAccessorImpl.invoke0(Native Method)
	at sun.reflect.NativeMethodAccessorImpl.invoke(NativeMethodAccessorImpl.java:39)
	at sun.reflect.DelegatingMethodAccessorImpl.invoke(DelegatingMethodAccessorImpl.java:25)
	at java.lang.reflect.Method.invoke(Method.java:597)
	at hudson.maven.Maven3Builder.call(Maven3Builder.java:134)
	at hudson.maven.Maven3Builder.call(Maven3Builder.java:69)
	at hudson.remoting.UserRequest.perform(UserRequest.java:118)
	at hudson.remoting.UserRequest.perform(UserRequest.java:48)
	at hudson.remoting.Request$2.run(Request.java:326)
	at hudson.remoting.InterceptingExecutorService$1.call(InterceptingExecutorService.java:72)
	at java.util.concurrent.FutureTask$Sync.innerRun(FutureTask.java:303)
	at java.util.concurrent.FutureTask.run(FutureTask.java:138)
	at java.util.concurrent.ThreadPoolExecutor$Worker.runTask(ThreadPoolExecutor.java:895)
	at java.util.concurrent.ThreadPoolExecutor$Worker.run(ThreadPoolExecutor.java:918)
	at java.lang.Thread.run(Thread.java:662)
Caused by: java.lang.IllegalStateException: Unable to call isArchivingDisabled. Invalid object
ID 43
	at hudson.remoting.RemoteInvocationHandler$RPCRequest.perform(RemoteInvocationHandler.java:293)
	at hudson.remoting.RemoteInvocationHandler$RPCRequest.call(RemoteInvocationHandler.java:280)
	at hudson.remoting.RemoteInvocationHandler$RPCRequest.call(RemoteInvocationHandler.java:239)
	at hudson.remoting.UserRequest.perform(UserRequest.java:118)
	at hudson.remoting.UserRequest.perform(UserRequest.java:48)
	at hudson.remoting.Request$2.run(Request.java:326)
	at hudson.remoting.InterceptingExecutorService$1.call(InterceptingExecutorService.java:72)
	at java.util.concurrent.FutureTask$Sync.innerRun(FutureTask.java:334)
	at java.util.concurrent.FutureTask.run(FutureTask.java:166)
	at java.util.concurrent.ThreadPoolExecutor.runWorker(ThreadPoolExecutor.java:1145)
	at java.util.concurrent.ThreadPoolExecutor$Worker.run(ThreadPoolExecutor.java:615)
	at java.lang.Thread.run(Thread.java:724)
[ERROR] 
[ERROR] To see the full stack trace of the errors, re-run Maven with the -e switch.
[ERROR] Re-run Maven using the -X switch to enable full debug logging.
[ERROR] 
[ERROR] For more information about the errors and possible solutions, please read the following
articles:
[ERROR] [Help 1] http://cwiki.apache.org/confluence/display/MAVEN/InternalErrorException
channel stopped
[locks-and-latches] Releasing all the locks
[locks-and-latches] All the locks released
Updating WW-4243

---------------------------------------------------------------------
To unsubscribe, e-mail: dev-unsubscribe@struts.apache.org
For additional commands, e-mail: dev-help@struts.apache.org


Mime
View raw message