struts-dev mailing list archives

Site index · List index
Message view « Date » · « Thread »
Top « Date » · « Thread »
From Apache Jenkins Server <jenk...@builds.apache.org>
Subject Build failed in Jenkins: Struts2-JDK6 #847
Date Thu, 21 Nov 2013 01:16:46 GMT
See <https://builds.apache.org/job/Struts2-JDK6/847/changes>

Changes:

[Lukasz Lenart] WW-4243 Adds missing BeanSelectionProvider interface

[Lukasz Lenart] WW-4243 Extracts BeanSelectionProvider interface

------------------------------------------
[...truncated 7154 lines...]
Generating <https://builds.apache.org/job/Struts2-JDK6/ws/struts2/apps/portlet/target/apidocs/org/apache/struts2/portlet/example/spring//class-use/ThingManager.html...>
Generating <https://builds.apache.org/job/Struts2-JDK6/ws/struts2/apps/portlet/target/apidocs/org/apache/struts2/portlet/example/eventing//class-use/ProcessAction.html...>
Generating <https://builds.apache.org/job/Struts2-JDK6/ws/struts2/apps/portlet/target/apidocs/org/apache/struts2/portlet/example/eventing//class-use/PublishAction.html...>
Generating <https://builds.apache.org/job/Struts2-JDK6/ws/struts2/apps/portlet/target/apidocs/org/apache/struts2/portlet/example/fileupload//class-use/FileUploadAction.html...>
Generating <https://builds.apache.org/job/Struts2-JDK6/ws/struts2/apps/portlet/target/apidocs/org/apache/struts2/portlet/example/model//class-use/Name.html...>
Generating <https://builds.apache.org/job/Struts2-JDK6/ws/struts2/apps/portlet/target/apidocs/org/apache/struts2/portlet/example//package-use.html...>
Generating <https://builds.apache.org/job/Struts2-JDK6/ws/struts2/apps/portlet/target/apidocs/org/apache/struts2/portlet/example/eventing//package-use.html...>
Generating <https://builds.apache.org/job/Struts2-JDK6/ws/struts2/apps/portlet/target/apidocs/org/apache/struts2/portlet/example/fileupload//package-use.html...>
Generating <https://builds.apache.org/job/Struts2-JDK6/ws/struts2/apps/portlet/target/apidocs/org/apache/struts2/portlet/example/model//package-use.html...>
Generating <https://builds.apache.org/job/Struts2-JDK6/ws/struts2/apps/portlet/target/apidocs/org/apache/struts2/portlet/example/spring//package-use.html...>
Building index for all the packages and classes...
Generating <https://builds.apache.org/job/Struts2-JDK6/ws/struts2/apps/portlet/target/apidocs/overview-tree.html...>
Generating <https://builds.apache.org/job/Struts2-JDK6/ws/struts2/apps/portlet/target/apidocs/index-all.html...>
Generating <https://builds.apache.org/job/Struts2-JDK6/ws/struts2/apps/portlet/target/apidocs/deprecated-list.html...>
Building index for all classes...
Generating <https://builds.apache.org/job/Struts2-JDK6/ws/struts2/apps/portlet/target/apidocs/allclasses-frame.html...>
Generating <https://builds.apache.org/job/Struts2-JDK6/ws/struts2/apps/portlet/target/apidocs/allclasses-noframe.html...>
Generating <https://builds.apache.org/job/Struts2-JDK6/ws/struts2/apps/portlet/target/apidocs/index.html...>
Generating <https://builds.apache.org/job/Struts2-JDK6/ws/struts2/apps/portlet/target/apidocs/overview-summary.html...>
Generating <https://builds.apache.org/job/Struts2-JDK6/ws/struts2/apps/portlet/target/apidocs/help-doc.html...>
Generating <https://builds.apache.org/job/Struts2-JDK6/ws/struts2/apps/portlet/target/apidocs/stylesheet.css...>
[INFO] Building jar: <https://builds.apache.org/job/Struts2-JDK6/ws/struts2/apps/portlet/target/struts2-portlet-javadoc.jar>
[INFO] 
[INFO] --- maven-antrun-plugin:1.6:run (copy-sources) @ struts2-portlet ---
[WARNING] Parameter tasks is deprecated, use target instead
[INFO] Executing tasks

main:
     [copy] Copying 13 files to <https://builds.apache.org/job/Struts2-JDK6/ws/struts2/apps/portlet/target/struts2-portlet/WEB-INF/src/java>
     [copy] Copying 16 files to <https://builds.apache.org/job/Struts2-JDK6/ws/struts2/apps/portlet/target/struts2-portlet/WEB-INF/src/java>
[INFO] Executed tasks
[INFO] 
[INFO] --- maven-remote-resources-plugin:1.2.1:process (default) @ struts2-portlet ---
[INFO] 
[INFO] --- maven-resources-plugin:2.5:resources (default-resources) @ struts2-portlet ---
[debug] execute contextualize
[INFO] Using 'UTF-8' encoding to copy filtered resources.
[INFO] Copying 16 resources
[INFO] Copying 3 resources
[INFO] 
[INFO] --- maven-compiler-plugin:2.3.2:compile (default-compile) @ struts2-portlet ---
[INFO] Compiling 13 source files to <https://builds.apache.org/job/Struts2-JDK6/ws/struts2/apps/portlet/target/classes>
[INFO] 
[INFO] --- maven-bundle-plugin:2.1.0:manifest (bundle-manifest) @ struts2-portlet ---
[WARNING] Ignoring project type war - supportedProjectTypes = [jar, bundle]
[INFO] 
[INFO] --- maven-resources-plugin:2.5:testResources (default-testResources) @ struts2-portlet
---
[debug] execute contextualize
[INFO] Using 'UTF-8' encoding to copy filtered resources.
[INFO] skip non existing resourceDirectory <https://builds.apache.org/job/Struts2-JDK6/ws/struts2/apps/portlet/src/test/resources>
[INFO] Copying 3 resources
[INFO] 
[INFO] --- maven-compiler-plugin:2.3.2:testCompile (default-testCompile) @ struts2-portlet
---
[INFO] Compiling 3 source files to <https://builds.apache.org/job/Struts2-JDK6/ws/struts2/apps/portlet/target/test-classes>
[INFO] 
[INFO] --- maven-surefire-plugin:2.3.1:test (default-test) @ struts2-portlet ---
[INFO] Surefire report directory: <https://builds.apache.org/job/Struts2-JDK6/ws/struts2/apps/portlet/target/surefire-reports>

-------------------------------------------------------
 T E S T S
-------------------------------------------------------
Running org.apache.struts2.portlet.test.Struts2PortletTest
2013-11-20 22:42:38.940::INFO:  Logging to STDERR via org.mortbay.log.StdErrLog
2013-11-20 22:42:38.07::INFO:  jetty-6.1.9
2013-11-20 22:42:40.204:/test:INFO:  Initializing Spring root WebApplicationContext
2013-11-20 22:42:41.467::INFO:  Started SocketConnector@0.0.0.0:51467
2013-11-20 22:42:41.472:/test:INFO:  Closing Spring root WebApplicationContext
2013-11-20 22:42:41.578::INFO:  jetty-6.1.9
2013-11-20 22:42:42.775:/test:INFO:  Initializing Spring root WebApplicationContext
2013-11-20 22:42:42.074::INFO:  Started SocketConnector@0.0.0.0:33033
2013-11-20 22:42:44.245:/test:INFO:  Closing Spring root WebApplicationContext
2013-11-20 22:42:44.347::INFO:  jetty-6.1.9
2013-11-20 22:42:44.451:/test:INFO:  Initializing Spring root WebApplicationContext
2013-11-20 22:42:44.708::INFO:  Started SocketConnector@0.0.0.0:60452
2013-11-20 22:42:46.850:/test:INFO:  Closing Spring root WebApplicationContext
2013-11-20 22:42:46.951::INFO:  jetty-6.1.9
2013-11-20 22:42:46.031:/test:INFO:  Initializing Spring root WebApplicationContext
2013-11-20 22:42:46.251::INFO:  Started SocketConnector@0.0.0.0:44971
2013-11-20 22:42:47.807:/test:INFO:  Closing Spring root WebApplicationContext
2013-11-20 22:42:47.908::INFO:  jetty-6.1.9
2013-11-20 22:42:47.987:/test:INFO:  Initializing Spring root WebApplicationContext
2013-11-20 22:42:47.188::INFO:  Started SocketConnector@0.0.0.0:33688
2013-11-20 22:42:47.506:/test:INFO:  Closing Spring root WebApplicationContext
2013-11-20 22:42:47.607::INFO:  jetty-6.1.9
2013-11-20 22:42:48.694:/test:INFO:  Initializing Spring root WebApplicationContext
2013-11-20 22:42:48.884::INFO:  Started SocketConnector@0.0.0.0:33476
2013-11-20 22:42:48.445:/test:INFO:  Closing Spring root WebApplicationContext
2013-11-20 22:42:48.546::INFO:  jetty-6.1.9
2013-11-20 22:42:49.626:/test:INFO:  Initializing Spring root WebApplicationContext
2013-11-20 22:42:49.802::INFO:  Started SocketConnector@0.0.0.0:49279
2013-11-20 22:42:49.095:/test:INFO:  Closing Spring root WebApplicationContext
Tests run: 7, Failures: 0, Errors: 0, Skipped: 0, Time elapsed: 11.491 sec

Results :

Tests run: 7, Failures: 0, Errors: 0, Skipped: 0

[JENKINS] Recording test results
[INFO] 
[INFO] --- maven-war-plugin:2.1:war (default-war) @ struts2-portlet ---
[INFO] Packaging webapp
[INFO] Assembling webapp [struts2-portlet] in [<https://builds.apache.org/job/Struts2-JDK6/ws/struts2/apps/portlet/target/struts2-portlet]>
[INFO] Processing war project
[INFO] Copying webapp webResources [<https://builds.apache.org/job/Struts2-JDK6/ws/struts2/apps/portlet/src/main/resources]>
to [<https://builds.apache.org/job/Struts2-JDK6/ws/struts2/apps/portlet/target/struts2-portlet]>
[INFO] Copying webapp resources [<https://builds.apache.org/job/Struts2-JDK6/ws/struts2/apps/portlet/src/main/webapp]>
[INFO] Webapp assembled in [162 msecs]
[INFO] Building war: <https://builds.apache.org/job/Struts2-JDK6/ws/struts2/apps/portlet/target/struts2-portlet.war>
[INFO] WEB-INF/web.xml already added, skipping
[WARNING] Failed to getClass for org.apache.maven.plugin.source.SourceJarMojo
[INFO] 
[INFO] --- maven-source-plugin:2.1.2:jar (attach-source) @ struts2-portlet ---
[INFO] org already added, skipping
[INFO] org/apache already added, skipping
[INFO] org/apache/struts2 already added, skipping
[INFO] org/apache/struts2/portlet already added, skipping
[INFO] org/apache/struts2/portlet/example already added, skipping
[INFO] META-INF already added, skipping
[INFO] META-INF/NOTICE already added, skipping
[INFO] META-INF/LICENSE already added, skipping
[INFO] META-INF/DEPENDENCIES already added, skipping
[INFO] Building jar: <https://builds.apache.org/job/Struts2-JDK6/ws/struts2/apps/portlet/target/struts2-portlet-sources.jar>
[INFO] org already added, skipping
[INFO] org/apache already added, skipping
[INFO] org/apache/struts2 already added, skipping
[INFO] org/apache/struts2/portlet already added, skipping
[INFO] org/apache/struts2/portlet/example already added, skipping
[INFO] META-INF already added, skipping
[INFO] META-INF/NOTICE already added, skipping
[INFO] META-INF/LICENSE already added, skipping
[INFO] META-INF/DEPENDENCIES already added, skipping
[WARNING] Artifact org.apache.struts:struts2-portlet:java-source:sources:2.3.16-SNAPSHOT already
attached to project, ignoring duplicate
[INFO] 
[INFO] --- maven-site-plugin:3.1:attach-descriptor (attach-descriptor) @ struts2-portlet ---
[INFO] 
[INFO] --- maven-install-plugin:2.3.1:install (default-install) @ struts2-portlet ---
[INFO] Installing <https://builds.apache.org/job/Struts2-JDK6/ws/struts2/apps/portlet/target/struts2-portlet.war>
to /home/jenkins/jenkins-slave/maven-repositories/1/org/apache/struts/struts2-portlet/2.3.16-SNAPSHOT/struts2-portlet-2.3.16-SNAPSHOT.war
[INFO] Installing <https://builds.apache.org/job/Struts2-JDK6/ws/struts2/apps/portlet/pom.xml>
to /home/jenkins/jenkins-slave/maven-repositories/1/org/apache/struts/struts2-portlet/2.3.16-SNAPSHOT/struts2-portlet-2.3.16-SNAPSHOT.pom
[INFO] Installing <https://builds.apache.org/job/Struts2-JDK6/ws/struts2/apps/portlet/target/struts2-portlet-sources.jar>
to /home/jenkins/jenkins-slave/maven-repositories/1/org/apache/struts/struts2-portlet/2.3.16-SNAPSHOT/struts2-portlet-2.3.16-SNAPSHOT-sources.jar
[INFO] Installing <https://builds.apache.org/job/Struts2-JDK6/ws/struts2/apps/portlet/target/struts2-portlet-javadoc.jar>
to /home/jenkins/jenkins-slave/maven-repositories/1/org/apache/struts/struts2-portlet/2.3.16-SNAPSHOT/struts2-portlet-2.3.16-SNAPSHOT-javadoc.jar
Build timed out (after 85 minutes). Marking the build as failed.
[INFO] ------------------------------------------------------------------------
[INFO] Reactor Summary:
[INFO] 
[INFO] Struts 2 .......................................... SUCCESS [29.686s]
[INFO] XWork: Core ....................................... SUCCESS [57.068s]
[INFO] Struts 2 Core ..................................... SUCCESS [1:36.081s]
[INFO] Struts Plugins .................................... SUCCESS [12.129s]
[INFO] Struts 2 Spring Plugin ............................ SUCCESS [13.496s]
[INFO] Struts 2 Convention Plugin ........................ SUCCESS [15.291s]
[INFO] Struts 2 JUnit Plugin ............................. SUCCESS [15.900s]
[INFO] Webapps ........................................... SUCCESS [14.543s]
[INFO] Blank Webapp ...................................... SUCCESS [18.083s]
[INFO] JBoss Blank Webapp ................................ SUCCESS [17.142s]
[INFO] Mail Reader Webapp ................................ SUCCESS [12.659s]
[INFO] Struts 2 Portlet Plugin ........................... SUCCESS [23.175s]
[INFO] Struts 2 DWR Plugin ............................... SUCCESS [11.678s]
[INFO] Struts 2 Tiles Plugin ............................. SUCCESS [14.307s]
[INFO] Struts 2 Portlet Tiles Plugin ..................... SUCCESS [10.794s]
[INFO] Portlet Webapp .................................... FAILURE [4:25.980s]
[INFO] Struts 2 Struts 1 Plugin .......................... SKIPPED
[INFO] Struts 2 Dojo Plugin .............................. SKIPPED
[INFO] Struts 2 JSF Plugin ............................... SKIPPED
[INFO] Struts 2 Configuration Browser Plugin ............. SKIPPED
[INFO] Struts 2 Sitemesh Plugin .......................... SKIPPED
[INFO] Struts 2 JSON Plugin .............................. SKIPPED
[INFO] Showcase Webapp ................................... SKIPPED
[INFO] Struts 2 REST Plugin .............................. SKIPPED
[INFO] Struts 2 Rest Showcase Example .................... SKIPPED
[INFO] Struts 2 Codebehind Plugin ........................ SKIPPED
[INFO] Struts 2 Java Templates Plugin .................... SKIPPED
[INFO] Struts 2 Jasper Reports Plugin .................... SKIPPED
[INFO] Struts 2 JFreeChart Plugin ........................ SKIPPED
[INFO] Struts 2 Pell Multipart Plugin .................... SKIPPED
[INFO] Struts 2 Plexus Plugin ............................ SKIPPED
[INFO] Struts 2 Sitegraph Plugin ......................... SKIPPED
[INFO] Struts 2 TestNG Plugin ............................ SKIPPED
[INFO] Struts 2 OVal Plugin .............................. SKIPPED
[INFO] Struts 2 OSGi Plugin .............................. SKIPPED
[INFO] Struts 2 Embedded JSP Plugin ...................... SKIPPED
[INFO] Struts 2 GXP Plugin ............................... SKIPPED
[INFO] Struts 2 CDI Plugin ............................... SKIPPED
[INFO] Struts 2 Tiles 3 Plugin ........................... SKIPPED
[INFO] Struts OSGi Bundles ............................... SKIPPED
[INFO] Struts 2 OSGi Admin Bundle ........................ SKIPPED
[INFO] Struts 2 OSGi Demo Bundle ......................... SKIPPED
[INFO] Struts 2 Maven Archetypes ......................... SKIPPED
[INFO] Struts 2 Archetypes - Angular JS .................. SKIPPED
[INFO] Struts 2 Archetypes - Blank ....................... SKIPPED
[INFO] Struts 2 Archetypes - Blank Convention ............ SKIPPED
[INFO] Struts 2 Archetypes - Database Portlet ............ SKIPPED
[INFO] Struts 2 Archetypes - Plugin ...................... SKIPPED
[INFO] Struts 2 Archetypes - Portlet ..................... SKIPPED
[INFO] Struts 2 Archetypes - Starter ..................... SKIPPED
[INFO] ------------------------------------------------------------------------
[INFO] BUILD FAILURE
[INFO] ------------------------------------------------------------------------
[INFO] Total time: 1:24:03.918s
[INFO] Finished at: Wed Nov 20 22:46:49 UTC 2013
[INFO] Final Memory: 54M/164M
[INFO] ------------------------------------------------------------------------
[ERROR] Internal error: java.lang.IllegalStateException: Unable to call isArchivingDisabled.
Invalid object ID 43 -> [Help 1]
org.apache.maven.InternalErrorException: Internal error: java.lang.IllegalStateException:
Unable to call isArchivingDisabled. Invalid object ID 43
	at org.apache.maven.DefaultMaven.execute(DefaultMaven.java:168)
	at org.jvnet.hudson.maven3.launcher.Maven3Launcher.main(Maven3Launcher.java:117)
	at sun.reflect.NativeMethodAccessorImpl.invoke0(Native Method)
	at sun.reflect.NativeMethodAccessorImpl.invoke(NativeMethodAccessorImpl.java:39)
	at sun.reflect.DelegatingMethodAccessorImpl.invoke(DelegatingMethodAccessorImpl.java:25)
	at java.lang.reflect.Method.invoke(Method.java:597)
	at org.codehaus.plexus.classworlds.launcher.Launcher.launchStandard(Launcher.java:329)
	at org.codehaus.plexus.classworlds.launcher.Launcher.launch(Launcher.java:239)
	at org.jvnet.hudson.maven3.agent.Maven3Main.launch(Maven3Main.java:178)
	at sun.reflect.NativeMethodAccessorImpl.invoke0(Native Method)
	at sun.reflect.NativeMethodAccessorImpl.invoke(NativeMethodAccessorImpl.java:39)
	at sun.reflect.DelegatingMethodAccessorImpl.invoke(DelegatingMethodAccessorImpl.java:25)
	at java.lang.reflect.Method.invoke(Method.java:597)
	at hudson.maven.Maven3Builder.call(Maven3Builder.java:134)
	at hudson.maven.Maven3Builder.call(Maven3Builder.java:69)
	at hudson.remoting.UserRequest.perform(UserRequest.java:118)
	at hudson.remoting.UserRequest.perform(UserRequest.java:48)
	at hudson.remoting.Request$2.run(Request.java:328)
	at hudson.remoting.InterceptingExecutorService$1.call(InterceptingExecutorService.java:72)
	at java.util.concurrent.FutureTask$Sync.innerRun(FutureTask.java:303)
	at java.util.concurrent.FutureTask.run(FutureTask.java:138)
	at java.util.concurrent.ThreadPoolExecutor$Worker.runTask(ThreadPoolExecutor.java:895)
	at java.util.concurrent.ThreadPoolExecutor$Worker.run(ThreadPoolExecutor.java:918)
	at java.lang.Thread.run(Thread.java:662)
Caused by: java.lang.IllegalStateException: Unable to call isArchivingDisabled. Invalid object
ID 43
	at hudson.remoting.RemoteInvocationHandler$RPCRequest.perform(RemoteInvocationHandler.java:293)
	at hudson.remoting.RemoteInvocationHandler$RPCRequest.call(RemoteInvocationHandler.java:280)
	at hudson.remoting.RemoteInvocationHandler$RPCRequest.call(RemoteInvocationHandler.java:239)
	at hudson.remoting.UserRequest.perform(UserRequest.java:118)
	at hudson.remoting.UserRequest.perform(UserRequest.java:48)
	at hudson.remoting.Request$2.run(Request.java:328)
	at hudson.remoting.InterceptingExecutorService$1.call(InterceptingExecutorService.java:72)
	at java.util.concurrent.FutureTask$Sync.innerRun(FutureTask.java:334)
	at java.util.concurrent.FutureTask.run(FutureTask.java:166)
	at java.util.concurrent.ThreadPoolExecutor.runWorker(ThreadPoolExecutor.java:1145)
	at java.util.concurrent.ThreadPoolExecutor$Worker.run(ThreadPoolExecutor.java:615)
	at java.lang.Thread.run(Thread.java:724)
[ERROR] 
[ERROR] To see the full stack trace of the errors, re-run Maven with the -e switch.
[ERROR] Re-run Maven using the -X switch to enable full debug logging.
[ERROR] 
[ERROR] For more information about the errors and possible solutions, please read the following
articles:
[ERROR] [Help 1] http://cwiki.apache.org/confluence/display/MAVEN/InternalErrorException
channel stopped
[locks-and-latches] Releasing all the locks
[locks-and-latches] All the locks released
Updating WW-4243

---------------------------------------------------------------------
To unsubscribe, e-mail: dev-unsubscribe@struts.apache.org
For additional commands, e-mail: dev-help@struts.apache.org


Mime
View raw message