struts-dev mailing list archives

Site index · List index
Message view « Date » · « Thread »
Top « Date » · « Thread »
From Apache Jenkins Server <jenk...@builds.apache.org>
Subject Build failed in Jenkins: Struts2-JDK6 #840
Date Sat, 09 Nov 2013 22:23:34 GMT
See <https://builds.apache.org/job/Struts2-JDK6/840/>

------------------------------------------
[...truncated 4371 lines...]
2013-11-09 19:14:01.716::INFO:  jetty-6.1.9
2013-11-09 19:14:01.913:/test:INFO:  Initializing Spring root WebApplicationContext
2013-11-09 19:14:02.214::INFO:  Started SocketConnector@0.0.0.0:34119
2013-11-09 19:14:04.515:/test:INFO:  Closing Spring root WebApplicationContext
2013-11-09 19:14:04.616::INFO:  jetty-6.1.9
2013-11-09 19:14:04.763:/test:INFO:  Initializing Spring root WebApplicationContext
2013-11-09 19:14:04.014::INFO:  Started SocketConnector@0.0.0.0:56814
2013-11-09 19:14:06.192:/test:INFO:  Closing Spring root WebApplicationContext
2013-11-09 19:14:06.294::INFO:  jetty-6.1.9
2013-11-09 19:14:06.404:/test:INFO:  Initializing Spring root WebApplicationContext
2013-11-09 19:14:06.636::INFO:  Started SocketConnector@0.0.0.0:53620
2013-11-09 19:14:07.224:/test:INFO:  Closing Spring root WebApplicationContext
2013-11-09 19:14:07.326::INFO:  jetty-6.1.9
2013-11-09 19:14:07.405:/test:INFO:  Initializing Spring root WebApplicationContext
2013-11-09 19:14:07.621::INFO:  Started SocketConnector@0.0.0.0:33039
2013-11-09 19:14:07.931:/test:INFO:  Closing Spring root WebApplicationContext
2013-11-09 19:14:07.033::INFO:  jetty-6.1.9
2013-11-09 19:14:08.110:/test:INFO:  Initializing Spring root WebApplicationContext
2013-11-09 19:14:08.297::INFO:  Started SocketConnector@0.0.0.0:37320
2013-11-09 19:14:08.853:/test:INFO:  Closing Spring root WebApplicationContext
[JENKINS] Recording test results2013-11-09 19:14:08.954::INFO:  jetty-6.1.9

2013-11-09 19:14:08.034:/test:INFO:  Initializing Spring root WebApplicationContext
2013-11-09 19:14:09.119::INFO:  Started SocketConnector@0.0.0.0:47567
2013-11-09 19:14:09.406:/test:INFO:  Closing Spring root WebApplicationContext
Tests run: 7, Failures: 0, Errors: 0, Skipped: 0, Time elapsed: 10.266 sec

Results :

Tests run: 7, Failures: 0, Errors: 0, Skipped: 0

[INFO] 
[INFO] --- maven-war-plugin:2.1:war (default-war) @ struts2-portlet ---
[INFO] Packaging webapp
[INFO] Assembling webapp [struts2-portlet] in [<https://builds.apache.org/job/Struts2-JDK6/ws/struts2/apps/portlet/target/struts2-portlet]>
[INFO] Processing war project
[INFO] Copying webapp webResources [<https://builds.apache.org/job/Struts2-JDK6/ws/struts2/apps/portlet/src/main/resources]>
to [<https://builds.apache.org/job/Struts2-JDK6/ws/struts2/apps/portlet/target/struts2-portlet]>
[INFO] Copying webapp resources [<https://builds.apache.org/job/Struts2-JDK6/ws/struts2/apps/portlet/src/main/webapp]>
[INFO] Webapp assembled in [168 msecs]
[INFO] Building war: <https://builds.apache.org/job/Struts2-JDK6/ws/struts2/apps/portlet/target/struts2-portlet.war>
[INFO] WEB-INF/web.xml already added, skipping
[WARNING] Failed to getClass for org.apache.maven.plugin.source.SourceJarMojo
[INFO] 
[INFO] --- maven-source-plugin:2.1.2:jar (attach-source) @ struts2-portlet ---
[INFO] org already added, skipping
[INFO] org/apache already added, skipping
[INFO] org/apache/struts2 already added, skipping
[INFO] org/apache/struts2/portlet already added, skipping
[INFO] org/apache/struts2/portlet/example already added, skipping
[INFO] META-INF already added, skipping
[INFO] META-INF/NOTICE already added, skipping
[INFO] META-INF/LICENSE already added, skipping
[INFO] META-INF/DEPENDENCIES already added, skipping
[INFO] Building jar: <https://builds.apache.org/job/Struts2-JDK6/ws/struts2/apps/portlet/target/struts2-portlet-sources.jar>
[INFO] org already added, skipping
[INFO] org/apache already added, skipping
[INFO] org/apache/struts2 already added, skipping
[INFO] org/apache/struts2/portlet already added, skipping
[INFO] org/apache/struts2/portlet/example already added, skipping
[INFO] META-INF already added, skipping
[INFO] META-INF/NOTICE already added, skipping
[INFO] META-INF/LICENSE already added, skipping
[INFO] META-INF/DEPENDENCIES already added, skipping
[INFO] 
[INFO] --- maven-site-plugin:3.1:attach-descriptor (attach-descriptor) @ struts2-portlet ---
[INFO] 
[INFO] --- maven-install-plugin:2.3.1:install (default-install) @ struts2-portlet ---
[INFO] Installing <https://builds.apache.org/job/Struts2-JDK6/ws/struts2/apps/portlet/target/struts2-portlet.war>
to /home/jenkins/jenkins-slave/maven-repositories/0/org/apache/struts/struts2-portlet/2.3.16-SNAPSHOT/struts2-portlet-2.3.16-SNAPSHOT.war
[INFO] Installing <https://builds.apache.org/job/Struts2-JDK6/ws/struts2/apps/portlet/pom.xml>
to /home/jenkins/jenkins-slave/maven-repositories/0/org/apache/struts/struts2-portlet/2.3.16-SNAPSHOT/struts2-portlet-2.3.16-SNAPSHOT.pom
[INFO] Installing <https://builds.apache.org/job/Struts2-JDK6/ws/struts2/apps/portlet/target/struts2-portlet-sources.jar>
to /home/jenkins/jenkins-slave/maven-repositories/0/org/apache/struts/struts2-portlet/2.3.16-SNAPSHOT/struts2-portlet-2.3.16-SNAPSHOT-sources.jar
[INFO]                                                                         
[INFO] ------------------------------------------------------------------------
[INFO] Building Struts 2 Struts 1 Plugin 2.3.16-SNAPSHOT
[INFO] ------------------------------------------------------------------------
[INFO] 
[INFO] --- maven-clean-plugin:2.4.1:clean (default-clean) @ struts2-struts1-plugin ---
[INFO] Deleting <https://builds.apache.org/job/Struts2-JDK6/ws/struts2/plugins/struts1/target>
[INFO] 
[INFO] --- maven-remote-resources-plugin:1.2.1:process (default) @ struts2-struts1-plugin
---
[INFO] 
[INFO] --- maven-resources-plugin:2.5:resources (default-resources) @ struts2-struts1-plugin
---
[debug] execute contextualize
[INFO] Using 'UTF-8' encoding to copy filtered resources.
[INFO] Copying 4 resources
[INFO] Copying 3 resources
[INFO] 
[INFO] --- maven-compiler-plugin:2.3.2:compile (default-compile) @ struts2-struts1-plugin
---
[INFO] Compiling 10 source files to <https://builds.apache.org/job/Struts2-JDK6/ws/struts2/plugins/struts1/target/classes>
[INFO] 
[INFO] --- maven-bundle-plugin:2.1.0:manifest (bundle-manifest) @ struts2-struts1-plugin ---
[WARNING] Warning in manifest for org.apache.struts:struts2-struts1-plugin:jar:2.3.16-SNAPSHOT
: Superfluous export-package instructions: [org.apache, org.apache.struts2, org]
[INFO] 
[INFO] --- maven-resources-plugin:2.5:testResources (default-testResources) @ struts2-struts1-plugin
---
[debug] execute contextualize
[INFO] Using 'UTF-8' encoding to copy filtered resources.
[INFO] Copying 1 resource
[INFO] Copying 3 resources
[INFO] 
[INFO] --- maven-compiler-plugin:2.3.2:testCompile (default-testCompile) @ struts2-struts1-plugin
---
[INFO] Compiling 2 source files to <https://builds.apache.org/job/Struts2-JDK6/ws/struts2/plugins/struts1/target/test-classes>
[INFO] 
[INFO] --- maven-surefire-plugin:2.3.1:test (default-test) @ struts2-struts1-plugin ---
[INFO] Surefire report directory: <https://builds.apache.org/job/Struts2-JDK6/ws/struts2/plugins/struts1/target/surefire-reports>

-------------------------------------------------------
 T E S T S
-------------------------------------------------------
Running org.apache.struts2.s1.DynaBeanPropertyAccessorTest
Tests run: 3, Failures: 0, Errors: 0, Skipped: 0, Time elapsed: 0.09 sec
Running org.apache.struts2.s1.Struts1FactoryTest
Tests run: 5, Failures: 0, Errors: 0, Skipped: 0, Time elapsed: 1.096 sec

Results :

Tests run: 8, Failures: 0, Errors: 0, Skipped: 0

[JENKINS] Recording test results
[INFO] 
[INFO] --- maven-jar-plugin:2.3.1:jar (default-jar) @ struts2-struts1-plugin ---
[INFO] Building jar: <https://builds.apache.org/job/Struts2-JDK6/ws/struts2/plugins/struts1/target/struts2-struts1-plugin-2.3.16-SNAPSHOT.jar>
[WARNING] Failed to getClass for org.apache.maven.plugin.source.SourceJarMojo
[INFO] 
[INFO] --- maven-source-plugin:2.1.2:jar (attach-source) @ struts2-struts1-plugin ---
[INFO] META-INF already added, skipping
[INFO] META-INF/NOTICE already added, skipping
[INFO] META-INF/LICENSE already added, skipping
[INFO] META-INF/DEPENDENCIES already added, skipping
[INFO] Building jar: <https://builds.apache.org/job/Struts2-JDK6/ws/struts2/plugins/struts1/target/struts2-struts1-plugin-2.3.16-SNAPSHOT-sources.jar>
[INFO] META-INF already added, skipping
[INFO] META-INF/NOTICE already added, skipping
[INFO] META-INF/LICENSE already added, skipping
[INFO] META-INF/DEPENDENCIES already added, skipping
[INFO] 
[INFO] --- maven-site-plugin:3.1:attach-descriptor (attach-descriptor) @ struts2-struts1-plugin
---
[INFO] 
[INFO] --- maven-install-plugin:2.3.1:install (default-install) @ struts2-struts1-plugin ---
[INFO] Installing <https://builds.apache.org/job/Struts2-JDK6/ws/struts2/plugins/struts1/target/struts2-struts1-plugin-2.3.16-SNAPSHOT.jar>
to /home/jenkins/jenkins-slave/maven-repositories/0/org/apache/struts/struts2-struts1-plugin/2.3.16-SNAPSHOT/struts2-struts1-plugin-2.3.16-SNAPSHOT.jar
[INFO] Installing <https://builds.apache.org/job/Struts2-JDK6/ws/struts2/plugins/struts1/pom.xml>
to /home/jenkins/jenkins-slave/maven-repositories/0/org/apache/struts/struts2-struts1-plugin/2.3.16-SNAPSHOT/struts2-struts1-plugin-2.3.16-SNAPSHOT.pom
[INFO] Installing <https://builds.apache.org/job/Struts2-JDK6/ws/struts2/plugins/struts1/target/struts2-struts1-plugin-2.3.16-SNAPSHOT-sources.jar>
to /home/jenkins/jenkins-slave/maven-repositories/0/org/apache/struts/struts2-struts1-plugin/2.3.16-SNAPSHOT/struts2-struts1-plugin-2.3.16-SNAPSHOT-sources.jar
Build timed out (after 85 minutes). Marking the build as failed.
[INFO] ------------------------------------------------------------------------
[INFO] Reactor Summary:
[INFO] 
[INFO] Struts 2 .......................................... SUCCESS [38.576s]
[INFO] XWork: Core ....................................... SUCCESS [48.695s]
[INFO] Struts 2 Core ..................................... SUCCESS [1:29.726s]
[INFO] Struts Plugins .................................... SUCCESS [20.266s]
[INFO] Struts 2 Spring Plugin ............................ SUCCESS [29.030s]
[INFO] Struts 2 Convention Plugin ........................ SUCCESS [16.240s]
[INFO] Struts 2 JUnit Plugin ............................. SUCCESS [1:05.912s]
[INFO] Webapps ........................................... SUCCESS [32.475s]
[INFO] Blank Webapp ...................................... SUCCESS [58.498s]
[INFO] JBoss Blank Webapp ................................ SUCCESS [23.138s]
[INFO] Mail Reader Webapp ................................ SUCCESS [50.377s]
[INFO] Struts 2 Portlet Plugin ........................... SUCCESS [28.114s]
[INFO] Struts 2 DWR Plugin ............................... SUCCESS [16.085s]
[INFO] Struts 2 Tiles Plugin ............................. SUCCESS [19.382s]
[INFO] Struts 2 Portlet Tiles Plugin ..................... SUCCESS [27.049s]
[INFO] Portlet Webapp .................................... SUCCESS [41.406s]
[INFO] Struts 2 Struts 1 Plugin .......................... FAILURE [24.144s]
[INFO] Struts 2 Dojo Plugin .............................. SKIPPED
[INFO] Struts 2 JSF Plugin ............................... SKIPPED
[INFO] Struts 2 Configuration Browser Plugin ............. SKIPPED
[INFO] Struts 2 Sitemesh Plugin .......................... SKIPPED
[INFO] Struts 2 JSON Plugin .............................. SKIPPED
[INFO] Showcase Webapp ................................... SKIPPED
[INFO] Struts 2 REST Plugin .............................. SKIPPED
[INFO] Struts 2 Rest Showcase Example .................... SKIPPED
[INFO] Struts 2 Codebehind Plugin ........................ SKIPPED
[INFO] Struts 2 Java Templates Plugin .................... SKIPPED
[INFO] Struts 2 Jasper Reports Plugin .................... SKIPPED
[INFO] Struts 2 JFreeChart Plugin ........................ SKIPPED
[INFO] Struts 2 Pell Multipart Plugin .................... SKIPPED
[INFO] Struts 2 Plexus Plugin ............................ SKIPPED
[INFO] Struts 2 Sitegraph Plugin ......................... SKIPPED
[INFO] Struts 2 TestNG Plugin ............................ SKIPPED
[INFO] Struts 2 OVal Plugin .............................. SKIPPED
[INFO] Struts 2 OSGi Plugin .............................. SKIPPED
[INFO] Struts 2 Embedded JSP Plugin ...................... SKIPPED
[INFO] Struts 2 GXP Plugin ............................... SKIPPED
[INFO] Struts 2 CDI Plugin ............................... SKIPPED
[INFO] Struts 2 Tiles 3 Plugin ........................... SKIPPED
[INFO] Struts OSGi Bundles ............................... SKIPPED
[INFO] Struts 2 OSGi Admin Bundle ........................ SKIPPED
[INFO] Struts 2 OSGi Demo Bundle ......................... SKIPPED
[INFO] Struts 2 Maven Archetypes ......................... SKIPPED
[INFO] Struts 2 Archetypes - Angular JS .................. SKIPPED
[INFO] Struts 2 Archetypes - Blank ....................... SKIPPED
[INFO] Struts 2 Archetypes - Blank Convention ............ SKIPPED
[INFO] Struts 2 Archetypes - Database Portlet ............ SKIPPED
[INFO] Struts 2 Archetypes - Plugin ...................... SKIPPED
[INFO] Struts 2 Archetypes - Portlet ..................... SKIPPED
[INFO] Struts 2 Archetypes - Starter ..................... SKIPPED
[INFO] Struts 2 Assembly ................................. SKIPPED
[INFO] ------------------------------------------------------------------------
[INFO] BUILD FAILURE
[INFO] ------------------------------------------------------------------------
[INFO] Total time: 1:24:13.938s
[INFO] Finished at: Sat Nov 09 19:20:16 UTC 2013
[INFO] Final Memory: 70M/159M
[INFO] ------------------------------------------------------------------------
[ERROR] Internal error: java.lang.IllegalStateException: Unable to call isArchivingDisabled.
Invalid object ID 44 -> [Help 1]
org.apache.maven.InternalErrorException: Internal error: java.lang.IllegalStateException:
Unable to call isArchivingDisabled. Invalid object ID 44
	at org.apache.maven.DefaultMaven.execute(DefaultMaven.java:168)
	at org.jvnet.hudson.maven3.launcher.Maven3Launcher.main(Maven3Launcher.java:117)
	at sun.reflect.NativeMethodAccessorImpl.invoke0(Native Method)
	at sun.reflect.NativeMethodAccessorImpl.invoke(NativeMethodAccessorImpl.java:39)
	at sun.reflect.DelegatingMethodAccessorImpl.invoke(DelegatingMethodAccessorImpl.java:25)
	at java.lang.reflect.Method.invoke(Method.java:597)
	at org.codehaus.plexus.classworlds.launcher.Launcher.launchStandard(Launcher.java:329)
	at org.codehaus.plexus.classworlds.launcher.Launcher.launch(Launcher.java:239)
	at org.jvnet.hudson.maven3.agent.Maven3Main.launch(Maven3Main.java:178)
	at sun.reflect.NativeMethodAccessorImpl.invoke0(Native Method)
	at sun.reflect.NativeMethodAccessorImpl.invoke(NativeMethodAccessorImpl.java:39)
	at sun.reflect.DelegatingMethodAccessorImpl.invoke(DelegatingMethodAccessorImpl.java:25)
	at java.lang.reflect.Method.invoke(Method.java:597)
	at hudson.maven.Maven3Builder.call(Maven3Builder.java:134)
	at hudson.maven.Maven3Builder.call(Maven3Builder.java:69)
	at hudson.remoting.UserRequest.perform(UserRequest.java:118)
	at hudson.remoting.UserRequest.perform(UserRequest.java:48)
	at hudson.remoting.Request$2.run(Request.java:326)
	at hudson.remoting.InterceptingExecutorService$1.call(InterceptingExecutorService.java:72)
	at java.util.concurrent.FutureTask$Sync.innerRun(FutureTask.java:303)
	at java.util.concurrent.FutureTask.run(FutureTask.java:138)
	at java.util.concurrent.ThreadPoolExecutor$Worker.runTask(ThreadPoolExecutor.java:895)
	at java.util.concurrent.ThreadPoolExecutor$Worker.run(ThreadPoolExecutor.java:918)
	at java.lang.Thread.run(Thread.java:662)
Caused by: java.lang.IllegalStateException: Unable to call isArchivingDisabled. Invalid object
ID 44
	at hudson.remoting.RemoteInvocationHandler$RPCRequest.perform(RemoteInvocationHandler.java:293)
	at hudson.remoting.RemoteInvocationHandler$RPCRequest.call(RemoteInvocationHandler.java:280)
	at hudson.remoting.RemoteInvocationHandler$RPCRequest.call(RemoteInvocationHandler.java:239)
	at hudson.remoting.UserRequest.perform(UserRequest.java:118)
	at hudson.remoting.UserRequest.perform(UserRequest.java:48)
	at hudson.remoting.Request$2.run(Request.java:326)
	at hudson.remoting.InterceptingExecutorService$1.call(InterceptingExecutorService.java:72)
	at java.util.concurrent.FutureTask$Sync.innerRun(FutureTask.java:334)
	at java.util.concurrent.FutureTask.run(FutureTask.java:166)
	at java.util.concurrent.ThreadPoolExecutor.runWorker(ThreadPoolExecutor.java:1145)
	at java.util.concurrent.ThreadPoolExecutor$Worker.run(ThreadPoolExecutor.java:615)
	at java.lang.Thread.run(Thread.java:724)
[ERROR] 
[ERROR] To see the full stack trace of the errors, re-run Maven with the -e switch.
[ERROR] Re-run Maven using the -X switch to enable full debug logging.
[ERROR] 
[ERROR] For more information about the errors and possible solutions, please read the following
articles:
[ERROR] [Help 1] http://cwiki.apache.org/confluence/display/MAVEN/InternalErrorException
channel stopped
[locks-and-latches] Releasing all the locks
[locks-and-latches] All the locks released

---------------------------------------------------------------------
To unsubscribe, e-mail: dev-unsubscribe@struts.apache.org
For additional commands, e-mail: dev-help@struts.apache.org


Mime
View raw message