struts-dev mailing list archives

Site index · List index
Message view « Date » · « Thread »
Top « Date » · « Thread »
From Apache Jenkins Server <jenk...@builds.apache.org>
Subject Build failed in Jenkins: Struts2-JDK6 #849
Date Fri, 29 Nov 2013 17:04:04 GMT
See <https://builds.apache.org/job/Struts2-JDK6/849/changes>

Changes:

[Lukasz Lenart] WW-4227 Temporally reverts changes related to SecurityGate to allow prepare
new release without introducing new API

[Lukasz Lenart] WW-4227 Removes wrong class reference

[Lukasz Lenart] WW-4227 Temporally reverts changes related to SecurityGate to allow prepare
new release without introducing new API

------------------------------------------
[...truncated 9055 lines...]
[INFO] org already added, skipping
[INFO] org/apache already added, skipping
[INFO] org/apache/struts2 already added, skipping
[INFO] org/apache/struts2/showcase already added, skipping
[INFO] org/apache/struts2/showcase/tag already added, skipping
[INFO] org/apache/struts2/showcase/tag/nonui already added, skipping
[INFO] org/apache/struts2/showcase/tag/nonui/iteratortag already added, skipping
[INFO] org/apache/struts2/showcase/ajax already added, skipping
[INFO] org/apache/struts2/showcase/person already added, skipping
[INFO] org/apache/struts2/showcase/action already added, skipping
[INFO] org/apache/struts2/showcase/chat already added, skipping
[INFO] org/apache/struts2/showcase/conversion already added, skipping
[INFO] org/apache/struts2/showcase/fileupload already added, skipping
[INFO] org/apache/struts2/showcase/validation already added, skipping
[INFO] org/apache/struts2/showcase/token/TokenAction.java already added, skipping
[INFO] org/apache/struts2/showcase/xslt/JVMAction.java already added, skipping
[INFO] org/apache/struts2/showcase/tag/nonui/iteratortag/SubsetIteratorTagDemo.java already
added, skipping
[INFO] org/apache/struts2/showcase/tag/nonui/iteratortag/MergeIteratorTagDemo.java already
added, skipping
[INFO] org/apache/struts2/showcase/tag/nonui/iteratortag/IteratorGeneratorTagDemo.java already
added, skipping
[INFO] org/apache/struts2/showcase/tag/nonui/iteratortag/AppendIteratorTagDemo.java already
added, skipping
[INFO] org/apache/struts2/showcase/tag/nonui/actiontag/ActionTagDemo.java already added, skipping
[INFO] org/apache/struts2/showcase/tag/nonui/actionPrefix/SubmitAction.java already added,
skipping
[INFO] org/apache/struts2/showcase/filedownload/FileDownloadAction.java already added, skipping
[INFO] org/apache/struts2/showcase/LotsOfRichtexteditorAction.java already added, skipping
[INFO] org/apache/struts2/showcase/freemarker/StandardTagsAction.java already added, skipping
[INFO] org/apache/struts2/showcase/freemarker/CustomFreemarkerManagerUtil.java already added,
skipping
[INFO] org/apache/struts2/showcase/freemarker/CustomFreemarkerManager.java already added,
skipping
[INFO] org/apache/struts2/showcase/ShowDynamicTreeAction.java already added, skipping
[INFO] org/apache/struts2/showcase/ajax/tree/Category.java already added, skipping
[INFO] org/apache/struts2/showcase/ajax/tree/GetCategory.java already added, skipping
[INFO] org/apache/struts2/showcase/ajax/tree/Toggle.java already added, skipping
[INFO] org/apache/struts2/showcase/ajax/Example5Action.java already added, skipping
[INFO] org/apache/struts2/showcase/ajax/Example4ShowPanelAction.java already added, skipping
[INFO] org/apache/struts2/showcase/ajax/AjaxTestAction.java already added, skipping
[INFO] org/apache/struts2/showcase/ajax/AutocompleterExampleAction.java already added, skipping
[INFO] org/apache/struts2/showcase/application/TestDataProvider.java already added, skipping
[INFO] org/apache/struts2/showcase/application/Storage.java already added, skipping
[INFO] org/apache/struts2/showcase/application/MemoryStorage.java already added, skipping
[INFO] org/apache/struts2/showcase/actionchaining/ActionChain1.java already added, skipping
[INFO] org/apache/struts2/showcase/actionchaining/ActionChain3.java already added, skipping
[INFO] org/apache/struts2/showcase/actionchaining/ActionChain2.java already added, skipping
[INFO] org/apache/struts2/showcase/UITagExample.java already added, skipping
[INFO] org/apache/struts2/showcase/person/Person.java already added, skipping
[INFO] org/apache/struts2/showcase/person/NewPersonAction.java already added, skipping
[INFO] org/apache/struts2/showcase/person/package-info.java already added, skipping
[INFO] org/apache/struts2/showcase/person/PersonManager.java already added, skipping
[INFO] org/apache/struts2/showcase/person/ListPeopleAction.java already added, skipping
[INFO] org/apache/struts2/showcase/person/EditPersonAction.java already added, skipping
[INFO] org/apache/struts2/showcase/jsf/JsfEmployeeAction.java already added, skipping
[INFO] org/apache/struts2/showcase/model/Employee.java already added, skipping
[INFO] org/apache/struts2/showcase/model/Skill.java already added, skipping
[INFO] org/apache/struts2/showcase/model/IdEntity.java already added, skipping
[INFO] org/apache/struts2/showcase/exception/DeleteException.java already added, skipping
[INFO] org/apache/struts2/showcase/exception/DuplicateKeyException.java already added, skipping
[INFO] org/apache/struts2/showcase/exception/UpdateException.java already added, skipping
[INFO] org/apache/struts2/showcase/exception/StorageException.java already added, skipping
[INFO] org/apache/struts2/showcase/exception/CreateException.java already added, skipping
[INFO] org/apache/struts2/showcase/LotsOfOptiontransferselectAction.java already added, skipping
[INFO] org/apache/struts2/showcase/integration/GangsterForm.java already added, skipping
[INFO] org/apache/struts2/showcase/integration/SaveGangsterAction.java already added, skipping
[INFO] org/apache/struts2/showcase/integration/EditGangsterAction.java already added, skipping
[INFO] org/apache/struts2/showcase/action/ExampleAction.java already added, skipping
[INFO] org/apache/struts2/showcase/action/JSPEvalAction.java already added, skipping
[INFO] org/apache/struts2/showcase/action/EmployeeAction.java already added, skipping
[INFO] org/apache/struts2/showcase/action/AbstractCRUDAction.java already added, skipping
[INFO] org/apache/struts2/showcase/action/SkillAction.java already added, skipping
[INFO] org/apache/struts2/showcase/DateAction.java already added, skipping
[INFO] org/apache/struts2/showcase/MoreSelectsAction.java already added, skipping
[INFO] org/apache/struts2/showcase/ShowAjaxDynamicTreeAction.java already added, skipping
[INFO] org/apache/struts2/showcase/source/ViewSourceAction.java already added, skipping
[INFO] org/apache/struts2/showcase/modelDriven/Gangster.java already added, skipping
[INFO] org/apache/struts2/showcase/modelDriven/ModelDrivenAction.java already added, skipping
[INFO] org/apache/struts2/showcase/chat/ChatService.java already added, skipping
[INFO] org/apache/struts2/showcase/chat/ChatAuthenticationInterceptor.java already added,
skipping
[INFO] org/apache/struts2/showcase/chat/ChatSessionListener.java already added, skipping
[INFO] org/apache/struts2/showcase/chat/DateConverter.java already added, skipping
[INFO] org/apache/struts2/showcase/chat/Room.java already added, skipping
[INFO] org/apache/struts2/showcase/chat/ExitRoomAction.java already added, skipping
[INFO] org/apache/struts2/showcase/chat/UsersAvailableInRoomAction.java already added, skipping
[INFO] org/apache/struts2/showcase/chat/MessagesAvailableInRoomAction.java already added,
skipping
[INFO] org/apache/struts2/showcase/chat/ChatInterceptor.java already added, skipping
[INFO] org/apache/struts2/showcase/chat/ChatMessage.java already added, skipping
[INFO] org/apache/struts2/showcase/chat/ChatServiceImpl.java already added, skipping
[INFO] org/apache/struts2/showcase/chat/CrudRoomAction.java already added, skipping
[INFO] org/apache/struts2/showcase/chat/SendMessageToRoomAction.java already added, skipping
[INFO] org/apache/struts2/showcase/chat/User.java already added, skipping
[INFO] org/apache/struts2/showcase/chat/ChatLogoutAction.java already added, skipping
[INFO] org/apache/struts2/showcase/chat/ChatLoginAction.java already added, skipping
[INFO] org/apache/struts2/showcase/chat/UsersAvailableAction.java already added, skipping
[INFO] org/apache/struts2/showcase/chat/EnterRoomAction.java already added, skipping
[INFO] org/apache/struts2/showcase/chat/RoomsAvailableAction.java already added, skipping
[INFO] org/apache/struts2/showcase/chat/Constants.java already added, skipping
[INFO] org/apache/struts2/showcase/chat/ChatException.java already added, skipping
[INFO] org/apache/struts2/showcase/conversion/Person.java already added, skipping
[INFO] org/apache/struts2/showcase/conversion/OperationsEnumAction.java already added, skipping
[INFO] org/apache/struts2/showcase/conversion/PersonAction.java already added, skipping
[INFO] org/apache/struts2/showcase/conversion/Address.java already added, skipping
[INFO] org/apache/struts2/showcase/conversion/EnumTypeConverter.java already added, skipping
[INFO] org/apache/struts2/showcase/conversion/AddressAction.java already added, skipping
[INFO] org/apache/struts2/showcase/conversion/OperationsEnum.java already added, skipping
[INFO] org/apache/struts2/showcase/fileupload/MultipleFileUploadUsingArrayAction.java already
added, skipping
[INFO] org/apache/struts2/showcase/fileupload/FileUploadAction.java already added, skipping
[INFO] org/apache/struts2/showcase/fileupload/MultipleFileUploadUsingListAction.java already
added, skipping
[INFO] org/apache/struts2/showcase/validation/NonFieldValidatorsExampleAction.java already
added, skipping
[INFO] org/apache/struts2/showcase/validation/User.java already added, skipping
[INFO] org/apache/struts2/showcase/validation/AbstractValidationActionSupport.java already
added, skipping
[INFO] org/apache/struts2/showcase/validation/VisitorValidatorsExampleAction.java already
added, skipping
[INFO] org/apache/struts2/showcase/validation/QuizAction.java already added, skipping
[INFO] org/apache/struts2/showcase/validation/SubmitApplication.java already added, skipping
[INFO] org/apache/struts2/showcase/validation/FieldValidatorsExampleAction.java already added,
skipping
[INFO] org/apache/struts2/showcase/dao/EmployeeDao.java already added, skipping
[INFO] org/apache/struts2/showcase/dao/AbstractDao.java already added, skipping
[INFO] org/apache/struts2/showcase/dao/SkillDao.java already added, skipping
[INFO] org/apache/struts2/showcase/dao/Dao.java already added, skipping
[INFO] org/apache/struts2/showcase/wait/LongProcessAction.java already added, skipping
[INFO] org/apache/struts2/showcase/DynamicTreeSelectAction.java already added, skipping
[INFO] org/apache/struts2/showcase/hangman/StartHangmanAction.java already added, skipping
[INFO] org/apache/struts2/showcase/hangman/Vocab.java already added, skipping
[INFO] org/apache/struts2/showcase/hangman/PropertiesVocabSource.java already added, skipping
[INFO] org/apache/struts2/showcase/hangman/GetUpdatedHangmanAction.java already added, skipping
[INFO] org/apache/struts2/showcase/hangman/VocabSource.java already added, skipping
[INFO] org/apache/struts2/showcase/hangman/Hangman.java already added, skipping
[INFO] org/apache/struts2/showcase/hangman/HangmanException.java already added, skipping
[INFO] org/apache/struts2/showcase/hangman/HangmanConstants.java already added, skipping
[INFO] org/apache/struts2/showcase/hangman/GuessCharacterAction.java already added, skipping
[INFO] org/apache/struts2/showcase/hangman/HangmanService.java already added, skipping
[INFO] META-INF already added, skipping
[INFO] META-INF/NOTICE already added, skipping
[INFO] META-INF/DEPENDENCIES already added, skipping
[INFO] META-INF/LICENSE already added, skipping
[WARNING] Artifact org.apache.struts:struts2-showcase:java-source:sources:2.3.16-SNAPSHOT
already attached to project, ignoring duplicate
[INFO] 
[INFO] --- maven-site-plugin:3.1:attach-descriptor (attach-descriptor) @ struts2-showcase
---
[INFO] 
[INFO] --- maven-install-plugin:2.3.1:install (default-install) @ struts2-showcase ---
[INFO] Installing <https://builds.apache.org/job/Struts2-JDK6/ws/struts2/apps/showcase/target/struts2-showcase.war>
to /home/jenkins/jenkins-slave/maven-repositories/0/org/apache/struts/struts2-showcase/2.3.16-SNAPSHOT/struts2-showcase-2.3.16-SNAPSHOT.war
[INFO] Installing <https://builds.apache.org/job/Struts2-JDK6/ws/struts2/apps/showcase/pom.xml>
to /home/jenkins/jenkins-slave/maven-repositories/0/org/apache/struts/struts2-showcase/2.3.16-SNAPSHOT/struts2-showcase-2.3.16-SNAPSHOT.pom
[INFO] Installing <https://builds.apache.org/job/Struts2-JDK6/ws/struts2/apps/showcase/target/struts2-showcase-sources.jar>
to /home/jenkins/jenkins-slave/maven-repositories/0/org/apache/struts/struts2-showcase/2.3.16-SNAPSHOT/struts2-showcase-2.3.16-SNAPSHOT-sources.jar
[INFO] Installing <https://builds.apache.org/job/Struts2-JDK6/ws/struts2/apps/showcase/target/struts2-showcase-javadoc.jar>
to /home/jenkins/jenkins-slave/maven-repositories/0/org/apache/struts/struts2-showcase/2.3.16-SNAPSHOT/struts2-showcase-2.3.16-SNAPSHOT-javadoc.jar
Build timed out (after 85 minutes). Marking the build as failed.
[INFO] ------------------------------------------------------------------------
[INFO] Reactor Summary:
[INFO] 
[INFO] Struts 2 .......................................... SUCCESS [42.572s]
[INFO] XWork: Core ....................................... SUCCESS [1:07.869s]
[INFO] Struts 2 Core ..................................... SUCCESS [1:25.062s]
[INFO] Struts Plugins .................................... SUCCESS [9.647s]
[INFO] Struts 2 Spring Plugin ............................ SUCCESS [17.847s]
[INFO] Struts 2 Convention Plugin ........................ SUCCESS [20.484s]
[INFO] Struts 2 JUnit Plugin ............................. SUCCESS [18.625s]
[INFO] Webapps ........................................... SUCCESS [13.673s]
[INFO] Blank Webapp ...................................... SUCCESS [16.696s]
[INFO] JBoss Blank Webapp ................................ SUCCESS [15.296s]
[INFO] Mail Reader Webapp ................................ SUCCESS [14.571s]
[INFO] Struts 2 Portlet Plugin ........................... SUCCESS [21.363s]
[INFO] Struts 2 DWR Plugin ............................... SUCCESS [13.313s]
[INFO] Struts 2 Tiles Plugin ............................. SUCCESS [11.937s]
[INFO] Struts 2 Portlet Tiles Plugin ..................... SUCCESS [11.872s]
[INFO] Portlet Webapp .................................... SUCCESS [27.428s]
[INFO] Struts 2 Struts 1 Plugin .......................... SUCCESS [14.627s]
[INFO] Struts 2 Dojo Plugin .............................. SUCCESS [37.645s]
[INFO] Struts 2 JSF Plugin ............................... SUCCESS [13.254s]
[INFO] Struts 2 Configuration Browser Plugin ............. SUCCESS [14.126s]
[INFO] Struts 2 Sitemesh Plugin .......................... SUCCESS [14.649s]
[INFO] Struts 2 JSON Plugin .............................. SUCCESS [20.671s]
[INFO] Showcase Webapp ................................... FAILURE [41.745s]
[INFO] Struts 2 REST Plugin .............................. SKIPPED
[INFO] Struts 2 Rest Showcase Example .................... SKIPPED
[INFO] Struts 2 Codebehind Plugin ........................ SKIPPED
[INFO] Struts 2 Java Templates Plugin .................... SKIPPED
[INFO] Struts 2 Jasper Reports Plugin .................... SKIPPED
[INFO] Struts 2 JFreeChart Plugin ........................ SKIPPED
[INFO] Struts 2 Pell Multipart Plugin .................... SKIPPED
[INFO] Struts 2 Plexus Plugin ............................ SKIPPED
[INFO] Struts 2 Sitegraph Plugin ......................... SKIPPED
[INFO] Struts 2 TestNG Plugin ............................ SKIPPED
[INFO] Struts 2 OVal Plugin .............................. SKIPPED
[INFO] Struts 2 OSGi Plugin .............................. SKIPPED
[INFO] Struts 2 Embedded JSP Plugin ...................... SKIPPED
[INFO] Struts 2 GXP Plugin ............................... SKIPPED
[INFO] Struts 2 CDI Plugin ............................... SKIPPED
[INFO] Struts 2 Tiles 3 Plugin ........................... SKIPPED
[INFO] Struts OSGi Bundles ............................... SKIPPED
[INFO] Struts 2 OSGi Admin Bundle ........................ SKIPPED
[INFO] Struts 2 OSGi Demo Bundle ......................... SKIPPED
[INFO] Struts 2 Maven Archetypes ......................... SKIPPED
[INFO] Struts 2 Archetypes - Angular JS .................. SKIPPED
[INFO] Struts 2 Archetypes - Blank ....................... SKIPPED
[INFO] Struts 2 Archetypes - Blank Convention ............ SKIPPED
[INFO] Struts 2 Archetypes - Database Portlet ............ SKIPPED
[INFO] Struts 2 Archetypes - Plugin ...................... SKIPPED
[INFO] Struts 2 Archetypes - Portlet ..................... SKIPPED
[INFO] Struts 2 Archetypes - Starter ..................... SKIPPED
[INFO] ------------------------------------------------------------------------
[INFO] BUILD FAILURE
[INFO] ------------------------------------------------------------------------
[INFO] Total time: 1:22:40.657s
[INFO] Finished at: Fri Nov 29 15:19:21 UTC 2013
[INFO] Final Memory: 73M/180M
[INFO] ------------------------------------------------------------------------
[ERROR] Internal error: java.lang.IllegalStateException: Unable to call isArchivingDisabled.
Invalid object ID 43 -> [Help 1]
org.apache.maven.InternalErrorException: Internal error: java.lang.IllegalStateException:
Unable to call isArchivingDisabled. Invalid object ID 43
	at org.apache.maven.DefaultMaven.execute(DefaultMaven.java:168)
	at org.jvnet.hudson.maven3.launcher.Maven3Launcher.main(Maven3Launcher.java:117)
	at sun.reflect.NativeMethodAccessorImpl.invoke0(Native Method)
	at sun.reflect.NativeMethodAccessorImpl.invoke(NativeMethodAccessorImpl.java:39)
	at sun.reflect.DelegatingMethodAccessorImpl.invoke(DelegatingMethodAccessorImpl.java:25)
	at java.lang.reflect.Method.invoke(Method.java:597)
	at org.codehaus.plexus.classworlds.launcher.Launcher.launchStandard(Launcher.java:329)
	at org.codehaus.plexus.classworlds.launcher.Launcher.launch(Launcher.java:239)
	at org.jvnet.hudson.maven3.agent.Maven3Main.launch(Maven3Main.java:178)
	at sun.reflect.NativeMethodAccessorImpl.invoke0(Native Method)
	at sun.reflect.NativeMethodAccessorImpl.invoke(NativeMethodAccessorImpl.java:39)
	at sun.reflect.DelegatingMethodAccessorImpl.invoke(DelegatingMethodAccessorImpl.java:25)
	at java.lang.reflect.Method.invoke(Method.java:597)
	at hudson.maven.Maven3Builder.call(Maven3Builder.java:134)
	at hudson.maven.Maven3Builder.call(Maven3Builder.java:69)
	at hudson.remoting.UserRequest.perform(UserRequest.java:118)
	at hudson.remoting.UserRequest.perform(UserRequest.java:48)
	at hudson.remoting.Request$2.run(Request.java:328)
	at hudson.remoting.InterceptingExecutorService$1.call(InterceptingExecutorService.java:72)
	at java.util.concurrent.FutureTask$Sync.innerRun(FutureTask.java:303)
	at java.util.concurrent.FutureTask.run(FutureTask.java:138)
	at java.util.concurrent.ThreadPoolExecutor$Worker.runTask(ThreadPoolExecutor.java:895)
	at java.util.concurrent.ThreadPoolExecutor$Worker.run(ThreadPoolExecutor.java:918)
	at java.lang.Thread.run(Thread.java:662)
Caused by: java.lang.IllegalStateException: Unable to call isArchivingDisabled. Invalid object
ID 43
	at hudson.remoting.RemoteInvocationHandler$RPCRequest.perform(RemoteInvocationHandler.java:293)
	at hudson.remoting.RemoteInvocationHandler$RPCRequest.call(RemoteInvocationHandler.java:280)
	at hudson.remoting.RemoteInvocationHandler$RPCRequest.call(RemoteInvocationHandler.java:239)
	at hudson.remoting.UserRequest.perform(UserRequest.java:118)
	at hudson.remoting.UserRequest.perform(UserRequest.java:48)
	at hudson.remoting.Request$2.run(Request.java:328)
	at hudson.remoting.InterceptingExecutorService$1.call(InterceptingExecutorService.java:72)
	at java.util.concurrent.FutureTask$Sync.innerRun(FutureTask.java:334)
	at java.util.concurrent.FutureTask.run(FutureTask.java:166)
	at java.util.concurrent.ThreadPoolExecutor.runWorker(ThreadPoolExecutor.java:1145)
	at java.util.concurrent.ThreadPoolExecutor$Worker.run(ThreadPoolExecutor.java:615)
	at java.lang.Thread.run(Thread.java:724)
[ERROR] 
[ERROR] To see the full stack trace of the errors, re-run Maven with the -e switch.
[ERROR] Re-run Maven using the -X switch to enable full debug logging.
[ERROR] 
[ERROR] For more information about the errors and possible solutions, please read the following
articles:
[ERROR] [Help 1] http://cwiki.apache.org/confluence/display/MAVEN/InternalErrorException
channel stopped
[locks-and-latches] Releasing all the locks
[locks-and-latches] All the locks released
Updating WW-4227

---------------------------------------------------------------------
To unsubscribe, e-mail: dev-unsubscribe@struts.apache.org
For additional commands, e-mail: dev-help@struts.apache.org


Mime
View raw message