struts-dev mailing list archives

Site index · List index
Message view « Date » · « Thread »
Top « Date » · « Thread »
From Apache Jenkins Server <jenk...@builds.apache.org>
Subject Build failed in Jenkins: Struts2-JDK6 #844
Date Mon, 18 Nov 2013 00:10:04 GMT
See <https://builds.apache.org/job/Struts2-JDK6/844/changes>

Changes:

[Lukasz Lenart] WW-4243 Splits interface in to two to allow using different implementation

------------------------------------------
[...truncated 12560 lines...]
Running org.apache.struts2.portlet.result.PortletResultTest
Tests run: 5, Failures: 0, Errors: 0, Skipped: 0, Time elapsed: 0.018 sec
Running org.apache.struts2.portlet.context.PortletActionContextTest
Tests run: 11, Failures: 0, Errors: 0, Skipped: 0, Time elapsed: 0.022 sec
Running org.apache.struts2.components.PortletUrlRendererTest
Tests run: 2, Failures: 0, Errors: 0, Skipped: 0, Time elapsed: 0.274 sec
Running org.apache.struts2.views.jsp.PortletUrlTagTest
Tests run: 11, Failures: 0, Errors: 0, Skipped: 0, Time elapsed: 0.904 sec
Running org.apache.struts2.portlet.interceptor.PortletStateInterceptorTest
Tests run: 3, Failures: 0, Errors: 0, Skipped: 0, Time elapsed: 0.209 sec

Results :

Tests run: 61, Failures: 0, Errors: 0, Skipped: 0

[JENKINS] Recording test results
[INFO] 
[INFO] --- maven-jar-plugin:2.3.1:jar (default-jar) @ struts2-portlet-plugin ---
[INFO] Building jar: <https://builds.apache.org/job/Struts2-JDK6/ws/struts2/plugins/portlet/target/struts2-portlet-plugin-2.3.16-SNAPSHOT.jar>
[WARNING] Failed to getClass for org.apache.maven.plugin.source.SourceJarMojo
[INFO] 
[INFO] --- maven-source-plugin:2.1.2:jar (attach-source) @ struts2-portlet-plugin ---
[INFO] META-INF already added, skipping
[INFO] META-INF/NOTICE already added, skipping
[INFO] META-INF/DEPENDENCIES already added, skipping
[INFO] META-INF/LICENSE already added, skipping
[INFO] Building jar: <https://builds.apache.org/job/Struts2-JDK6/ws/struts2/plugins/portlet/target/struts2-portlet-plugin-2.3.16-SNAPSHOT-sources.jar>
[INFO] META-INF already added, skipping
[INFO] META-INF/NOTICE already added, skipping
[INFO] META-INF/DEPENDENCIES already added, skipping
[INFO] META-INF/LICENSE already added, skipping
[WARNING] Artifact org.apache.struts:struts2-portlet-plugin:java-source:sources:2.3.16-SNAPSHOT
already attached to project, ignoring duplicate
[INFO] 
[INFO] --- maven-site-plugin:3.1:attach-descriptor (attach-descriptor) @ struts2-portlet-plugin
---
[INFO] 
[INFO] --- maven-install-plugin:2.3.1:install (default-install) @ struts2-portlet-plugin ---
[INFO] Installing <https://builds.apache.org/job/Struts2-JDK6/ws/struts2/plugins/portlet/target/struts2-portlet-plugin-2.3.16-SNAPSHOT.jar>
to /home/jenkins/jenkins-slave/maven-repositories/1/org/apache/struts/struts2-portlet-plugin/2.3.16-SNAPSHOT/struts2-portlet-plugin-2.3.16-SNAPSHOT.jar
[INFO] Installing <https://builds.apache.org/job/Struts2-JDK6/ws/struts2/plugins/portlet/pom.xml>
to /home/jenkins/jenkins-slave/maven-repositories/1/org/apache/struts/struts2-portlet-plugin/2.3.16-SNAPSHOT/struts2-portlet-plugin-2.3.16-SNAPSHOT.pom
[INFO] Installing <https://builds.apache.org/job/Struts2-JDK6/ws/struts2/plugins/portlet/target/struts2-portlet-plugin-2.3.16-SNAPSHOT-sources.jar>
to /home/jenkins/jenkins-slave/maven-repositories/1/org/apache/struts/struts2-portlet-plugin/2.3.16-SNAPSHOT/struts2-portlet-plugin-2.3.16-SNAPSHOT-sources.jar
[INFO] Installing <https://builds.apache.org/job/Struts2-JDK6/ws/struts2/plugins/portlet/target/struts2-portlet-plugin-2.3.16-SNAPSHOT-javadoc.jar>
to /home/jenkins/jenkins-slave/maven-repositories/1/org/apache/struts/struts2-portlet-plugin/2.3.16-SNAPSHOT/struts2-portlet-plugin-2.3.16-SNAPSHOT-javadoc.jar
[INFO]                                                                         
[INFO] ------------------------------------------------------------------------
[INFO] Building Struts 2 DWR Plugin 2.3.16-SNAPSHOT
[INFO] ------------------------------------------------------------------------
[INFO] 
[INFO] --- maven-clean-plugin:2.4.1:clean (default-clean) @ struts2-dwr-plugin ---
[WARNING] Failed to getClass for org.apache.maven.plugin.source.SourceJarMojo
[INFO] 
[INFO] --- maven-source-plugin:2.1.2:jar (default-cli) @ struts2-dwr-plugin ---
[INFO] Building jar: <https://builds.apache.org/job/Struts2-JDK6/ws/struts2/plugins/dwr/target/struts2-dwr-plugin-2.3.16-SNAPSHOT-sources.jar>
[INFO] 
[INFO] --- maven-javadoc-plugin:2.8:jar (default-cli) @ struts2-dwr-plugin ---
[INFO] 
Loading source files for package org.apache.struts2.validators...
Constructing Javadoc information...
Standard Doclet version 1.6.0_45
Building tree for all the packages and classes...
Generating <https://builds.apache.org/job/Struts2-JDK6/ws/struts2/plugins/dwr/target/apidocs/org/apache/struts2/validators//DWRValidator.html...>
Generating <https://builds.apache.org/job/Struts2-JDK6/ws/struts2/plugins/dwr/target/apidocs/org/apache/struts2/validators//DWRValidator.ValidatorActionInvocation.html...>
Generating <https://builds.apache.org/job/Struts2-JDK6/ws/struts2/plugins/dwr/target/apidocs/org/apache/struts2/validators//package-frame.html...>
Generating <https://builds.apache.org/job/Struts2-JDK6/ws/struts2/plugins/dwr/target/apidocs/org/apache/struts2/validators//package-summary.html...>
Generating <https://builds.apache.org/job/Struts2-JDK6/ws/struts2/plugins/dwr/target/apidocs/org/apache/struts2/validators//package-tree.html...>
Generating <https://builds.apache.org/job/Struts2-JDK6/ws/struts2/plugins/dwr/target/apidocs/constant-values.html...>
Generating <https://builds.apache.org/job/Struts2-JDK6/ws/struts2/plugins/dwr/target/apidocs/serialized-form.html...>
Generating <https://builds.apache.org/job/Struts2-JDK6/ws/struts2/plugins/dwr/target/apidocs/org/apache/struts2/validators//class-use/DWRValidator.html...>
Generating <https://builds.apache.org/job/Struts2-JDK6/ws/struts2/plugins/dwr/target/apidocs/org/apache/struts2/validators//class-use/DWRValidator.ValidatorActionInvocation.html...>
Generating <https://builds.apache.org/job/Struts2-JDK6/ws/struts2/plugins/dwr/target/apidocs/org/apache/struts2/validators//package-use.html...>
Building index for all the packages and classes...
Generating <https://builds.apache.org/job/Struts2-JDK6/ws/struts2/plugins/dwr/target/apidocs/overview-tree.html...>
Generating <https://builds.apache.org/job/Struts2-JDK6/ws/struts2/plugins/dwr/target/apidocs/index-all.html...>
Generating <https://builds.apache.org/job/Struts2-JDK6/ws/struts2/plugins/dwr/target/apidocs/deprecated-list.html...>
Building index for all classes...
Generating <https://builds.apache.org/job/Struts2-JDK6/ws/struts2/plugins/dwr/target/apidocs/allclasses-frame.html...>
Generating <https://builds.apache.org/job/Struts2-JDK6/ws/struts2/plugins/dwr/target/apidocs/allclasses-noframe.html...>
Generating <https://builds.apache.org/job/Struts2-JDK6/ws/struts2/plugins/dwr/target/apidocs/index.html...>
Generating <https://builds.apache.org/job/Struts2-JDK6/ws/struts2/plugins/dwr/target/apidocs/help-doc.html...>
Generating <https://builds.apache.org/job/Struts2-JDK6/ws/struts2/plugins/dwr/target/apidocs/stylesheet.css...>
[INFO] Building jar: <https://builds.apache.org/job/Struts2-JDK6/ws/struts2/plugins/dwr/target/struts2-dwr-plugin-2.3.16-SNAPSHOT-javadoc.jar>
[INFO] 
[INFO] --- maven-remote-resources-plugin:1.2.1:process (default) @ struts2-dwr-plugin ---
[INFO] 
[INFO] --- maven-resources-plugin:2.5:resources (default-resources) @ struts2-dwr-plugin ---
[debug] execute contextualize
[INFO] Using 'UTF-8' encoding to copy filtered resources.
[INFO] skip non existing resourceDirectory <https://builds.apache.org/job/Struts2-JDK6/ws/struts2/plugins/dwr/src/main/resources>
[INFO] Copying 3 resources
[INFO] 
[INFO] --- maven-compiler-plugin:2.3.2:compile (default-compile) @ struts2-dwr-plugin ---
[INFO] Compiling 1 source file to <https://builds.apache.org/job/Struts2-JDK6/ws/struts2/plugins/dwr/target/classes>
[INFO] 
[INFO] --- maven-bundle-plugin:2.1.0:manifest (bundle-manifest) @ struts2-dwr-plugin ---
[WARNING] Warning in manifest for org.apache.struts:struts2-dwr-plugin:jar:2.3.16-SNAPSHOT
: Superfluous export-package instructions: [org.apache, org.apache.struts2, org]
[INFO] 
[INFO] --- maven-resources-plugin:2.5:testResources (default-testResources) @ struts2-dwr-plugin
---
[debug] execute contextualize
[INFO] Using 'UTF-8' encoding to copy filtered resources.
[INFO] skip non existing resourceDirectory <https://builds.apache.org/job/Struts2-JDK6/ws/struts2/plugins/dwr/src/test/resources>
[INFO] Copying 3 resources
[INFO] 
[INFO] --- maven-compiler-plugin:2.3.2:testCompile (default-testCompile) @ struts2-dwr-plugin
---
[INFO] No sources to compile
[INFO] 
[INFO] --- maven-surefire-plugin:2.3.1:test (default-test) @ struts2-dwr-plugin ---
[INFO] Surefire report directory: <https://builds.apache.org/job/Struts2-JDK6/ws/struts2/plugins/dwr/target/surefire-reports>

-------------------------------------------------------
 T E S T S
-------------------------------------------------------
There are no tests to run.

Results :

Tests run: 0, Failures: 0, Errors: 0, Skipped: 0

[JENKINS] Recording test results
[INFO] 
[INFO] --- maven-jar-plugin:2.3.1:jar (default-jar) @ struts2-dwr-plugin ---
[INFO] Building jar: <https://builds.apache.org/job/Struts2-JDK6/ws/struts2/plugins/dwr/target/struts2-dwr-plugin-2.3.16-SNAPSHOT.jar>
[WARNING] Failed to getClass for org.apache.maven.plugin.source.SourceJarMojo
[INFO] 
[INFO] --- maven-source-plugin:2.1.2:jar (attach-source) @ struts2-dwr-plugin ---
[INFO] META-INF already added, skipping
[INFO] META-INF/NOTICE already added, skipping
[INFO] META-INF/DEPENDENCIES already added, skipping
[INFO] META-INF/LICENSE already added, skipping
[INFO] Building jar: <https://builds.apache.org/job/Struts2-JDK6/ws/struts2/plugins/dwr/target/struts2-dwr-plugin-2.3.16-SNAPSHOT-sources.jar>
[INFO] META-INF already added, skipping
[INFO] META-INF/NOTICE already added, skipping
[INFO] META-INF/DEPENDENCIES already added, skipping
[INFO] META-INF/LICENSE already added, skipping
[WARNING] Artifact org.apache.struts:struts2-dwr-plugin:java-source:sources:2.3.16-SNAPSHOT
already attached to project, ignoring duplicate
[INFO] 
[INFO] --- maven-site-plugin:3.1:attach-descriptor (attach-descriptor) @ struts2-dwr-plugin
---
[INFO] 
[INFO] --- maven-install-plugin:2.3.1:install (default-install) @ struts2-dwr-plugin ---
[INFO] Installing <https://builds.apache.org/job/Struts2-JDK6/ws/struts2/plugins/dwr/target/struts2-dwr-plugin-2.3.16-SNAPSHOT.jar>
to /home/jenkins/jenkins-slave/maven-repositories/1/org/apache/struts/struts2-dwr-plugin/2.3.16-SNAPSHOT/struts2-dwr-plugin-2.3.16-SNAPSHOT.jar
[INFO] Installing <https://builds.apache.org/job/Struts2-JDK6/ws/struts2/plugins/dwr/pom.xml>
to /home/jenkins/jenkins-slave/maven-repositories/1/org/apache/struts/struts2-dwr-plugin/2.3.16-SNAPSHOT/struts2-dwr-plugin-2.3.16-SNAPSHOT.pom
[INFO] Installing <https://builds.apache.org/job/Struts2-JDK6/ws/struts2/plugins/dwr/target/struts2-dwr-plugin-2.3.16-SNAPSHOT-sources.jar>
to /home/jenkins/jenkins-slave/maven-repositories/1/org/apache/struts/struts2-dwr-plugin/2.3.16-SNAPSHOT/struts2-dwr-plugin-2.3.16-SNAPSHOT-sources.jar
[INFO] Installing <https://builds.apache.org/job/Struts2-JDK6/ws/struts2/plugins/dwr/target/struts2-dwr-plugin-2.3.16-SNAPSHOT-javadoc.jar>
to /home/jenkins/jenkins-slave/maven-repositories/1/org/apache/struts/struts2-dwr-plugin/2.3.16-SNAPSHOT/struts2-dwr-plugin-2.3.16-SNAPSHOT-javadoc.jar
Build timed out (after 85 minutes). Marking the build as failed.
[INFO] ------------------------------------------------------------------------
[INFO] Reactor Summary:
[INFO] 
[INFO] Struts 2 .......................................... SUCCESS [38.873s]
[INFO] XWork: Core ....................................... SUCCESS [2:08.413s]
[INFO] Struts 2 Core ..................................... SUCCESS [1:33.202s]
[INFO] Struts Plugins .................................... SUCCESS [2:40.849s]
[INFO] Struts 2 Spring Plugin ............................ SUCCESS [35.684s]
[INFO] Struts 2 Convention Plugin ........................ SUCCESS [1:58.776s]
[INFO] Struts 2 JUnit Plugin ............................. SUCCESS [3:41.969s]
[INFO] Webapps ........................................... SUCCESS [15.312s]
[INFO] Blank Webapp ...................................... SUCCESS [1:34.259s]
[INFO] JBoss Blank Webapp ................................ SUCCESS [33.900s]
[INFO] Mail Reader Webapp ................................ SUCCESS [37.236s]
[INFO] Struts 2 Portlet Plugin ........................... SUCCESS [47.900s]
[INFO] Struts 2 DWR Plugin ............................... FAILURE [25.371s]
[INFO] Struts 2 Tiles Plugin ............................. SKIPPED
[INFO] Struts 2 Portlet Tiles Plugin ..................... SKIPPED
[INFO] Portlet Webapp .................................... SKIPPED
[INFO] Struts 2 Struts 1 Plugin .......................... SKIPPED
[INFO] Struts 2 Dojo Plugin .............................. SKIPPED
[INFO] Struts 2 JSF Plugin ............................... SKIPPED
[INFO] Struts 2 Configuration Browser Plugin ............. SKIPPED
[INFO] Struts 2 Sitemesh Plugin .......................... SKIPPED
[INFO] Struts 2 JSON Plugin .............................. SKIPPED
[INFO] Showcase Webapp ................................... SKIPPED
[INFO] Struts 2 REST Plugin .............................. SKIPPED
[INFO] Struts 2 Rest Showcase Example .................... SKIPPED
[INFO] Struts 2 Codebehind Plugin ........................ SKIPPED
[INFO] Struts 2 Java Templates Plugin .................... SKIPPED
[INFO] Struts 2 Jasper Reports Plugin .................... SKIPPED
[INFO] Struts 2 JFreeChart Plugin ........................ SKIPPED
[INFO] Struts 2 Pell Multipart Plugin .................... SKIPPED
[INFO] Struts 2 Plexus Plugin ............................ SKIPPED
[INFO] Struts 2 Sitegraph Plugin ......................... SKIPPED
[INFO] Struts 2 TestNG Plugin ............................ SKIPPED
[INFO] Struts 2 OVal Plugin .............................. SKIPPED
[INFO] Struts 2 OSGi Plugin .............................. SKIPPED
[INFO] Struts 2 Embedded JSP Plugin ...................... SKIPPED
[INFO] Struts 2 GXP Plugin ............................... SKIPPED
[INFO] Struts 2 CDI Plugin ............................... SKIPPED
[INFO] Struts 2 Tiles 3 Plugin ........................... SKIPPED
[INFO] Struts OSGi Bundles ............................... SKIPPED
[INFO] Struts 2 OSGi Admin Bundle ........................ SKIPPED
[INFO] Struts 2 OSGi Demo Bundle ......................... SKIPPED
[INFO] Struts 2 Maven Archetypes ......................... SKIPPED
[INFO] Struts 2 Archetypes - Angular JS .................. SKIPPED
[INFO] Struts 2 Archetypes - Blank ....................... SKIPPED
[INFO] Struts 2 Archetypes - Blank Convention ............ SKIPPED
[INFO] Struts 2 Archetypes - Database Portlet ............ SKIPPED
[INFO] Struts 2 Archetypes - Plugin ...................... SKIPPED
[INFO] Struts 2 Archetypes - Portlet ..................... SKIPPED
[INFO] Struts 2 Archetypes - Starter ..................... SKIPPED
[INFO] ------------------------------------------------------------------------
[INFO] BUILD FAILURE
[INFO] ------------------------------------------------------------------------
[INFO] Total time: 1:23:32.019s
[INFO] Finished at: Sun Nov 17 22:11:05 UTC 2013
[INFO] Final Memory: 79M/166M
[INFO] ------------------------------------------------------------------------
[ERROR] Internal error: java.lang.IllegalStateException: Unable to call isArchivingDisabled.
Invalid object ID 43 -> [Help 1]
org.apache.maven.InternalErrorException: Internal error: java.lang.IllegalStateException:
Unable to call isArchivingDisabled. Invalid object ID 43
	at org.apache.maven.DefaultMaven.execute(DefaultMaven.java:168)
	at org.jvnet.hudson.maven3.launcher.Maven3Launcher.main(Maven3Launcher.java:117)
	at sun.reflect.NativeMethodAccessorImpl.invoke0(Native Method)
	at sun.reflect.NativeMethodAccessorImpl.invoke(NativeMethodAccessorImpl.java:39)
	at sun.reflect.DelegatingMethodAccessorImpl.invoke(DelegatingMethodAccessorImpl.java:25)
	at java.lang.reflect.Method.invoke(Method.java:597)
	at org.codehaus.plexus.classworlds.launcher.Launcher.launchStandard(Launcher.java:329)
	at org.codehaus.plexus.classworlds.launcher.Launcher.launch(Launcher.java:239)
	at org.jvnet.hudson.maven3.agent.Maven3Main.launch(Maven3Main.java:178)
	at sun.reflect.NativeMethodAccessorImpl.invoke0(Native Method)
	at sun.reflect.NativeMethodAccessorImpl.invoke(NativeMethodAccessorImpl.java:39)
	at sun.reflect.DelegatingMethodAccessorImpl.invoke(DelegatingMethodAccessorImpl.java:25)
	at java.lang.reflect.Method.invoke(Method.java:597)
	at hudson.maven.Maven3Builder.call(Maven3Builder.java:134)
	at hudson.maven.Maven3Builder.call(Maven3Builder.java:69)
	at hudson.remoting.UserRequest.perform(UserRequest.java:118)
	at hudson.remoting.UserRequest.perform(UserRequest.java:48)
	at hudson.remoting.Request$2.run(Request.java:326)
	at hudson.remoting.InterceptingExecutorService$1.call(InterceptingExecutorService.java:72)
	at java.util.concurrent.FutureTask$Sync.innerRun(FutureTask.java:303)
	at java.util.concurrent.FutureTask.run(FutureTask.java:138)
	at java.util.concurrent.ThreadPoolExecutor$Worker.runTask(ThreadPoolExecutor.java:895)
	at java.util.concurrent.ThreadPoolExecutor$Worker.run(ThreadPoolExecutor.java:918)
	at java.lang.Thread.run(Thread.java:662)
Caused by: java.lang.IllegalStateException: Unable to call isArchivingDisabled. Invalid object
ID 43
	at hudson.remoting.RemoteInvocationHandler$RPCRequest.perform(RemoteInvocationHandler.java:293)
	at hudson.remoting.RemoteInvocationHandler$RPCRequest.call(RemoteInvocationHandler.java:280)
	at hudson.remoting.RemoteInvocationHandler$RPCRequest.call(RemoteInvocationHandler.java:239)
	at hudson.remoting.UserRequest.perform(UserRequest.java:118)
	at hudson.remoting.UserRequest.perform(UserRequest.java:48)
	at hudson.remoting.Request$2.run(Request.java:326)
	at hudson.remoting.InterceptingExecutorService$1.call(InterceptingExecutorService.java:72)
	at java.util.concurrent.FutureTask$Sync.innerRun(FutureTask.java:334)
	at java.util.concurrent.FutureTask.run(FutureTask.java:166)
	at java.util.concurrent.ThreadPoolExecutor.runWorker(ThreadPoolExecutor.java:1145)
	at java.util.concurrent.ThreadPoolExecutor$Worker.run(ThreadPoolExecutor.java:615)
	at java.lang.Thread.run(Thread.java:724)
[ERROR] 
[ERROR] To see the full stack trace of the errors, re-run Maven with the -e switch.
[ERROR] Re-run Maven using the -X switch to enable full debug logging.
[ERROR] 
[ERROR] For more information about the errors and possible solutions, please read the following
articles:
[ERROR] [Help 1] http://cwiki.apache.org/confluence/display/MAVEN/InternalErrorException
channel stopped
[locks-and-latches] Releasing all the locks
[locks-and-latches] All the locks released
Updating WW-4243

---------------------------------------------------------------------
To unsubscribe, e-mail: dev-unsubscribe@struts.apache.org
For additional commands, e-mail: dev-help@struts.apache.org


Mime
View raw message