struts-dev mailing list archives

Site index · List index
Message view « Date » · « Thread »
Top « Date » · « Thread »
From Apache Jenkins Server <jenk...@builds.apache.org>
Subject Build failed in Jenkins: Struts2-JDK6 #841
Date Wed, 13 Nov 2013 08:33:49 GMT
See <https://builds.apache.org/job/Struts2-JDK6/841/>

------------------------------------------
[...truncated 4537 lines...]
[INFO] Copying 19 resources
[INFO] Copying 3 resources
[INFO] 
[INFO] --- maven-compiler-plugin:2.3.2:testCompile (default-testCompile) @ struts2-dojo-plugin
---
[INFO] Compiling 19 source files to <https://builds.apache.org/job/Struts2-JDK6/ws/struts2/plugins/dojo/target/test-classes>
[INFO] 
[INFO] --- maven-surefire-plugin:2.3.1:test (default-test) @ struts2-dojo-plugin ---
[INFO] Surefire report directory: <https://builds.apache.org/job/Struts2-JDK6/ws/struts2/plugins/dojo/target/surefire-reports>

-------------------------------------------------------
 T E S T S
-------------------------------------------------------
Running org.apache.struts2.dojo.views.jsp.ui.SubmitAjaxTest
Tests run: 3, Failures: 0, Errors: 0, Skipped: 0, Time elapsed: 1.464 sec
[JENKINS] Recording test results
Running org.apache.struts2.dojo.views.jsp.ui.HeadTagTest
Tests run: 2, Failures: 0, Errors: 0, Skipped: 0, Time elapsed: 0.383 sec
Running org.apache.struts2.dojo.views.jsp.ui.DivTest
Tests run: 1, Failures: 0, Errors: 0, Skipped: 0, Time elapsed: 0.158 sec
Running org.apache.struts2.dojo.views.jsp.ui.TreeTest
Tests run: 2, Failures: 0, Errors: 0, Skipped: 0, Time elapsed: 0.333 sec
Running org.apache.struts2.dojo.views.jsp.ui.AnchorTest
Tests run: 1, Failures: 0, Errors: 0, Skipped: 0, Time elapsed: 0.125 sec
Running org.apache.struts2.dojo.views.jsp.ui.DateTimePickerTagTest
Tests run: 4, Failures: 0, Errors: 0, Skipped: 0, Time elapsed: 0.502 sec
Running org.apache.struts2.dojo.views.jsp.ui.AutocompleterTest
Tests run: 2, Failures: 0, Errors: 0, Skipped: 0, Time elapsed: 0.297 sec
Running org.apache.struts2.dojo.views.jsp.ui.BindTest
Tests run: 1, Failures: 0, Errors: 0, Skipped: 0, Time elapsed: 0.125 sec
Running org.apache.struts2.dojo.views.jsp.ui.TabbedPanelTagTest
Tests run: 3, Failures: 0, Errors: 0, Skipped: 0, Time elapsed: 0.284 sec

Results :

Tests run: 19, Failures: 0, Errors: 0, Skipped: 0

[INFO] 
[INFO] --- maven-jar-plugin:2.3.1:jar (default-jar) @ struts2-dojo-plugin ---
[INFO] Building jar: <https://builds.apache.org/job/Struts2-JDK6/ws/struts2/plugins/dojo/target/struts2-dojo-plugin-2.3.16-SNAPSHOT.jar>
[WARNING] Failed to getClass for org.apache.maven.plugin.source.SourceJarMojo
[INFO] 
[INFO] --- maven-source-plugin:2.1.2:jar (attach-source) @ struts2-dojo-plugin ---
[INFO] org already added, skipping
[INFO] org/apache already added, skipping
[INFO] org/apache/struts2 already added, skipping
[INFO] META-INF already added, skipping
[INFO] META-INF already added, skipping
[INFO] META-INF/NOTICE already added, skipping
[INFO] META-INF/LICENSE already added, skipping
[INFO] META-INF/DEPENDENCIES already added, skipping
[INFO] Building jar: <https://builds.apache.org/job/Struts2-JDK6/ws/struts2/plugins/dojo/target/struts2-dojo-plugin-2.3.16-SNAPSHOT-sources.jar>
[INFO] org already added, skipping
[INFO] org/apache already added, skipping
[INFO] org/apache/struts2 already added, skipping
[INFO] META-INF already added, skipping
[INFO] META-INF already added, skipping
[INFO] META-INF/NOTICE already added, skipping
[INFO] META-INF/LICENSE already added, skipping
[INFO] META-INF/DEPENDENCIES already added, skipping
[INFO] 
[INFO] --- maven-site-plugin:3.1:attach-descriptor (attach-descriptor) @ struts2-dojo-plugin
---
[INFO] 
[INFO] --- maven-install-plugin:2.3.1:install (default-install) @ struts2-dojo-plugin ---
[INFO] Installing <https://builds.apache.org/job/Struts2-JDK6/ws/struts2/plugins/dojo/target/struts2-dojo-plugin-2.3.16-SNAPSHOT.jar>
to /home/jenkins/jenkins-slave/maven-repositories/1/org/apache/struts/struts2-dojo-plugin/2.3.16-SNAPSHOT/struts2-dojo-plugin-2.3.16-SNAPSHOT.jar
[INFO] Installing <https://builds.apache.org/job/Struts2-JDK6/ws/struts2/plugins/dojo/pom.xml>
to /home/jenkins/jenkins-slave/maven-repositories/1/org/apache/struts/struts2-dojo-plugin/2.3.16-SNAPSHOT/struts2-dojo-plugin-2.3.16-SNAPSHOT.pom
[INFO] Installing <https://builds.apache.org/job/Struts2-JDK6/ws/struts2/plugins/dojo/target/struts2-dojo-plugin-2.3.16-SNAPSHOT-sources.jar>
to /home/jenkins/jenkins-slave/maven-repositories/1/org/apache/struts/struts2-dojo-plugin/2.3.16-SNAPSHOT/struts2-dojo-plugin-2.3.16-SNAPSHOT-sources.jar
[INFO]                                                                         
[INFO] ------------------------------------------------------------------------
[INFO] Building Struts 2 JSF Plugin 2.3.16-SNAPSHOT
[INFO] ------------------------------------------------------------------------
[INFO] 
[INFO] --- maven-clean-plugin:2.4.1:clean (default-clean) @ struts2-jsf-plugin ---
[INFO] Deleting <https://builds.apache.org/job/Struts2-JDK6/ws/struts2/plugins/jsf/target>
[INFO] 
[INFO] --- maven-remote-resources-plugin:1.2.1:process (default) @ struts2-jsf-plugin ---
[INFO] 
[INFO] --- maven-resources-plugin:2.5:resources (default-resources) @ struts2-jsf-plugin ---
[debug] execute contextualize
[INFO] Using 'UTF-8' encoding to copy filtered resources.
[INFO] Copying 4 resources
[INFO] Copying 3 resources
[INFO] 
[INFO] --- maven-compiler-plugin:2.3.2:compile (default-compile) @ struts2-jsf-plugin ---
[INFO] Compiling 12 source files to <https://builds.apache.org/job/Struts2-JDK6/ws/struts2/plugins/jsf/target/classes>
[INFO] 
[INFO] --- maven-bundle-plugin:2.1.0:manifest (bundle-manifest) @ struts2-jsf-plugin ---
[WARNING] Warning in manifest for org.apache.struts:struts2-jsf-plugin:jar:2.3.16-SNAPSHOT
: Superfluous export-package instructions: [org.apache, org.apache.struts2, org]
[INFO] 
[INFO] --- maven-resources-plugin:2.5:testResources (default-testResources) @ struts2-jsf-plugin
---
[debug] execute contextualize
[INFO] Using 'UTF-8' encoding to copy filtered resources.
[INFO] skip non existing resourceDirectory <https://builds.apache.org/job/Struts2-JDK6/ws/struts2/plugins/jsf/src/test/resources>
[INFO] Copying 3 resources
[INFO] 
[INFO] --- maven-compiler-plugin:2.3.2:testCompile (default-testCompile) @ struts2-jsf-plugin
---
[INFO] No sources to compile
[INFO] 
[INFO] --- maven-surefire-plugin:2.3.1:test (default-test) @ struts2-jsf-plugin ---
[INFO] Surefire report directory: <https://builds.apache.org/job/Struts2-JDK6/ws/struts2/plugins/jsf/target/surefire-reports>

-------------------------------------------------------
 T E S T S
-------------------------------------------------------
There are no tests to run.

Results :

Tests run: 0, Failures: 0, Errors: 0, Skipped: 0

[JENKINS] Recording test results
[INFO] 
[INFO] --- maven-jar-plugin:2.3.1:jar (default-jar) @ struts2-jsf-plugin ---
[INFO] Building jar: <https://builds.apache.org/job/Struts2-JDK6/ws/struts2/plugins/jsf/target/struts2-jsf-plugin-2.3.16-SNAPSHOT.jar>
[WARNING] Failed to getClass for org.apache.maven.plugin.source.SourceJarMojo
[INFO] 
[INFO] --- maven-source-plugin:2.1.2:jar (attach-source) @ struts2-jsf-plugin ---
[INFO] org already added, skipping
[INFO] org/apache already added, skipping
[INFO] org/apache/struts2 already added, skipping
[INFO] org/apache/struts2/jsf already added, skipping
[INFO] META-INF already added, skipping
[INFO] META-INF/NOTICE already added, skipping
[INFO] META-INF/LICENSE already added, skipping
[INFO] META-INF/DEPENDENCIES already added, skipping
[INFO] Building jar: <https://builds.apache.org/job/Struts2-JDK6/ws/struts2/plugins/jsf/target/struts2-jsf-plugin-2.3.16-SNAPSHOT-sources.jar>
[INFO] org already added, skipping
[INFO] org/apache already added, skipping
[INFO] org/apache/struts2 already added, skipping
[INFO] org/apache/struts2/jsf already added, skipping
[INFO] META-INF already added, skipping
[INFO] META-INF/NOTICE already added, skipping
[INFO] META-INF/LICENSE already added, skipping
[INFO] META-INF/DEPENDENCIES already added, skipping
[INFO] 
[INFO] --- maven-site-plugin:3.1:attach-descriptor (attach-descriptor) @ struts2-jsf-plugin
---
[INFO] 
[INFO] --- maven-install-plugin:2.3.1:install (default-install) @ struts2-jsf-plugin ---
[INFO] Installing <https://builds.apache.org/job/Struts2-JDK6/ws/struts2/plugins/jsf/target/struts2-jsf-plugin-2.3.16-SNAPSHOT.jar>
to /home/jenkins/jenkins-slave/maven-repositories/1/org/apache/struts/struts2-jsf-plugin/2.3.16-SNAPSHOT/struts2-jsf-plugin-2.3.16-SNAPSHOT.jar
[INFO] Installing <https://builds.apache.org/job/Struts2-JDK6/ws/struts2/plugins/jsf/pom.xml>
to /home/jenkins/jenkins-slave/maven-repositories/1/org/apache/struts/struts2-jsf-plugin/2.3.16-SNAPSHOT/struts2-jsf-plugin-2.3.16-SNAPSHOT.pom
[INFO] Installing <https://builds.apache.org/job/Struts2-JDK6/ws/struts2/plugins/jsf/target/struts2-jsf-plugin-2.3.16-SNAPSHOT-sources.jar>
to /home/jenkins/jenkins-slave/maven-repositories/1/org/apache/struts/struts2-jsf-plugin/2.3.16-SNAPSHOT/struts2-jsf-plugin-2.3.16-SNAPSHOT-sources.jar
Build timed out (after 85 minutes). Marking the build as failed.
[INFO] ------------------------------------------------------------------------
[INFO] Reactor Summary:
[INFO] 
[INFO] Struts 2 .......................................... SUCCESS [46.230s]
[INFO] XWork: Core ....................................... SUCCESS [59.985s]
[INFO] Struts 2 Core ..................................... SUCCESS [1:12.342s]
[INFO] Struts Plugins .................................... SUCCESS [10.912s]
[INFO] Struts 2 Spring Plugin ............................ SUCCESS [14.693s]
[INFO] Struts 2 Convention Plugin ........................ SUCCESS [20.385s]
[INFO] Struts 2 JUnit Plugin ............................. SUCCESS [54.663s]
[INFO] Webapps ........................................... SUCCESS [14.532s]
[INFO] Blank Webapp ...................................... SUCCESS [13.482s]
[INFO] JBoss Blank Webapp ................................ SUCCESS [19.305s]
[INFO] Mail Reader Webapp ................................ SUCCESS [34.591s]
[INFO] Struts 2 Portlet Plugin ........................... SUCCESS [23.266s]
[INFO] Struts 2 DWR Plugin ............................... SUCCESS [15.198s]
[INFO] Struts 2 Tiles Plugin ............................. SUCCESS [11.859s]
[INFO] Struts 2 Portlet Tiles Plugin ..................... SUCCESS [29.551s]
[INFO] Portlet Webapp .................................... SUCCESS [34.496s]
[INFO] Struts 2 Struts 1 Plugin .......................... SUCCESS [29.431s]
[INFO] Struts 2 Dojo Plugin .............................. SUCCESS [35.419s]
[INFO] Struts 2 JSF Plugin ............................... FAILURE [1:49.275s]
[INFO] Struts 2 Configuration Browser Plugin ............. SKIPPED
[INFO] Struts 2 Sitemesh Plugin .......................... SKIPPED
[INFO] Struts 2 JSON Plugin .............................. SKIPPED
[INFO] Showcase Webapp ................................... SKIPPED
[INFO] Struts 2 REST Plugin .............................. SKIPPED
[INFO] Struts 2 Rest Showcase Example .................... SKIPPED
[INFO] Struts 2 Codebehind Plugin ........................ SKIPPED
[INFO] Struts 2 Java Templates Plugin .................... SKIPPED
[INFO] Struts 2 Jasper Reports Plugin .................... SKIPPED
[INFO] Struts 2 JFreeChart Plugin ........................ SKIPPED
[INFO] Struts 2 Pell Multipart Plugin .................... SKIPPED
[INFO] Struts 2 Plexus Plugin ............................ SKIPPED
[INFO] Struts 2 Sitegraph Plugin ......................... SKIPPED
[INFO] Struts 2 TestNG Plugin ............................ SKIPPED
[INFO] Struts 2 OVal Plugin .............................. SKIPPED
[INFO] Struts 2 OSGi Plugin .............................. SKIPPED
[INFO] Struts 2 Embedded JSP Plugin ...................... SKIPPED
[INFO] Struts 2 GXP Plugin ............................... SKIPPED
[INFO] Struts 2 CDI Plugin ............................... SKIPPED
[INFO] Struts 2 Tiles 3 Plugin ........................... SKIPPED
[INFO] Struts OSGi Bundles ............................... SKIPPED
[INFO] Struts 2 OSGi Admin Bundle ........................ SKIPPED
[INFO] Struts 2 OSGi Demo Bundle ......................... SKIPPED
[INFO] Struts 2 Maven Archetypes ......................... SKIPPED
[INFO] Struts 2 Archetypes - Angular JS .................. SKIPPED
[INFO] Struts 2 Archetypes - Blank ....................... SKIPPED
[INFO] Struts 2 Archetypes - Blank Convention ............ SKIPPED
[INFO] Struts 2 Archetypes - Database Portlet ............ SKIPPED
[INFO] Struts 2 Archetypes - Plugin ...................... SKIPPED
[INFO] Struts 2 Archetypes - Portlet ..................... SKIPPED
[INFO] Struts 2 Archetypes - Starter ..................... SKIPPED
[INFO] ------------------------------------------------------------------------
[INFO] BUILD FAILURE
[INFO] ------------------------------------------------------------------------
[INFO] Total time: 1:24:16.885s
[INFO] Finished at: Wed Nov 13 07:08:10 UTC 2013
[INFO] Final Memory: 66M/175M
[INFO] ------------------------------------------------------------------------
[ERROR] Internal error: java.lang.IllegalStateException: Unable to call isArchivingDisabled.
Invalid object ID 43 -> [Help 1]
org.apache.maven.InternalErrorException: Internal error: java.lang.IllegalStateException:
Unable to call isArchivingDisabled. Invalid object ID 43
	at org.apache.maven.DefaultMaven.execute(DefaultMaven.java:168)
	at org.jvnet.hudson.maven3.launcher.Maven3Launcher.main(Maven3Launcher.java:117)
	at sun.reflect.NativeMethodAccessorImpl.invoke0(Native Method)
	at sun.reflect.NativeMethodAccessorImpl.invoke(NativeMethodAccessorImpl.java:39)
	at sun.reflect.DelegatingMethodAccessorImpl.invoke(DelegatingMethodAccessorImpl.java:25)
	at java.lang.reflect.Method.invoke(Method.java:597)
	at org.codehaus.plexus.classworlds.launcher.Launcher.launchStandard(Launcher.java:329)
	at org.codehaus.plexus.classworlds.launcher.Launcher.launch(Launcher.java:239)
	at org.jvnet.hudson.maven3.agent.Maven3Main.launch(Maven3Main.java:178)
	at sun.reflect.NativeMethodAccessorImpl.invoke0(Native Method)
	at sun.reflect.NativeMethodAccessorImpl.invoke(NativeMethodAccessorImpl.java:39)
	at sun.reflect.DelegatingMethodAccessorImpl.invoke(DelegatingMethodAccessorImpl.java:25)
	at java.lang.reflect.Method.invoke(Method.java:597)
	at hudson.maven.Maven3Builder.call(Maven3Builder.java:134)
	at hudson.maven.Maven3Builder.call(Maven3Builder.java:69)
	at hudson.remoting.UserRequest.perform(UserRequest.java:118)
	at hudson.remoting.UserRequest.perform(UserRequest.java:48)
	at hudson.remoting.Request$2.run(Request.java:326)
	at hudson.remoting.InterceptingExecutorService$1.call(InterceptingExecutorService.java:72)
	at java.util.concurrent.FutureTask$Sync.innerRun(FutureTask.java:303)
	at java.util.concurrent.FutureTask.run(FutureTask.java:138)
	at java.util.concurrent.ThreadPoolExecutor$Worker.runTask(ThreadPoolExecutor.java:895)
	at java.util.concurrent.ThreadPoolExecutor$Worker.run(ThreadPoolExecutor.java:918)
	at java.lang.Thread.run(Thread.java:662)
Caused by: java.lang.IllegalStateException: Unable to call isArchivingDisabled. Invalid object
ID 43
	at hudson.remoting.RemoteInvocationHandler$RPCRequest.perform(RemoteInvocationHandler.java:293)
	at hudson.remoting.RemoteInvocationHandler$RPCRequest.call(RemoteInvocationHandler.java:280)
	at hudson.remoting.RemoteInvocationHandler$RPCRequest.call(RemoteInvocationHandler.java:239)
	at hudson.remoting.UserRequest.perform(UserRequest.java:118)
	at hudson.remoting.UserRequest.perform(UserRequest.java:48)
	at hudson.remoting.Request$2.run(Request.java:326)
	at hudson.remoting.InterceptingExecutorService$1.call(InterceptingExecutorService.java:72)
	at java.util.concurrent.FutureTask$Sync.innerRun(FutureTask.java:334)
	at java.util.concurrent.FutureTask.run(FutureTask.java:166)
	at java.util.concurrent.ThreadPoolExecutor.runWorker(ThreadPoolExecutor.java:1145)
	at java.util.concurrent.ThreadPoolExecutor$Worker.run(ThreadPoolExecutor.java:615)
	at java.lang.Thread.run(Thread.java:724)
[ERROR] 
[ERROR] To see the full stack trace of the errors, re-run Maven with the -e switch.
[ERROR] Re-run Maven using the -X switch to enable full debug logging.
[ERROR] 
[ERROR] For more information about the errors and possible solutions, please read the following
articles:
[ERROR] [Help 1] http://cwiki.apache.org/confluence/display/MAVEN/InternalErrorException
channel stopped
[locks-and-latches] Releasing all the locks
[locks-and-latches] All the locks released

---------------------------------------------------------------------
To unsubscribe, e-mail: dev-unsubscribe@struts.apache.org
For additional commands, e-mail: dev-help@struts.apache.org


Mime
View raw message