struts-dev mailing list archives

Site index · List index
Message view « Date » · « Thread »
Top « Date » · « Thread »
From Apache Jenkins Server <jenk...@builds.apache.org>
Subject Build failed in Jenkins: Struts2 #489
Date Wed, 20 Jun 2012 20:32:19 GMT
See <https://builds.apache.org/job/Struts2/489/changes>

Changes:

[lukaszlenart] WW-3818 - extracts JBoss specific code into JBossFileManager and some code
clean ups

------------------------------------------
[...truncated 4718 lines...]
mojoStarted org.apache.maven.plugins:maven-compiler-plugin:2.3.2(default-compile)[INFO] No
sources to compile

[INFO] 
[INFO] --- maven-compiler-plugin:2.3.2:compile (default-compile) @ struts2-archetype-starter
---
mojoSucceeded org.apache.maven.plugins:maven-compiler-plugin:2.3.2(default-compile)
mojoStarted org.apache.felix:maven-bundle-plugin:2.1.0(bundle-manifest)
[INFO] 
[INFO] --- maven-bundle-plugin:2.1.0:manifest (bundle-manifest) @ struts2-archetype-starter
---
[WARNING] Warning in manifest for org.apache.struts:struts2-archetype-starter:jar:2.3.5-SNAPSHOT
: Superfluous export-package instructions: [test, archetype-resources.src, archetype-resources.src.main,
main, archetype-resources.src.test]
mojoSucceeded org.apache.felix:maven-bundle-plugin:2.1.0(bundle-manifest)
mojoStarted org.apache.maven.plugins:maven-resources-plugin:2.5(default-testResources)[debug]
execute contextualize
[INFO] Using 'UTF-8' encoding to copy filtered resources.
[INFO] skip non existing resourceDirectory <https://builds.apache.org/job/Struts2/ws/struts2/archetypes/struts2-archetype-starter/src/test/resources>
[INFO] Copying 3 resources

[INFO] 
[INFO] --- maven-resources-plugin:2.5:testResources (default-testResources) @ struts2-archetype-starter
---
mojoSucceeded org.apache.maven.plugins:maven-resources-plugin:2.5(default-testResources)
mojoStarted org.apache.maven.plugins:maven-compiler-plugin:2.3.2(default-testCompile)[INFO]
Not compiling test sources

[INFO] 
[INFO] --- maven-compiler-plugin:2.3.2:testCompile (default-testCompile) @ struts2-archetype-starter
---
mojoSucceeded org.apache.maven.plugins:maven-compiler-plugin:2.3.2(default-testCompile)
mojoStarted org.apache.maven.plugins:maven-surefire-plugin:2.3.1(default-test)[INFO] Tests
are skipped.

[INFO] 
[INFO] --- maven-surefire-plugin:2.3.1:test (default-test) @ struts2-archetype-starter ---
mojoSucceeded org.apache.maven.plugins:maven-surefire-plugin:2.3.1(default-test)
mojoStarted org.apache.maven.plugins:maven-jar-plugin:2.3.1(default-jar)
[INFO] 
[INFO] --- maven-jar-plugin:2.3.1:jar (default-jar) @ struts2-archetype-starter ---
[INFO] Building jar: <https://builds.apache.org/job/Struts2/ws/struts2/archetypes/struts2-archetype-starter/target/struts2-archetype-starter-2.3.5-SNAPSHOT.jar>
mojoSucceeded org.apache.maven.plugins:maven-jar-plugin:2.3.1(default-jar)
mojoStarted org.apache.maven.plugins:maven-site-plugin:3.0(attach-descriptor)
[INFO] 
[INFO] --- maven-site-plugin:3.0:attach-descriptor (attach-descriptor) @ struts2-archetype-starter
---
mojoSucceeded org.apache.maven.plugins:maven-site-plugin:3.0(attach-descriptor)
Jun 20, 2012 8:32:09 PM hudson.maven.ExecutedMojo <init>
WARNING: Failed to getClass for org.apache.maven.plugin.source.SourceJarMojo
mojoStarted org.apache.maven.plugins:maven-source-plugin:2.1.2(attach-source)
[INFO] 
[INFO] --- maven-source-plugin:2.1.2:jar (attach-source) @ struts2-archetype-starter ---
[INFO] META-INF already added, skipping
[INFO] META-INF/DEPENDENCIES already added, skipping
[INFO] META-INF/NOTICE already added, skipping
[INFO] META-INF/LICENSE already added, skipping
[INFO] Building jar: <https://builds.apache.org/job/Struts2/ws/struts2/archetypes/struts2-archetype-starter/target/struts2-archetype-starter-2.3.5-SNAPSHOT-sources.jar>
[INFO] META-INF already added, skipping
[INFO] META-INF/DEPENDENCIES already added, skipping
[INFO] META-INF/NOTICE already added, skipping
[INFO] META-INF/LICENSE already added, skipping
mojoSucceeded org.apache.maven.plugins:maven-source-plugin:2.1.2(attach-source)
mojoStarted org.apache.maven.plugins:maven-install-plugin:2.3.1(default-install)[INFO] Installing
<https://builds.apache.org/job/Struts2/ws/struts2/archetypes/struts2-archetype-starter/target/struts2-archetype-starter-2.3.5-SNAPSHOT.jar>
to /home/jenkins/jenkins-slave/maven-repositories/1/org/apache/struts/struts2-archetype-starter/2.3.5-SNAPSHOT/struts2-archetype-starter-2.3.5-SNAPSHOT.jar

[INFO] [INFO] Installing <https://builds.apache.org/job/Struts2/ws/struts2/archetypes/struts2-archetype-starter/pom.xml>
to /home/jenkins/jenkins-slave/maven-repositories/1/org/apache/struts/struts2-archetype-starter/2.3.5-SNAPSHOT/struts2-archetype-starter-2.3.5-SNAPSHOT.pom

[INFO] --- maven-install-plugin:2.3.1:install (default-install) @ struts2-archetype-starter
---
[INFO] Installing <https://builds.apache.org/job/Struts2/ws/struts2/archetypes/struts2-archetype-starter/target/struts2-archetype-starter-2.3.5-SNAPSHOT-sources.jar>
to /home/jenkins/jenkins-slave/maven-repositories/1/org/apache/struts/struts2-archetype-starter/2.3.5-SNAPSHOT/struts2-archetype-starter-2.3.5-SNAPSHOT-sources.jar
mojoSucceeded org.apache.maven.plugins:maven-install-plugin:2.3.1(default-install)
projectSucceeded org.apache.struts:struts2-archetype-starter:2.3.5-SNAPSHOT
projectSkipped org.apache.struts:struts2-assembly:2.3.5-SNAPSHOT
[INFO]                                                                         
[INFO] ------------------------------------------------------------------------
[INFO] Skipping Struts 2 Assembly
[INFO] This project has been banned from the build due to previous failures.
[INFO] ------------------------------------------------------------------------
sessionEnded
[INFO] ------------------------------------------------------------------------
[INFO] Reactor Summary:
[INFO] 
[INFO] Struts 2 .......................................... SUCCESS [5.098s]
[INFO] XWork: Core ....................................... SUCCESS [26.983s]
[INFO] Struts 2 Core ..................................... FAILURE [10.939s]
[INFO] Struts Plugins .................................... SKIPPED
[INFO] Struts 2 Spring Plugin ............................ SKIPPED
[INFO] Struts 2 JUnit Plugin ............................. SKIPPED
[INFO] Webapps ........................................... SKIPPED
[INFO] Blank Webapp ...................................... SKIPPED
[INFO] JBoss Blank Webapp ................................ SKIPPED
[INFO] Mail Reader Webapp ................................ SKIPPED
[INFO] Struts 2 Portlet Plugin ........................... SKIPPED
[INFO] Struts 2 DWR Plugin ............................... SKIPPED
[INFO] Portlet Webapp .................................... SKIPPED
[INFO] Struts 2 Struts 1 Plugin .......................... SKIPPED
[INFO] Struts 2 Dojo Plugin .............................. SKIPPED
[INFO] Struts 2 JSF Plugin ............................... SKIPPED
[INFO] Struts 2 Configuration Browser Plugin ............. SKIPPED
[INFO] Struts 2 Sitemesh Plugin .......................... SKIPPED
[INFO] Struts 2 Tiles Plugin ............................. SKIPPED
[INFO] Struts 2 JSON Plugin .............................. SKIPPED
[INFO] Struts 2 Convention Plugin ........................ SKIPPED
[INFO] Showcase Webapp ................................... SKIPPED
[INFO] Struts 2 REST Plugin .............................. SKIPPED
[INFO] Struts 2 Rest Showcase Example .................... SKIPPED
[INFO] Struts 2 Codebehind Plugin ........................ SKIPPED
[INFO] Struts 2 Java Templates Plugin .................... SKIPPED
[INFO] Struts 2 Jasper Reports Plugin .................... SKIPPED
[INFO] Struts 2 JFreeChart Plugin ........................ SKIPPED
[INFO] Struts 2 Pell Multipart Plugin .................... SKIPPED
[INFO] Struts 2 Plexus Plugin ............................ SKIPPED
[INFO] Struts 2 Sitegraph Plugin ......................... SKIPPED
[INFO] Struts 2 TestNG Plugin ............................ SKIPPED
[INFO] Struts 2 OVal Plugin .............................. SKIPPED
[INFO] Struts 2 OSGi Plugin .............................. SKIPPED
[INFO] Struts 2 Embedded JSP Plugin ...................... SKIPPED
[INFO] Struts 2 GXP Plugin ............................... SKIPPED
[INFO] Struts 2 CDI Plugin ............................... SKIPPED
[INFO] Struts OSGi Bundles ............................... SKIPPED
[INFO] Struts 2 OSGi Admin Bundle ........................ SKIPPED
[INFO] Struts 2 OSGi Demo Bundle ......................... SKIPPED
[INFO] Struts 2 Maven Archetypes ......................... SUCCESS [0.826s]
[INFO] Struts 2 Archetypes - Blank ....................... SUCCESS [2.509s]
[INFO] Struts 2 Archetypes - Blank Convention ............ SUCCESS [1.489s]
[INFO] Struts 2 Archetypes - Database Portlet ............ SUCCESS [1.549s]
[INFO] Struts 2 Archetypes - Plugin ...................... SUCCESS [1.298s]
[INFO] Struts 2 Archetypes - Portlet ..................... SUCCESS [1.398s]
[INFO] Struts 2 Archetypes - Starter ..................... SUCCESS [1.537s]
[INFO] Struts 2 Assembly ................................. SKIPPED
[INFO] ------------------------------------------------------------------------
[INFO] BUILD FAILURE
[INFO] ------------------------------------------------------------------------
[INFO] Total time: 55.745s
[INFO] Finished at: Wed Jun 20 20:32:09 UTC 2012
[INFO] Final Memory: 51M/171M
[INFO] ------------------------------------------------------------------------
Projects to build: [MavenProject: org.apache.struts:struts2-parent:2.3.5-SNAPSHOT @ <https://builds.apache.org/job/Struts2/ws/struts2/pom.xml,>
MavenProject: org.apache.struts.xwork:xwork-core:2.3.5-SNAPSHOT @ <https://builds.apache.org/job/Struts2/ws/struts2/xwork-core/pom.xml,>
MavenProject: org.apache.struts:struts2-core:2.3.5-SNAPSHOT @ <https://builds.apache.org/job/Struts2/ws/struts2/core/pom.xml,>
MavenProject: org.apache.struts:struts2-plugins:2.3.5-SNAPSHOT @ <https://builds.apache.org/job/Struts2/ws/struts2/plugins/pom.xml,>
MavenProject: org.apache.struts:struts2-spring-plugin:2.3.5-SNAPSHOT @ <https://builds.apache.org/job/Struts2/ws/struts2/plugins/spring/pom.xml,>
MavenProject: org.apache.struts:struts2-junit-plugin:2.3.5-SNAPSHOT @ <https://builds.apache.org/job/Struts2/ws/struts2/plugins/junit/pom.xml,>
MavenProject: org.apache.struts:struts2-apps:2.3.5-SNAPSHOT @ <https://builds.apache.org/job/Struts2/ws/struts2/apps/pom.xml,>
MavenProject: org.apache.struts:struts2-blank:2.3.5-SNAPSHOT @ <https://builds.apache.org/job/Struts2/ws/struts2/apps/blank/pom.xml,>
MavenProject: org.apache.struts:struts2-jboss-blank:2.3.5-SNAPSHOT @ <https://builds.apache.org/job/Struts2/ws/struts2/apps/jboss-blank/pom.xml,>
MavenProject: org.apache.struts:struts2-mailreader:2.3.5-SNAPSHOT @ <https://builds.apache.org/job/Struts2/ws/struts2/apps/mailreader/pom.xml,>
MavenProject: org.apache.struts:struts2-portlet-plugin:2.3.5-SNAPSHOT @ <https://builds.apache.org/job/Struts2/ws/struts2/plugins/portlet/pom.xml,>
MavenProject: org.apache.struts:struts2-dwr-plugin:2.3.5-SNAPSHOT @ <https://builds.apache.org/job/Struts2/ws/struts2/plugins/dwr/pom.xml,>
MavenProject: org.apache.struts:struts2-portlet:2.3.5-SNAPSHOT @ <https://builds.apache.org/job/Struts2/ws/struts2/apps/portlet/pom.xml,>
MavenProject: org.apache.struts:struts2-struts1-plugin:2.3.5-SNAPSHOT @ <https://builds.apache.org/job/Struts2/ws/struts2/plugins/struts1/pom.xml,>
MavenProject: org.apache.struts:struts2-dojo-plugin:2.3.5-SNAPSHOT @ <https://builds.apache.org/job/Struts2/ws/struts2/plugins/dojo/pom.xml,>
MavenProject: org.apache.struts:struts2-jsf-plugin:2.3.5-SNAPSHOT @ <https://builds.apache.org/job/Struts2/ws/struts2/plugins/jsf/pom.xml,>
MavenProject: org.apache.struts:struts2-config-browser-plugin:2.3.5-SNAPSHOT @ <https://builds.apache.org/job/Struts2/ws/struts2/plugins/config-browser/pom.xml,>
MavenProject: org.apache.struts:struts2-sitemesh-plugin:2.3.5-SNAPSHOT @ <https://builds.apache.org/job/Struts2/ws/struts2/plugins/sitemesh/pom.xml,>
MavenProject: org.apache.struts:struts2-tiles-plugin:2.3.5-SNAPSHOT @ <https://builds.apache.org/job/Struts2/ws/struts2/plugins/tiles/pom.xml,>
MavenProject: org.apache.struts:struts2-json-plugin:2.3.5-SNAPSHOT @ <https://builds.apache.org/job/Struts2/ws/struts2/plugins/json/pom.xml,>
MavenProject: org.apache.struts:struts2-convention-plugin:2.3.5-SNAPSHOT @ <https://builds.apache.org/job/Struts2/ws/struts2/plugins/convention/pom.xml,>
MavenProject: org.apache.struts:struts2-showcase:2.3.5-SNAPSHOT @ <https://builds.apache.org/job/Struts2/ws/struts2/apps/showcase/pom.xml,>
MavenProject: org.apache.struts:struts2-rest-plugin:2.3.5-SNAPSHOT @ <https://builds.apache.org/job/Struts2/ws/struts2/plugins/rest/pom.xml,>
MavenProject: org.apache.struts:struts2-rest-showcase:2.3.5-SNAPSHOT @ <https://builds.apache.org/job/Struts2/ws/struts2/apps/rest-showcase/pom.xml,>
MavenProject: org.apache.struts:struts2-codebehind-plugin:2.3.5-SNAPSHOT @ <https://builds.apache.org/job/Struts2/ws/struts2/plugins/codebehind/pom.xml,>
MavenProject: org.apache.struts:struts2-javatemplates-plugin:2.3.5-SNAPSHOT @ <https://builds.apache.org/job/Struts2/ws/struts2/plugins/javatemplates/pom.xml,>
MavenProject: org.apache.struts:struts2-jasperreports-plugin:2.3.5-SNAPSHOT @ <https://builds.apache.org/job/Struts2/ws/struts2/plugins/jasperreports/pom.xml,>
MavenProject: org.apache.struts:struts2-jfreechart-plugin:2.3.5-SNAPSHOT @ <https://builds.apache.org/job/Struts2/ws/struts2/plugins/jfreechart/pom.xml,>
MavenProject: org.apache.struts:struts2-pell-multipart-plugin:2.3.5-SNAPSHOT @ <https://builds.apache.org/job/Struts2/ws/struts2/plugins/pell-multipart/pom.xml,>
MavenProject: org.apache.struts:struts2-plexus-plugin:2.3.5-SNAPSHOT @ <https://builds.apache.org/job/Struts2/ws/struts2/plugins/plexus/pom.xml,>
MavenProject: org.apache.struts:struts2-sitegraph-plugin:2.3.5-SNAPSHOT @ <https://builds.apache.org/job/Struts2/ws/struts2/plugins/sitegraph/pom.xml,>
MavenProject: org.apache.struts:struts2-testng-plugin:2.3.5-SNAPSHOT @ <https://builds.apache.org/job/Struts2/ws/struts2/plugins/testng/pom.xml,>
MavenProject: org.apache.struts:struts2-oval-plugin:2.3.5-SNAPSHOT @ <https://builds.apache.org/job/Struts2/ws/struts2/plugins/oval/pom.xml,>
MavenProject: org.apache.struts:struts2-osgi-plugin:2.3.5-SNAPSHOT @ <https://builds.apache.org/job/Struts2/ws/struts2/plugins/osgi/pom.xml,>
MavenProject: org.apache.struts:struts2-embeddedjsp-plugin:2.3.5-SNAPSHOT @ <https://builds.apache.org/job/Struts2/ws/struts2/plugins/embeddedjsp/pom.xml,>
MavenProject: org.apache.struts:struts2-gxp-plugin:2.3.5-SNAPSHOT @ <https://builds.apache.org/job/Struts2/ws/struts2/plugins/gxp/pom.xml,>
MavenProject: org.apache.struts:struts2-cdi-plugin:2.3.5-SNAPSHOT @ <https://builds.apache.org/job/Struts2/ws/struts2/plugins/cdi/pom.xml,>
MavenProject: org.apache.struts:struts2-osgi-bundles:2.3.5-SNAPSHOT @ <https://builds.apache.org/job/Struts2/ws/struts2/bundles/pom.xml,>
MavenProject: org.apache.struts:struts2-osgi-admin-bundle:2.3.5-SNAPSHOT @ <https://builds.apache.org/job/Struts2/ws/struts2/bundles/admin/pom.xml,>
MavenProject: org.apache.struts:struts2-osgi-demo-bundle:2.3.5-SNAPSHOT @ <https://builds.apache.org/job/Struts2/ws/struts2/bundles/demo/pom.xml,>
MavenProject: org.apache.struts:struts2-archetypes:2.3.5-SNAPSHOT @ <https://builds.apache.org/job/Struts2/ws/struts2/archetypes/pom.xml,>
MavenProject: org.apache.struts:struts2-archetype-blank:2.3.5-SNAPSHOT @ <https://builds.apache.org/job/Struts2/ws/struts2/archetypes/struts2-archetype-blank/pom.xml,>
MavenProject: org.apache.struts:struts2-archetype-convention:2.3.5-SNAPSHOT @ <https://builds.apache.org/job/Struts2/ws/struts2/archetypes/struts2-archetype-convention/pom.xml,>
MavenProject: org.apache.struts:struts2-archetype-dbportlet:2.3.5-SNAPSHOT @ <https://builds.apache.org/job/Struts2/ws/struts2/archetypes/struts2-archetype-dbportlet/pom.xml,>
MavenProject: org.apache.struts:struts2-archetype-plugin:2.3.5-SNAPSHOT @ <https://builds.apache.org/job/Struts2/ws/struts2/archetypes/struts2-archetype-plugin/pom.xml,>
MavenProject: org.apache.struts:struts2-archetype-portlet:2.3.5-SNAPSHOT @ <https://builds.apache.org/job/Struts2/ws/struts2/archetypes/struts2-archetype-portlet/pom.xml,>
MavenProject: org.apache.struts:struts2-archetype-starter:2.3.5-SNAPSHOT @ <https://builds.apache.org/job/Struts2/ws/struts2/archetypes/struts2-archetype-starter/pom.xml,>
MavenProject: org.apache.struts:struts2-assembly:2.3.5-SNAPSHOT @ <https://builds.apache.org/job/Struts2/ws/struts2/assembly/pom.xml]>
[JENKINS] Archiving <https://builds.apache.org/job/Struts2/ws/struts2/apps/portlet/pom.xml>
to /home/hudson/hudson/jobs/Struts2/modules/org.apache.struts$struts2-portlet/builds/2012-06-20_20-31-09/archive/org.apache.struts/struts2-portlet/2.3.5-SNAPSHOT/struts2-portlet-2.3.5-SNAPSHOT.pom
[JENKINS] Archiving <https://builds.apache.org/job/Struts2/ws/struts2/plugins/pom.xml>
to /home/hudson/hudson/jobs/Struts2/modules/org.apache.struts$struts2-plugins/builds/2012-06-20_20-31-09/archive/org.apache.struts/struts2-plugins/2.3.5-SNAPSHOT/struts2-plugins-2.3.5-SNAPSHOT.pom
[JENKINS] Archiving <https://builds.apache.org/job/Struts2/ws/struts2/plugins/portlet/pom.xml>
to /home/hudson/hudson/jobs/Struts2/modules/org.apache.struts$struts2-portlet-plugin/builds/2012-06-20_20-31-09/archive/org.apache.struts/struts2-portlet-plugin/2.3.5-SNAPSHOT/struts2-portlet-plugin-2.3.5-SNAPSHOT.pom
[JENKINS] Archiving <https://builds.apache.org/job/Struts2/ws/struts2/plugins/oval/pom.xml>
to /home/hudson/hudson/jobs/Struts2/modules/org.apache.struts$struts2-oval-plugin/builds/2012-06-20_20-31-09/archive/org.apache.struts/struts2-oval-plugin/2.3.5-SNAPSHOT/struts2-oval-plugin-2.3.5-SNAPSHOT.pom
[JENKINS] Archiving <https://builds.apache.org/job/Struts2/ws/struts2/plugins/plexus/pom.xml>
to /home/hudson/hudson/jobs/Struts2/modules/org.apache.struts$struts2-plexus-plugin/builds/2012-06-20_20-31-09/archive/org.apache.struts/struts2-plexus-plugin/2.3.5-SNAPSHOT/struts2-plexus-plugin-2.3.5-SNAPSHOT.pom
[JENKINS] Archiving <https://builds.apache.org/job/Struts2/ws/struts2/xwork-core/pom.xml>
to /home/hudson/hudson/jobs/Struts2/modules/org.apache.struts.xwork$xwork-core/builds/2012-06-20_20-31-09/archive/org.apache.struts.xwork/xwork-core/2.3.5-SNAPSHOT/xwork-core-2.3.5-SNAPSHOT.pom
[JENKINS] Archiving <https://builds.apache.org/job/Struts2/ws/struts2/xwork-core/target/xwork-core-2.3.5-SNAPSHOT.jar>
to /home/hudson/hudson/jobs/Struts2/modules/org.apache.struts.xwork$xwork-core/builds/2012-06-20_20-31-09/archive/org.apache.struts.xwork/xwork-core/2.3.5-SNAPSHOT/xwork-core-2.3.5-SNAPSHOT.jar
[JENKINS] Archiving <https://builds.apache.org/job/Struts2/ws/struts2/xwork-core/target/xwork-core-2.3.5-SNAPSHOT-sources.jar>
to /home/hudson/hudson/jobs/Struts2/modules/org.apache.struts.xwork$xwork-core/builds/2012-06-20_20-31-09/archive/org.apache.struts.xwork/xwork-core/2.3.5-SNAPSHOT/xwork-core-2.3.5-SNAPSHOT-sources.jar
[JENKINS] Archiving <https://builds.apache.org/job/Struts2/ws/struts2/plugins/struts1/pom.xml>
to /home/hudson/hudson/jobs/Struts2/modules/org.apache.struts$struts2-struts1-plugin/builds/2012-06-20_20-31-09/archive/org.apache.struts/struts2-struts1-plugin/2.3.5-SNAPSHOT/struts2-struts1-plugin-2.3.5-SNAPSHOT.pom
[JENKINS] Archiving <https://builds.apache.org/job/Struts2/ws/struts2/plugins/gxp/pom.xml>
to /home/hudson/hudson/jobs/Struts2/modules/org.apache.struts$struts2-gxp-plugin/builds/2012-06-20_20-31-09/archive/org.apache.struts/struts2-gxp-plugin/2.3.5-SNAPSHOT/struts2-gxp-plugin-2.3.5-SNAPSHOT.pom
[JENKINS] Archiving <https://builds.apache.org/job/Struts2/ws/struts2/archetypes/pom.xml>
to /home/hudson/hudson/jobs/Struts2/modules/org.apache.struts$struts2-archetypes/builds/2012-06-20_20-31-09/archive/org.apache.struts/struts2-archetypes/2.3.5-SNAPSHOT/struts2-archetypes-2.3.5-SNAPSHOT.pom
[JENKINS] Archiving <https://builds.apache.org/job/Struts2/ws/struts2/archetypes/struts2-archetype-blank/pom.xml>
to /home/hudson/hudson/jobs/Struts2/modules/org.apache.struts$struts2-archetype-blank/builds/2012-06-20_20-31-09/archive/org.apache.struts/struts2-archetype-blank/2.3.5-SNAPSHOT/struts2-archetype-blank-2.3.5-SNAPSHOT.pom
[JENKINS] Archiving <https://builds.apache.org/job/Struts2/ws/struts2/archetypes/struts2-archetype-blank/target/struts2-archetype-blank-2.3.5-SNAPSHOT.jar>
to /home/hudson/hudson/jobs/Struts2/modules/org.apache.struts$struts2-archetype-blank/builds/2012-06-20_20-31-09/archive/org.apache.struts/struts2-archetype-blank/2.3.5-SNAPSHOT/struts2-archetype-blank-2.3.5-SNAPSHOT.jar
[JENKINS] Archiving <https://builds.apache.org/job/Struts2/ws/struts2/archetypes/struts2-archetype-blank/target/struts2-archetype-blank-2.3.5-SNAPSHOT-sources.jar>
to /home/hudson/hudson/jobs/Struts2/modules/org.apache.struts$struts2-archetype-blank/builds/2012-06-20_20-31-09/archive/org.apache.struts/struts2-archetype-blank/2.3.5-SNAPSHOT/struts2-archetype-blank-2.3.5-SNAPSHOT-sources.jar
[JENKINS] Archiving <https://builds.apache.org/job/Struts2/ws/struts2/plugins/pell-multipart/pom.xml>
to /home/hudson/hudson/jobs/Struts2/modules/org.apache.struts$struts2-pell-multipart-plugin/builds/2012-06-20_20-31-09/archive/org.apache.struts/struts2-pell-multipart-plugin/2.3.5-SNAPSHOT/struts2-pell-multipart-plugin-2.3.5-SNAPSHOT.pom
[JENKINS] Archiving <https://builds.apache.org/job/Struts2/ws/struts2/archetypes/struts2-archetype-dbportlet/pom.xml>
to /home/hudson/hudson/jobs/Struts2/modules/org.apache.struts$struts2-archetype-dbportlet/builds/2012-06-20_20-31-09/archive/org.apache.struts/struts2-archetype-dbportlet/2.3.5-SNAPSHOT/struts2-archetype-dbportlet-2.3.5-SNAPSHOT.pom
[JENKINS] Archiving <https://builds.apache.org/job/Struts2/ws/struts2/archetypes/struts2-archetype-dbportlet/target/struts2-archetype-dbportlet-2.3.5-SNAPSHOT.jar>
to /home/hudson/hudson/jobs/Struts2/modules/org.apache.struts$struts2-archetype-dbportlet/builds/2012-06-20_20-31-09/archive/org.apache.struts/struts2-archetype-dbportlet/2.3.5-SNAPSHOT/struts2-archetype-dbportlet-2.3.5-SNAPSHOT.jar
[JENKINS] Archiving <https://builds.apache.org/job/Struts2/ws/struts2/archetypes/struts2-archetype-dbportlet/target/struts2-archetype-dbportlet-2.3.5-SNAPSHOT-sources.jar>
to /home/hudson/hudson/jobs/Struts2/modules/org.apache.struts$struts2-archetype-dbportlet/builds/2012-06-20_20-31-09/archive/org.apache.struts/struts2-archetype-dbportlet/2.3.5-SNAPSHOT/struts2-archetype-dbportlet-2.3.5-SNAPSHOT-sources.jar
[JENKINS] Archiving <https://builds.apache.org/job/Struts2/ws/struts2/plugins/convention/pom.xml>
to /home/hudson/hudson/jobs/Struts2/modules/org.apache.struts$struts2-convention-plugin/builds/2012-06-20_20-31-09/archive/org.apache.struts/struts2-convention-plugin/2.3.5-SNAPSHOT/struts2-convention-plugin-2.3.5-SNAPSHOT.pom
[JENKINS] Archiving <https://builds.apache.org/job/Struts2/ws/struts2/core/pom.xml>
to /home/hudson/hudson/jobs/Struts2/modules/org.apache.struts$struts2-core/builds/2012-06-20_20-31-09/archive/org.apache.struts/struts2-core/2.3.5-SNAPSHOT/struts2-core-2.3.5-SNAPSHOT.pom
[JENKINS] Archiving <https://builds.apache.org/job/Struts2/ws/struts2/plugins/jsf/pom.xml>
to /home/hudson/hudson/jobs/Struts2/modules/org.apache.struts$struts2-jsf-plugin/builds/2012-06-20_20-31-09/archive/org.apache.struts/struts2-jsf-plugin/2.3.5-SNAPSHOT/struts2-jsf-plugin-2.3.5-SNAPSHOT.pom
[JENKINS] Archiving <https://builds.apache.org/job/Struts2/ws/struts2/archetypes/struts2-archetype-starter/pom.xml>
to /home/hudson/hudson/jobs/Struts2/modules/org.apache.struts$struts2-archetype-starter/builds/2012-06-20_20-31-09/archive/org.apache.struts/struts2-archetype-starter/2.3.5-SNAPSHOT/struts2-archetype-starter-2.3.5-SNAPSHOT.pom
[JENKINS] Archiving <https://builds.apache.org/job/Struts2/ws/struts2/archetypes/struts2-archetype-starter/target/struts2-archetype-starter-2.3.5-SNAPSHOT.jar>
to /home/hudson/hudson/jobs/Struts2/modules/org.apache.struts$struts2-archetype-starter/builds/2012-06-20_20-31-09/archive/org.apache.struts/struts2-archetype-starter/2.3.5-SNAPSHOT/struts2-archetype-starter-2.3.5-SNAPSHOT.jar
[JENKINS] Archiving <https://builds.apache.org/job/Struts2/ws/struts2/archetypes/struts2-archetype-starter/target/struts2-archetype-starter-2.3.5-SNAPSHOT-sources.jar>
to /home/hudson/hudson/jobs/Struts2/modules/org.apache.struts$struts2-archetype-starter/builds/2012-06-20_20-31-09/archive/org.apache.struts/struts2-archetype-starter/2.3.5-SNAPSHOT/struts2-archetype-starter-2.3.5-SNAPSHOT-sources.jar
[JENKINS] Archiving <https://builds.apache.org/job/Struts2/ws/struts2/bundles/pom.xml>
to /home/hudson/hudson/jobs/Struts2/modules/org.apache.struts$struts2-osgi-bundles/builds/2012-06-20_20-31-09/archive/org.apache.struts/struts2-osgi-bundles/2.3.5-SNAPSHOT/struts2-osgi-bundles-2.3.5-SNAPSHOT.pom
[JENKINS] Archiving <https://builds.apache.org/job/Struts2/ws/struts2/bundles/admin/pom.xml>
to /home/hudson/hudson/jobs/Struts2/modules/org.apache.struts$struts2-osgi-admin-bundle/builds/2012-06-20_20-31-09/archive/org.apache.struts/struts2-osgi-admin-bundle/2.3.5-SNAPSHOT/struts2-osgi-admin-bundle-2.3.5-SNAPSHOT.pom
[JENKINS] Archiving <https://builds.apache.org/job/Struts2/ws/struts2/plugins/dwr/pom.xml>
to /home/hudson/hudson/jobs/Struts2/modules/org.apache.struts$struts2-dwr-plugin/builds/2012-06-20_20-31-09/archive/org.apache.struts/struts2-dwr-plugin/2.3.5-SNAPSHOT/struts2-dwr-plugin-2.3.5-SNAPSHOT.pom
[JENKINS] Archiving <https://builds.apache.org/job/Struts2/ws/struts2/plugins/json/pom.xml>
to /home/hudson/hudson/jobs/Struts2/modules/org.apache.struts$struts2-json-plugin/builds/2012-06-20_20-31-09/archive/org.apache.struts/struts2-json-plugin/2.3.5-SNAPSHOT/struts2-json-plugin-2.3.5-SNAPSHOT.pom
[JENKINS] Archiving <https://builds.apache.org/job/Struts2/ws/struts2/plugins/dojo/pom.xml>
to /home/hudson/hudson/jobs/Struts2/modules/org.apache.struts$struts2-dojo-plugin/builds/2012-06-20_20-31-09/archive/org.apache.struts/struts2-dojo-plugin/2.3.5-SNAPSHOT/struts2-dojo-plugin-2.3.5-SNAPSHOT.pom
[JENKINS] Archiving <https://builds.apache.org/job/Struts2/ws/struts2/plugins/testng/pom.xml>
to /home/hudson/hudson/jobs/Struts2/modules/org.apache.struts$struts2-testng-plugin/builds/2012-06-20_20-31-09/archive/org.apache.struts/struts2-testng-plugin/2.3.5-SNAPSHOT/struts2-testng-plugin-2.3.5-SNAPSHOT.pom
[JENKINS] Archiving <https://builds.apache.org/job/Struts2/ws/struts2/apps/mailreader/pom.xml>
to /home/hudson/hudson/jobs/Struts2/modules/org.apache.struts$struts2-mailreader/builds/2012-06-20_20-31-09/archive/org.apache.struts/struts2-mailreader/2.3.5-SNAPSHOT/struts2-mailreader-2.3.5-SNAPSHOT.pom
[JENKINS] Archiving <https://builds.apache.org/job/Struts2/ws/struts2/plugins/sitegraph/pom.xml>
to /home/hudson/hudson/jobs/Struts2/modules/org.apache.struts$struts2-sitegraph-plugin/builds/2012-06-20_20-31-09/archive/org.apache.struts/struts2-sitegraph-plugin/2.3.5-SNAPSHOT/struts2-sitegraph-plugin-2.3.5-SNAPSHOT.pom
[JENKINS] Archiving <https://builds.apache.org/job/Struts2/ws/struts2/bundles/demo/pom.xml>
to /home/hudson/hudson/jobs/Struts2/modules/org.apache.struts$struts2-osgi-demo-bundle/builds/2012-06-20_20-31-09/archive/org.apache.struts/struts2-osgi-demo-bundle/2.3.5-SNAPSHOT/struts2-osgi-demo-bundle-2.3.5-SNAPSHOT.pom
[JENKINS] Archiving <https://builds.apache.org/job/Struts2/ws/struts2/plugins/osgi/pom.xml>
to /home/hudson/hudson/jobs/Struts2/modules/org.apache.struts$struts2-osgi-plugin/builds/2012-06-20_20-31-09/archive/org.apache.struts/struts2-osgi-plugin/2.3.5-SNAPSHOT/struts2-osgi-plugin-2.3.5-SNAPSHOT.pom
[JENKINS] Archiving <https://builds.apache.org/job/Struts2/ws/struts2/plugins/tiles/pom.xml>
to /home/hudson/hudson/jobs/Struts2/modules/org.apache.struts$struts2-tiles-plugin/builds/2012-06-20_20-31-09/archive/org.apache.struts/struts2-tiles-plugin/2.3.5-SNAPSHOT/struts2-tiles-plugin-2.3.5-SNAPSHOT.pom
[JENKINS] Archiving <https://builds.apache.org/job/Struts2/ws/struts2/plugins/jasperreports/pom.xml>
to /home/hudson/hudson/jobs/Struts2/modules/org.apache.struts$struts2-jasperreports-plugin/builds/2012-06-20_20-31-09/archive/org.apache.struts/struts2-jasperreports-plugin/2.3.5-SNAPSHOT/struts2-jasperreports-plugin-2.3.5-SNAPSHOT.pom
[JENKINS] Archiving <https://builds.apache.org/job/Struts2/ws/struts2/pom.xml> to /home/hudson/hudson/jobs/Struts2/modules/org.apache.struts$struts2-parent/builds/2012-06-20_20-31-09/archive/org.apache.struts/struts2-parent/2.3.5-SNAPSHOT/struts2-parent-2.3.5-SNAPSHOT.pom
[JENKINS] Archiving <https://builds.apache.org/job/Struts2/ws/struts2/target/struts2-parent-2.3.5-SNAPSHOT-site.xml>
to /home/hudson/hudson/jobs/Struts2/modules/org.apache.struts$struts2-parent/builds/2012-06-20_20-31-09/archive/org.apache.struts/struts2-parent/2.3.5-SNAPSHOT/struts2-parent-2.3.5-SNAPSHOT-site.xml
[JENKINS] Archiving <https://builds.apache.org/job/Struts2/ws/struts2/plugins/rest/pom.xml>
to /home/hudson/hudson/jobs/Struts2/modules/org.apache.struts$struts2-rest-plugin/builds/2012-06-20_20-31-09/archive/org.apache.struts/struts2-rest-plugin/2.3.5-SNAPSHOT/struts2-rest-plugin-2.3.5-SNAPSHOT.pom
[JENKINS] Archiving <https://builds.apache.org/job/Struts2/ws/struts2/plugins/codebehind/pom.xml>
to /home/hudson/hudson/jobs/Struts2/modules/org.apache.struts$struts2-codebehind-plugin/builds/2012-06-20_20-31-09/archive/org.apache.struts/struts2-codebehind-plugin/2.3.5-SNAPSHOT/struts2-codebehind-plugin-2.3.5-SNAPSHOT.pom
[JENKINS] Archiving <https://builds.apache.org/job/Struts2/ws/struts2/plugins/spring/pom.xml>
to /home/hudson/hudson/jobs/Struts2/modules/org.apache.struts$struts2-spring-plugin/builds/2012-06-20_20-31-09/archive/org.apache.struts/struts2-spring-plugin/2.3.5-SNAPSHOT/struts2-spring-plugin-2.3.5-SNAPSHOT.pom
[JENKINS] Archiving <https://builds.apache.org/job/Struts2/ws/struts2/plugins/jfreechart/pom.xml>
to /home/hudson/hudson/jobs/Struts2/modules/org.apache.struts$struts2-jfreechart-plugin/builds/2012-06-20_20-31-09/archive/org.apache.struts/struts2-jfreechart-plugin/2.3.5-SNAPSHOT/struts2-jfreechart-plugin-2.3.5-SNAPSHOT.pom
[JENKINS] Archiving <https://builds.apache.org/job/Struts2/ws/struts2/apps/blank/pom.xml>
to /home/hudson/hudson/jobs/Struts2/modules/org.apache.struts$struts2-blank/builds/2012-06-20_20-31-09/archive/org.apache.struts/struts2-blank/2.3.5-SNAPSHOT/struts2-blank-2.3.5-SNAPSHOT.pom
[JENKINS] Archiving <https://builds.apache.org/job/Struts2/ws/struts2/plugins/cdi/pom.xml>
to /home/hudson/hudson/jobs/Struts2/modules/org.apache.struts$struts2-cdi-plugin/builds/2012-06-20_20-31-09/archive/org.apache.struts/struts2-cdi-plugin/2.3.5-SNAPSHOT/struts2-cdi-plugin-2.3.5-SNAPSHOT.pom
[JENKINS] Archiving <https://builds.apache.org/job/Struts2/ws/struts2/plugins/javatemplates/pom.xml>
to /home/hudson/hudson/jobs/Struts2/modules/org.apache.struts$struts2-javatemplates-plugin/builds/2012-06-20_20-31-09/archive/org.apache.struts/struts2-javatemplates-plugin/2.3.5-SNAPSHOT/struts2-javatemplates-plugin-2.3.5-SNAPSHOT.pom
[JENKINS] Archiving <https://builds.apache.org/job/Struts2/ws/struts2/archetypes/struts2-archetype-plugin/pom.xml>
to /home/hudson/hudson/jobs/Struts2/modules/org.apache.struts$struts2-archetype-plugin/builds/2012-06-20_20-31-09/archive/org.apache.struts/struts2-archetype-plugin/2.3.5-SNAPSHOT/struts2-archetype-plugin-2.3.5-SNAPSHOT.pom
[JENKINS] Archiving <https://builds.apache.org/job/Struts2/ws/struts2/archetypes/struts2-archetype-plugin/target/struts2-archetype-plugin-2.3.5-SNAPSHOT.jar>
to /home/hudson/hudson/jobs/Struts2/modules/org.apache.struts$struts2-archetype-plugin/builds/2012-06-20_20-31-09/archive/org.apache.struts/struts2-archetype-plugin/2.3.5-SNAPSHOT/struts2-archetype-plugin-2.3.5-SNAPSHOT.jar
[JENKINS] Archiving <https://builds.apache.org/job/Struts2/ws/struts2/archetypes/struts2-archetype-plugin/target/struts2-archetype-plugin-2.3.5-SNAPSHOT-sources.jar>
to /home/hudson/hudson/jobs/Struts2/modules/org.apache.struts$struts2-archetype-plugin/builds/2012-06-20_20-31-09/archive/org.apache.struts/struts2-archetype-plugin/2.3.5-SNAPSHOT/struts2-archetype-plugin-2.3.5-SNAPSHOT-sources.jar
[JENKINS] Archiving <https://builds.apache.org/job/Struts2/ws/struts2/archetypes/struts2-archetype-portlet/pom.xml>
to /home/hudson/hudson/jobs/Struts2/modules/org.apache.struts$struts2-archetype-portlet/builds/2012-06-20_20-31-09/archive/org.apache.struts/struts2-archetype-portlet/2.3.5-SNAPSHOT/struts2-archetype-portlet-2.3.5-SNAPSHOT.pom
[JENKINS] Archiving <https://builds.apache.org/job/Struts2/ws/struts2/archetypes/struts2-archetype-portlet/target/struts2-archetype-portlet-2.3.5-SNAPSHOT.jar>
to /home/hudson/hudson/jobs/Struts2/modules/org.apache.struts$struts2-archetype-portlet/builds/2012-06-20_20-31-09/archive/org.apache.struts/struts2-archetype-portlet/2.3.5-SNAPSHOT/struts2-archetype-portlet-2.3.5-SNAPSHOT.jar
[JENKINS] Archiving <https://builds.apache.org/job/Struts2/ws/struts2/archetypes/struts2-archetype-portlet/target/struts2-archetype-portlet-2.3.5-SNAPSHOT-sources.jar>
to /home/hudson/hudson/jobs/Struts2/modules/org.apache.struts$struts2-archetype-portlet/builds/2012-06-20_20-31-09/archive/org.apache.struts/struts2-archetype-portlet/2.3.5-SNAPSHOT/struts2-archetype-portlet-2.3.5-SNAPSHOT-sources.jar
[JENKINS] Archiving <https://builds.apache.org/job/Struts2/ws/struts2/apps/showcase/pom.xml>
to /home/hudson/hudson/jobs/Struts2/modules/org.apache.struts$struts2-showcase/builds/2012-06-20_20-31-09/archive/org.apache.struts/struts2-showcase/2.3.5-SNAPSHOT/struts2-showcase-2.3.5-SNAPSHOT.pom
[JENKINS] Archiving <https://builds.apache.org/job/Struts2/ws/struts2/apps/pom.xml>
to /home/hudson/hudson/jobs/Struts2/modules/org.apache.struts$struts2-apps/builds/2012-06-20_20-31-09/archive/org.apache.struts/struts2-apps/2.3.5-SNAPSHOT/struts2-apps-2.3.5-SNAPSHOT.pom
[JENKINS] Archiving <https://builds.apache.org/job/Struts2/ws/struts2/apps/jboss-blank/pom.xml>
to /home/hudson/hudson/jobs/Struts2/modules/org.apache.struts$struts2-jboss-blank/builds/2012-06-20_20-31-09/archive/org.apache.struts/struts2-jboss-blank/2.3.5-SNAPSHOT/struts2-jboss-blank-2.3.5-SNAPSHOT.pom
[JENKINS] Archiving <https://builds.apache.org/job/Struts2/ws/struts2/plugins/config-browser/pom.xml>
to /home/hudson/hudson/jobs/Struts2/modules/org.apache.struts$struts2-config-browser-plugin/builds/2012-06-20_20-31-09/archive/org.apache.struts/struts2-config-browser-plugin/2.3.5-SNAPSHOT/struts2-config-browser-plugin-2.3.5-SNAPSHOT.pom
[JENKINS] Archiving <https://builds.apache.org/job/Struts2/ws/struts2/assembly/pom.xml>
to /home/hudson/hudson/jobs/Struts2/modules/org.apache.struts$struts2-assembly/builds/2012-06-20_20-31-09/archive/org.apache.struts/struts2-assembly/2.3.5-SNAPSHOT/struts2-assembly-2.3.5-SNAPSHOT.pom
[JENKINS] Archiving <https://builds.apache.org/job/Struts2/ws/struts2/archetypes/struts2-archetype-convention/pom.xml>
to /home/hudson/hudson/jobs/Struts2/modules/org.apache.struts$struts2-archetype-convention/builds/2012-06-20_20-31-09/archive/org.apache.struts/struts2-archetype-convention/2.3.5-SNAPSHOT/struts2-archetype-convention-2.3.5-SNAPSHOT.pom
[JENKINS] Archiving <https://builds.apache.org/job/Struts2/ws/struts2/archetypes/struts2-archetype-convention/target/struts2-archetype-convention-2.3.5-SNAPSHOT.jar>
to /home/hudson/hudson/jobs/Struts2/modules/org.apache.struts$struts2-archetype-convention/builds/2012-06-20_20-31-09/archive/org.apache.struts/struts2-archetype-convention/2.3.5-SNAPSHOT/struts2-archetype-convention-2.3.5-SNAPSHOT.jar
[JENKINS] Archiving <https://builds.apache.org/job/Struts2/ws/struts2/archetypes/struts2-archetype-convention/target/struts2-archetype-convention-2.3.5-SNAPSHOT-sources.jar>
to /home/hudson/hudson/jobs/Struts2/modules/org.apache.struts$struts2-archetype-convention/builds/2012-06-20_20-31-09/archive/org.apache.struts/struts2-archetype-convention/2.3.5-SNAPSHOT/struts2-archetype-convention-2.3.5-SNAPSHOT-sources.jar
[JENKINS] Archiving <https://builds.apache.org/job/Struts2/ws/struts2/plugins/sitemesh/pom.xml>
to /home/hudson/hudson/jobs/Struts2/modules/org.apache.struts$struts2-sitemesh-plugin/builds/2012-06-20_20-31-09/archive/org.apache.struts/struts2-sitemesh-plugin/2.3.5-SNAPSHOT/struts2-sitemesh-plugin-2.3.5-SNAPSHOT.pom
[JENKINS] Archiving <https://builds.apache.org/job/Struts2/ws/struts2/apps/rest-showcase/pom.xml>
to /home/hudson/hudson/jobs/Struts2/modules/org.apache.struts$struts2-rest-showcase/builds/2012-06-20_20-31-09/archive/org.apache.struts/struts2-rest-showcase/2.3.5-SNAPSHOT/struts2-rest-showcase-2.3.5-SNAPSHOT.pom
[JENKINS] Archiving <https://builds.apache.org/job/Struts2/ws/struts2/plugins/junit/pom.xml>
to /home/hudson/hudson/jobs/Struts2/modules/org.apache.struts$struts2-junit-plugin/builds/2012-06-20_20-31-09/archive/org.apache.struts/struts2-junit-plugin/2.3.5-SNAPSHOT/struts2-junit-plugin-2.3.5-SNAPSHOT.pom
[JENKINS] Archiving <https://builds.apache.org/job/Struts2/ws/struts2/plugins/embeddedjsp/pom.xml>
to /home/hudson/hudson/jobs/Struts2/modules/org.apache.struts$struts2-embeddedjsp-plugin/builds/2012-06-20_20-31-09/archive/org.apache.struts/struts2-embeddedjsp-plugin/2.3.5-SNAPSHOT/struts2-embeddedjsp-plugin-2.3.5-SNAPSHOT.pom
Waiting for Jenkins to finish collecting data
mavenExecutionResult exceptions not empty
message : Failed to execute goal org.apache.maven.plugins:maven-compiler-plugin:2.3.2:testCompile
(default-testCompile) on project struts2-core: Compilation failure
<https://builds.apache.org/job/Struts2/ws/struts2/core/src/test/java/org/apache/struts2/views/freemarker/FreeMarkerResultTest.java>:[272,34]
cannot find symbol
symbol  : constructor DefaultFileManagerFactory(com.opensymphony.xwork2.inject.Container)
location: class com.opensymphony.xwork2.util.fs.DefaultFileManagerFactory

cause : Compilation failure
<https://builds.apache.org/job/Struts2/ws/struts2/core/src/test/java/org/apache/struts2/views/freemarker/FreeMarkerResultTest.java>:[272,34]
cannot find symbol
symbol  : constructor DefaultFileManagerFactory(com.opensymphony.xwork2.inject.Container)
location: class com.opensymphony.xwork2.util.fs.DefaultFileManagerFactory

Stack trace : 
org.apache.maven.lifecycle.LifecycleExecutionException: Failed to execute goal org.apache.maven.plugins:maven-compiler-plugin:2.3.2:testCompile
(default-testCompile) on project struts2-core: Compilation failure
<https://builds.apache.org/job/Struts2/ws/struts2/core/src/test/java/org/apache/struts2/views/freemarker/FreeMarkerResultTest.java>:[272,34]
cannot find symbol
symbol  : constructor DefaultFileManagerFactory(com.opensymphony.xwork2.inject.Container)
location: class com.opensymphony.xwork2.util.fs.DefaultFileManagerFactory

	at org.apache.maven.lifecycle.internal.MojoExecutor.execute(MojoExecutor.java:213)
	at org.apache.maven.lifecycle.internal.MojoExecutor.execute(MojoExecutor.java:153)
	at org.apache.maven.lifecycle.internal.MojoExecutor.execute(MojoExecutor.java:145)
	at org.apache.maven.lifecycle.internal.LifecycleModuleBuilder.buildProject(LifecycleModuleBuilder.java:84)
	at org.apache.maven.lifecycle.internal.LifecycleModuleBuilder.buildProject(LifecycleModuleBuilder.java:59)
	at org.apache.maven.lifecycle.internal.LifecycleStarter.singleThreadedBuild(LifecycleStarter.java:183)
	at org.apache.maven.lifecycle.internal.LifecycleStarter.execute(LifecycleStarter.java:161)
	at org.apache.maven.DefaultMaven.doExecute(DefaultMaven.java:319)
	at org.apache.maven.DefaultMaven.execute(DefaultMaven.java:156)
	at org.jvnet.hudson.maven3.launcher.Maven3Launcher.main(Maven3Launcher.java:79)
	at sun.reflect.NativeMethodAccessorImpl.invoke0(Native Method)
	at sun.reflect.NativeMethodAccessorImpl.invoke(NativeMethodAccessorImpl.java:39)
	at sun.reflect.DelegatingMethodAccessorImpl.invoke(DelegatingMethodAccessorImpl.java:25)
	at java.lang.reflect.Method.invoke(Method.java:597)
	at org.codehaus.plexus.classworlds.launcher.Launcher.launchStandard(Launcher.java:329)
	at org.codehaus.plexus.classworlds.launcher.Launcher.launch(Launcher.java:239)
	at org.jvnet.hudson.maven3.agent.Maven3Main.launch(Maven3Main.java:158)
	at hudson.maven.Maven3Builder.call(Maven3Builder.java:98)
	at hudson.maven.Maven3Builder.call(Maven3Builder.java:64)
	at hudson.remoting.UserRequest.perform(UserRequest.java:118)
	at hudson.remoting.UserRequest.perform(UserRequest.java:48)
	at hudson.remoting.Request$2.run(Request.java:287)
	at hudson.remoting.InterceptingExecutorService$1.call(InterceptingExecutorService.java:72)
	at java.util.concurrent.FutureTask$Sync.innerRun(FutureTask.java:303)
	at java.util.concurrent.FutureTask.run(FutureTask.java:138)
	at java.util.concurrent.ThreadPoolExecutor$Worker.runTask(ThreadPoolExecutor.java:886)
	at java.util.concurrent.ThreadPoolExecutor$Worker.run(ThreadPoolExecutor.java:908)
	at java.lang.Thread.run(Thread.java:662)
Caused by: org.apache.maven.plugin.CompilationFailureException: Compilation failure
<https://builds.apache.org/job/Struts2/ws/struts2/core/src/test/java/org/apache/struts2/views/freemarker/FreeMarkerResultTest.java>:[272,34]
cannot find symbol
symbol  : constructor DefaultFileManagerFactory(com.opensymphony.xwork2.inject.Container)
location: class com.opensymphony.xwork2.util.fs.DefaultFileManagerFactory

	at org.apache.maven.plugin.AbstractCompilerMojo.execute(AbstractCompilerMojo.java:656)
	at org.apache.maven.plugin.TestCompilerMojo.execute(TestCompilerMojo.java:161)
	at org.apache.maven.plugin.DefaultBuildPluginManager.executeMojo(DefaultBuildPluginManager.java:101)
	at org.apache.maven.lifecycle.internal.MojoExecutor.execute(MojoExecutor.java:209)
	... 27 more
channel stopped
[locks-and-latches] Releasing all the locks
[locks-and-latches] All the locks released
Updating WW-3818

---------------------------------------------------------------------
To unsubscribe, e-mail: dev-unsubscribe@struts.apache.org
For additional commands, e-mail: dev-help@struts.apache.org


Mime
View raw message