struts-dev mailing list archives

Site index · List index
Message view « Date » · « Thread »
Top « Date » · « Thread »
From Apache Jenkins Server <jenk...@builds.apache.org>
Subject Build failed in Jenkins: Struts2 #358
Date Mon, 03 Oct 2011 08:55:20 GMT
See <https://builds.apache.org/job/Struts2/358/changes>

Changes:

[Maurizio  Cucchiara] WW-3688 JavaScript URL validator in the FreeMarker template fails many
valid URLs

------------------------------------------
[...truncated 8308 lines...]
     [exec] 2011-10-03 08:48:20 ERROR 404: Not Found.
     [exec] https://cwiki.apache.org/images/icons/view_20.png:
     [exec] 2011-10-03 08:48:20 ERROR 404: Not Found.
     [exec] https://cwiki.apache.org/images/icons/add_20.png:
     [exec] 2011-10-03 08:48:20 ERROR 404: Not Found.
     [exec] https://cwiki.apache.org/images/icons/tools_20.png:
     [exec] 2011-10-03 08:48:20 ERROR 404: Not Found.
     [exec] https://cwiki.apache.org/images/decoration/white_breadcrumbs_indicator.gif:
     [exec] 2011-10-03 08:48:20 ERROR 404: Not Found.
     [exec] https://cwiki.apache.org/images/icons/comment_16.gif:
     [exec] 2011-10-03 08:48:20 ERROR 404: Not Found.
     [exec] https://cwiki.apache.org/images/icons/web_16.gif:
     [exec] 2011-10-03 08:48:20 ERROR 404: Not Found.
     [exec] https://cwiki.apache.org/images/icons/personal_space_16.gif:
     [exec] 2011-10-03 08:48:20 ERROR 404: Not Found.
     [exec] https://cwiki.apache.org/images/icons/mail_content_16.gif:
     [exec] 2011-10-03 08:48:20 ERROR 404: Not Found.
     [exec] https://cwiki.apache.org/images/icons/attachments/file.gif:
     [exec] 2011-10-03 08:48:20 ERROR 404: Not Found.
     [exec] https://cwiki.apache.org/images/icons/attachments/image.gif:
     [exec] 2011-10-03 08:48:20 ERROR 404: Not Found.
     [exec] https://cwiki.apache.org/images/icons/attachments/xml.gif:
     [exec] 2011-10-03 08:48:20 ERROR 404: Not Found.
     [exec] https://cwiki.apache.org/images/icons/attachments/html.gif:
     [exec] 2011-10-03 08:48:20 ERROR 404: Not Found.
     [exec] https://cwiki.apache.org/images/icons/attachments/text.gif:
     [exec] 2011-10-03 08:48:20 ERROR 404: Not Found.
     [exec] https://cwiki.apache.org/images/icons/attachments/zip.gif:
     [exec] 2011-10-03 08:48:20 ERROR 404: Not Found.
     [exec] https://cwiki.apache.org/images/icons/attachments/excel.gif:
     [exec] 2011-10-03 08:48:20 ERROR 404: Not Found.
     [exec] https://cwiki.apache.org/images/icons/attachments/powerpoint.gif:
     [exec] 2011-10-03 08:48:20 ERROR 404: Not Found.
     [exec] https://cwiki.apache.org/images/icons/attachments/word.gif:
     [exec] 2011-10-03 08:48:20 ERROR 404: Not Found.
     [exec] https://cwiki.apache.org/images/icons/attachments/java.gif:
     [exec] 2011-10-03 08:48:20 ERROR 404: Not Found.
     [exec] https://cwiki.apache.org/images/icons/quotes.png:
     [exec] 2011-10-03 08:48:20 ERROR 404: Not Found.
     [exec] https://cwiki.apache.org/images/icons/user_16.gif:
     [exec] 2011-10-03 08:48:20 ERROR 404: Not Found.
     [exec] https://cwiki.apache.org/images/icons/browse_space.gif:
     [exec] 2011-10-03 08:48:20 ERROR 404: Not Found.
     [exec] https://cwiki.apache.org/images/icons/add_page_16.gif:
     [exec] 2011-10-03 08:48:20 ERROR 404: Not Found.
     [exec] https://cwiki.apache.org/images/icons/add_page_faded_16.gif:
     [exec] 2011-10-03 08:48:20 ERROR 404: Not Found.
     [exec] https://cwiki.apache.org/images/icons/star_grey.gif:
     [exec] 2011-10-03 08:48:20 ERROR 404: Not Found.
     [exec] https://cwiki.apache.org/images/icons/star_yellow.gif:
     [exec] 2011-10-03 08:48:20 ERROR 404: Not Found.
     [exec] https://cwiki.apache.org/images/icons/home_16.gif:
     [exec] 2011-10-03 08:48:20 ERROR 404: Not Found.
     [exec] https://cwiki.apache.org/images/icons/new_16.gif:
     [exec] 2011-10-03 08:48:20 ERROR 404: Not Found.
     [exec] https://cwiki.apache.org/images/icons/document_exchange.gif:
     [exec] 2011-10-03 08:48:20 ERROR 404: Not Found.
     [exec] https://cwiki.apache.org/images/icons/add_12.gif:
     [exec] 2011-10-03 08:48:20 ERROR 404: Not Found.
     [exec] https://cwiki.apache.org/images/icons/subtract_12.gif:
     [exec] 2011-10-03 08:48:20 ERROR 404: Not Found.
     [exec] https://cwiki.apache.org/images/icons/people_directory_16.png:
     [exec] 2011-10-03 08:48:20 ERROR 404: Not Found.
     [exec] https://cwiki.apache.org/images/icons/feed-icon-16x16-small.png:
     [exec] 2011-10-03 08:48:20 ERROR 404: Not Found.
     [exec] https://cwiki.apache.org/images/icons/add_space_16.gif:
     [exec] 2011-10-03 08:48:20 ERROR 404: Not Found.
     [exec] https://cwiki.apache.org/test/%5C'/confluence/download/resources/org.randombits.confluence.composition:toggle-cloak/img/navigate_down_10.gif%5C'/:
     [exec] 2011-10-03 08:48:20 ERROR 404: Not Found.
     [exec] https://cwiki.apache.org/test/%5C'/confluence/download/resources/org.randombits.confluence.composition:toggle-cloak/img/navigate_right_10.gif%5C'/:
     [exec] 2011-10-03 08:48:20 ERROR 404: Not Found.
     [exec] 2011-10-03 08:48:20 URL:https://cwiki.apache.org/test/minatest.html [6233/6233]
-> "<https://builds.apache.org/job/Struts2/ws/struts2/assembly/target/cwiki/test/minatest.html">
[1]
     [exec] 2011-10-03 08:48:20 URL:https://cwiki.apache.org/test/adding-some-random-chinese-characters.html
[5795/5795] -> "<https://builds.apache.org/job/Struts2/ws/struts2/assembly/target/cwiki/test/adding-some-random-chinese-characters.html">
[1]
     [exec] 2011-10-03 08:48:20 URL:https://cwiki.apache.org/test/test-cn-chars.html [5488/5488]
-> "<https://builds.apache.org/job/Struts2/ws/struts2/assembly/target/cwiki/test/test-cn-chars.html">
[1]
     [exec] 2011-10-03 08:48:20 URL:https://cwiki.apache.org/test/79240.html [5522/5522] ->
"<https://builds.apache.org/job/Struts2/ws/struts2/assembly/target/cwiki/test/79240.html">
[1]
     [exec] 2011-10-03 08:48:20 URL:https://cwiki.apache.org/test/interface101.html [6230/6230]
-> "<https://builds.apache.org/job/Struts2/ws/struts2/assembly/target/cwiki/test/interface101.html">
[1]
     [exec] 2011-10-03 08:48:20 URL:https://cwiki.apache.org/test/my-test2.html [5649/5649]
-> "<https://builds.apache.org/job/Struts2/ws/struts2/assembly/target/cwiki/test/my-test2.html">
[1]
     [exec] 2011-10-03 08:48:20 URL:https://cwiki.apache.org/test/t2.html [5561/5561] ->
"<https://builds.apache.org/job/Struts2/ws/struts2/assembly/target/cwiki/test/t2.html">
[1]
     [exec] 2011-10-03 08:48:20 URL:https://cwiki.apache.org/test/67-configuring-failover-deployments.html
[14969/14969] -> "<https://builds.apache.org/job/Struts2/ws/struts2/assembly/target/cwiki/test/67-configuring-failover-deployments.html">
[1]
     [exec] 2011-10-03 08:48:20 URL:https://cwiki.apache.org/test/swizzle-me.html [15570/15570]
-> "<https://builds.apache.org/job/Struts2/ws/struts2/assembly/target/cwiki/test/swizzle-me.html">
[1]
     [exec] 2011-10-03 08:48:20 URL:https://cwiki.apache.org/test/sax-parse-test.html [5571/5571]
-> "<https://builds.apache.org/job/Struts2/ws/struts2/assembly/target/cwiki/test/sax-parse-test.html">
[1]
     [exec] FINISHED --2011-10-03 08:48:20--
     [exec] Downloaded: 706 files, 32M in 0s (63276174 GB/s)
     [exec] Result: 8
[INFO] Executed tasks
ignoring exception during new ExecutedMojo null
[INFO] 
[INFO] --- maven-source-plugin:2.1.1:jar (attach-source) @ struts2-assembly ---
[INFO] 
[INFO] --- dependency-maven-plugin:1.0:copy (copy-war) @ struts2-assembly ---
[INFO] Configured Artifact: org.apache.struts:struts2-blank:null:2.3.1-SNAPSHOT:war
[INFO] Configured Artifact: org.apache.struts:struts2-mailreader:null:2.3.1-SNAPSHOT:war
[INFO] Configured Artifact: org.apache.struts:struts2-portlet:null:2.3.1-SNAPSHOT:war
[INFO] Configured Artifact: org.apache.struts:struts2-showcase:null:2.3.1-SNAPSHOT:war
[INFO] Configured Artifact: org.apache.struts:struts2-rest-showcase:null:2.3.1-SNAPSHOT:war
[INFO] Configured Artifact: org.apache.struts:struts2-mailreader:null:2.3.1-SNAPSHOT:war
[INFO] Copying <https://builds.apache.org/job/Struts2/ws/struts2/apps/blank/target/struts2-blank.war>
to <https://builds.apache.org/job/Struts2/ws/struts2/assembly/target/apps/struts2-blank.war>
[INFO] Copying <https://builds.apache.org/job/Struts2/ws/struts2/apps/mailreader/target/struts2-mailreader.war>
to <https://builds.apache.org/job/Struts2/ws/struts2/assembly/target/apps/struts2-mailreader.war>
[INFO] Copying <https://builds.apache.org/job/Struts2/ws/struts2/apps/portlet/target/struts2-portlet.war>
to <https://builds.apache.org/job/Struts2/ws/struts2/assembly/target/apps/struts2-portlet.war>
[INFO] Copying <https://builds.apache.org/job/Struts2/ws/struts2/apps/showcase/target/struts2-showcase.war>
to <https://builds.apache.org/job/Struts2/ws/struts2/assembly/target/apps/struts2-showcase.war>
[INFO] Copying <https://builds.apache.org/job/Struts2/ws/struts2/apps/rest-showcase/target/struts2-rest-showcase.war>
to <https://builds.apache.org/job/Struts2/ws/struts2/assembly/target/apps/struts2-rest-showcase.war>
[INFO] struts2-mailreader.war already exists.
[INFO] 
[INFO] --- maven-assembly-plugin:2.2:attached (make-assembly) @ struts2-assembly ---
[INFO] Reading assembly descriptor: src/main/assembly/all.xml
[INFO] Reading assembly descriptor: src/main/assembly/lib.xml
[INFO] Reading assembly descriptor: src/main/assembly/apps.xml
[INFO] Reading assembly descriptor: src/main/assembly/src.xml
[INFO] Reading assembly descriptor: src/main/assembly/docs.xml
[WARNING] Cannot include project artifact: org.apache.struts:struts2-assembly:pom:2.3.1-SNAPSHOT;
it doesn't have an associated file or directory.
[WARNING] The following patterns were never triggered in this artifact exclusion filter:
o  'net.sf.retrotranslator:retrotranslator-runtime'
o  'backport-util-concurrent:backport-util-concurrent'
o  '*:jdk14'

[INFO] struts-2.3.1-SNAPSHOT/XSTREAM-LICENSE.txt already added, skipping
[INFO] Building zip: <https://builds.apache.org/job/Struts2/ws/struts2/assembly/target/assembly/out/struts-2.3.1-SNAPSHOT-all.zip>
[INFO] struts-2.3.1-SNAPSHOT/XSTREAM-LICENSE.txt already added, skipping
[WARNING] Cannot include project artifact: org.apache.struts:struts2-assembly:pom:2.3.1-SNAPSHOT;
it doesn't have an associated file or directory.
[WARNING] The following patterns were never triggered in this artifact exclusion filter:
o  'net.sf.retrotranslator:retrotranslator-runtime'
o  'backport-util-concurrent:backport-util-concurrent'
o  '*:jdk14'

[INFO] struts-2.3.1-SNAPSHOT/XSTREAM-LICENSE.txt already added, skipping
[INFO] Building zip: <https://builds.apache.org/job/Struts2/ws/struts2/assembly/target/assembly/out/struts-2.3.1-SNAPSHOT-lib.zip>
[INFO] struts-2.3.1-SNAPSHOT/XSTREAM-LICENSE.txt already added, skipping
[INFO] Building zip: <https://builds.apache.org/job/Struts2/ws/struts2/assembly/target/assembly/out/struts-2.3.1-SNAPSHOT-apps.zip>
[INFO] Building zip: <https://builds.apache.org/job/Struts2/ws/struts2/assembly/target/assembly/out/struts-2.3.1-SNAPSHOT-src.zip>
[INFO] Building zip: <https://builds.apache.org/job/Struts2/ws/struts2/assembly/target/assembly/out/struts-2.3.1-SNAPSHOT-docs.zip>
[INFO] [INFO] Installing <https://builds.apache.org/job/Struts2/ws/struts2/assembly/pom.xml>
to /home/jenkins/.m2/repository/org/apache/struts/struts2-assembly/2.3.1-SNAPSHOT/struts2-assembly-2.3.1-SNAPSHOT.pom

[INFO] --- maven-install-plugin:2.3:install (default-install) @ struts2-assembly ---
[INFO] Installing <https://builds.apache.org/job/Struts2/ws/struts2/assembly/target/assembly/out/struts-2.3.1-SNAPSHOT-all.zip>
to /home/jenkins/.m2/repository/org/apache/struts/struts2-assembly/2.3.1-SNAPSHOT/struts2-assembly-2.3.1-SNAPSHOT-all.zip
[INFO] Installing <https://builds.apache.org/job/Struts2/ws/struts2/assembly/target/assembly/out/struts-2.3.1-SNAPSHOT-lib.zip>
to /home/jenkins/.m2/repository/org/apache/struts/struts2-assembly/2.3.1-SNAPSHOT/struts2-assembly-2.3.1-SNAPSHOT-lib.zip
[INFO] Installing <https://builds.apache.org/job/Struts2/ws/struts2/assembly/target/assembly/out/struts-2.3.1-SNAPSHOT-apps.zip>
to /home/jenkins/.m2/repository/org/apache/struts/struts2-assembly/2.3.1-SNAPSHOT/struts2-assembly-2.3.1-SNAPSHOT-apps.zip
[INFO] Installing <https://builds.apache.org/job/Struts2/ws/struts2/assembly/target/assembly/out/struts-2.3.1-SNAPSHOT-src.zip>
to /home/jenkins/.m2/repository/org/apache/struts/struts2-assembly/2.3.1-SNAPSHOT/struts2-assembly-2.3.1-SNAPSHOT-src.zip
[INFO] Installing <https://builds.apache.org/job/Struts2/ws/struts2/assembly/target/assembly/out/struts-2.3.1-SNAPSHOT-docs.zip>
to /home/jenkins/.m2/repository/org/apache/struts/struts2-assembly/2.3.1-SNAPSHOT/struts2-assembly-2.3.1-SNAPSHOT-docs.zip
[JENKINS] Archiving <https://builds.apache.org/job/Struts2/ws/struts2/assembly/pom.xml>
to /home/hudson/hudson/jobs/Struts2/modules/org.apache.struts$struts2-assembly/builds/2011-10-03_08-41-46/archive/org.apache.struts/struts2-assembly/2.3.1-SNAPSHOT/struts2-assembly-2.3.1-SNAPSHOT.pom
[JENKINS] Archiving <https://builds.apache.org/job/Struts2/ws/struts2/assembly/target/assembly/out/struts-2.3.1-SNAPSHOT-all.zip>
to /home/hudson/hudson/jobs/Struts2/modules/org.apache.struts$struts2-assembly/builds/2011-10-03_08-41-46/archive/org.apache.struts/struts2-assembly/2.3.1-SNAPSHOT/struts2-assembly-2.3.1-SNAPSHOT-all.zip
[JENKINS] Archiving <https://builds.apache.org/job/Struts2/ws/struts2/assembly/target/assembly/out/struts-2.3.1-SNAPSHOT-lib.zip>
to /home/hudson/hudson/jobs/Struts2/modules/org.apache.struts$struts2-assembly/builds/2011-10-03_08-41-46/archive/org.apache.struts/struts2-assembly/2.3.1-SNAPSHOT/struts2-assembly-2.3.1-SNAPSHOT-lib.zip
[JENKINS] Archiving <https://builds.apache.org/job/Struts2/ws/struts2/assembly/target/assembly/out/struts-2.3.1-SNAPSHOT-apps.zip>
to /home/hudson/hudson/jobs/Struts2/modules/org.apache.struts$struts2-assembly/builds/2011-10-03_08-41-46/archive/org.apache.struts/struts2-assembly/2.3.1-SNAPSHOT/struts2-assembly-2.3.1-SNAPSHOT-apps.zip
[JENKINS] Archiving <https://builds.apache.org/job/Struts2/ws/struts2/assembly/target/assembly/out/struts-2.3.1-SNAPSHOT-src.zip>
to /home/hudson/hudson/jobs/Struts2/modules/org.apache.struts$struts2-assembly/builds/2011-10-03_08-41-46/archive/org.apache.struts/struts2-assembly/2.3.1-SNAPSHOT/struts2-assembly-2.3.1-SNAPSHOT-src.zip
[JENKINS] Archiving <https://builds.apache.org/job/Struts2/ws/struts2/assembly/target/assembly/out/struts-2.3.1-SNAPSHOT-docs.zip>
to /home/hudson/hudson/jobs/Struts2/modules/org.apache.struts$struts2-assembly/builds/2011-10-03_08-41-46/archive/org.apache.struts/struts2-assembly/2.3.1-SNAPSHOT/struts2-assembly-2.3.1-SNAPSHOT-docs.zip
[INFO] ------------------------------------------------------------------------
[INFO] Reactor Summary:
[INFO] 
[INFO] Struts 2 .......................................... SUCCESS [4.035s]
[INFO] XWork: Core ....................................... SUCCESS [32.143s]
[INFO] Struts 2 Core ..................................... SUCCESS [38.573s]
[INFO] Struts Plugins .................................... SUCCESS [1.023s]
[INFO] Struts 2 Spring Plugin ............................ SUCCESS [3.542s]
[INFO] Struts 2 JUnit Plugin ............................. SUCCESS [4.461s]
[INFO] Webapps ........................................... SUCCESS [1.111s]
[INFO] Blank Webapp ...................................... SUCCESS [4.551s]
[INFO] JBoss Blank Webapp ................................ SUCCESS [4.081s]
[INFO] Mail Reader Webapp ................................ SUCCESS [2.740s]
[INFO] Struts 2 Portlet Plugin ........................... SUCCESS [6.088s]
[INFO] Struts 2 DWR Plugin ............................... SUCCESS [2.412s]
[INFO] Portlet Webapp .................................... SUCCESS [14.175s]
[INFO] Struts 2 Struts 1 Plugin .......................... SUCCESS [4.465s]
[INFO] Struts 2 Dojo Plugin .............................. SUCCESS [11.061s]
[INFO] Struts 2 JSF Plugin ............................... SUCCESS [2.333s]
[INFO] Struts 2 Configuration Browser Plugin ............. SUCCESS [2.525s]
[INFO] Struts 2 Sitemesh Plugin .......................... SUCCESS [2.233s]
[INFO] Struts 2 Tiles Plugin ............................. SUCCESS [2.330s]
[INFO] Struts 2 JSON Plugin .............................. SUCCESS [7.533s]
[INFO] Struts 2 Convention Plugin ........................ SUCCESS [4.408s]
[INFO] Showcase Webapp ................................... SUCCESS [8.432s]
[INFO] Struts 2 REST Plugin .............................. SUCCESS [4.350s]
[INFO] Struts 2 Rest Showcase Example .................... SUCCESS [3.733s]
[INFO] Struts 2 Codebehind Plugin ........................ SUCCESS [4.302s]
[INFO] Struts 2 Java Templates Plugin .................... SUCCESS [4.271s]
[INFO] Struts 2 Jasper Reports Plugin .................... SUCCESS [3.926s]
[INFO] Struts 2 JFreeChart Plugin ........................ SUCCESS [4.318s]
[INFO] Struts 2 Pell Multipart Plugin .................... SUCCESS [2.088s]
[INFO] Struts 2 Plexus Plugin ............................ SUCCESS [3.384s]
[INFO] Struts 2 Sitegraph Plugin ......................... SUCCESS [4.139s]
[INFO] Struts 2 TestNG Plugin ............................ SUCCESS [3.506s]
[INFO] Struts 2 OVal Plugin .............................. SUCCESS [4.952s]
[INFO] Struts 2 OSGi Plugin .............................. SUCCESS [3.577s]
[INFO] Struts 2 Embedded JSP Plugin ...................... SUCCESS [9.207s]
[INFO] Struts 2 GXP Plugin ............................... SUCCESS [2.644s]
[INFO] Struts 2 CDI Plugin ............................... SUCCESS [4.363s]
[INFO] Struts OSGi Bundles ............................... SUCCESS [0.887s]
[INFO] Struts 2 OSGi Admin Bundle ........................ SUCCESS [3.222s]
[INFO] Struts 2 OSGi Demo Bundle ......................... SUCCESS [2.728s]
[INFO] Struts 2 Maven Archetypes ......................... SUCCESS [0.694s]
[INFO] Struts 2 Archetypes - Blank ....................... SUCCESS [1.795s]
[INFO] Struts 2 Archetypes - Blank Convention ............ SUCCESS [1.725s]
[INFO] Struts 2 Archetypes - Database Portlet ............ SUCCESS [1.711s]
[INFO] Struts 2 Archetypes - Plugin ...................... SUCCESS [1.672s]
[INFO] Struts 2 Archetypes - Portlet ..................... SUCCESS [1.584s]
[INFO] Struts 2 Archetypes - Starter ..................... SUCCESS [1.731s]
[INFO] Struts 2 Assembly ................................. SUCCESS [1:52.727s]
[INFO] ------------------------------------------------------------------------
[INFO] BUILD SUCCESS
[INFO] ------------------------------------------------------------------------
[INFO] Total time: 13:25.948s
[INFO] Finished at: Mon Oct 03 08:55:16 UTC 2011
[INFO] Final Memory: 296M/653M
[INFO] ------------------------------------------------------------------------
Waiting for Jenkins to finish collecting data
channel stopped
[locks-and-latches] Releasing all the locks
[locks-and-latches] All the locks released
Maven RedeployPublished use remote ubuntu3 maven settings from : /home/jenkins/.m2/settings.xml
[INFO] Deployment in https://repository.apache.org/content/repositories/snapshots (id=,uniqueVersion=true)
Deploying the main artifact struts2-apps-2.3.1-SNAPSHOT.pom
Downloading: https://repository.apache.org/content/repositories/snapshots/org/apache/struts/struts2-apps/2.3.1-SNAPSHOT/maven-metadata.xml
Downloaded: https://repository.apache.org/content/repositories/snapshots/org/apache/struts/struts2-apps/2.3.1-SNAPSHOT/maven-metadata.xml
(608 B at 3.5 KB/sec)
Uploading: https://repository.apache.org/content/repositories/snapshots/org/apache/struts/struts2-apps/2.3.1-SNAPSHOT/struts2-apps-2.3.1-20111003.085518-40.pom
Uploading: https://repository.apache.org/content/repositories/snapshots/org/apache/struts/struts2-apps/2.3.1-SNAPSHOT/struts2-apps-2.3.1-20111003.085518-40.pom
ERROR: Failed to deploy artifacts: Could not transfer artifact org.apache.struts:struts2-apps:pom:2.3.1-20111003.085518-40
from/to  (https://repository.apache.org/content/repositories/snapshots): Failed to transfer
file: https://repository.apache.org/content/repositories/snapshots/org/apache/struts/struts2-apps/2.3.1-SNAPSHOT/struts2-apps-2.3.1-20111003.085518-40.pom.
Return code is: 401
org.apache.maven.artifact.deployer.ArtifactDeploymentException: Failed to deploy artifacts:
Could not transfer artifact org.apache.struts:struts2-apps:pom:2.3.1-20111003.085518-40 from/to
 (https://repository.apache.org/content/repositories/snapshots): Failed to transfer file:
https://repository.apache.org/content/repositories/snapshots/org/apache/struts/struts2-apps/2.3.1-SNAPSHOT/struts2-apps-2.3.1-20111003.085518-40.pom.
Return code is: 401
	at org.apache.maven.artifact.deployer.DefaultArtifactDeployer.deploy(DefaultArtifactDeployer.java:141)
	at hudson.maven.reporters.MavenArtifactRecord.deploy(MavenArtifactRecord.java:189)
	at hudson.maven.RedeployPublisher.perform(RedeployPublisher.java:158)
	at hudson.tasks.BuildStepMonitor$1.perform(BuildStepMonitor.java:19)
	at hudson.model.AbstractBuild$AbstractRunner.perform(AbstractBuild.java:693)
	at hudson.model.AbstractBuild$AbstractRunner.performAllBuildSteps(AbstractBuild.java:668)
	at hudson.maven.MavenModuleSetBuild$RunnerImpl.post2(MavenModuleSetBuild.java:953)
	at hudson.model.AbstractBuild$AbstractRunner.post(AbstractBuild.java:615)
	at hudson.model.Run.run(Run.java:1401)
	at hudson.maven.MavenModuleSetBuild.run(MavenModuleSetBuild.java:474)
	at hudson.model.ResourceController.execute(ResourceController.java:88)
	at hudson.model.Executor.run(Executor.java:230)
Caused by: org.sonatype.aether.deployment.DeploymentException: Failed to deploy artifacts:
Could not transfer artifact org.apache.struts:struts2-apps:pom:2.3.1-20111003.085518-40 from/to
 (https://repository.apache.org/content/repositories/snapshots): Failed to transfer file:
https://repository.apache.org/content/repositories/snapshots/org/apache/struts/struts2-apps/2.3.1-SNAPSHOT/struts2-apps-2.3.1-20111003.085518-40.pom.
Return code is: 401
	at org.sonatype.aether.impl.internal.DefaultDeployer.deploy(DefaultDeployer.java:284)
	at org.sonatype.aether.impl.internal.DefaultDeployer.deploy(DefaultDeployer.java:215)
	at org.sonatype.aether.impl.internal.DefaultRepositorySystem.deploy(DefaultRepositorySystem.java:480)
	at org.apache.maven.artifact.deployer.DefaultArtifactDeployer.deploy(DefaultArtifactDeployer.java:137)
	... 11 more
Caused by: org.sonatype.aether.transfer.ArtifactTransferException: Could not transfer artifact
org.apache.struts:struts2-apps:pom:2.3.1-20111003.085518-40 from/to  (https://repository.apache.org/content/repositories/snapshots):
Failed to transfer file: https://repository.apache.org/content/repositories/snapshots/org/apache/struts/struts2-apps/2.3.1-SNAPSHOT/struts2-apps-2.3.1-20111003.085518-40.pom.
Return code is: 401
	at org.sonatype.aether.connector.wagon.WagonRepositoryConnector$4.wrap(WagonRepositoryConnector.java:949)
	at org.sonatype.aether.connector.wagon.WagonRepositoryConnector$4.wrap(WagonRepositoryConnector.java:940)
	at org.sonatype.aether.connector.wagon.WagonRepositoryConnector$PutTask.flush(WagonRepositoryConnector.java:864)
	at org.sonatype.aether.connector.wagon.WagonRepositoryConnector.put(WagonRepositoryConnector.java:466)
	at org.sonatype.aether.impl.internal.DefaultDeployer.deploy(DefaultDeployer.java:278)
	... 14 more
Caused by: org.apache.maven.wagon.TransferFailedException: Failed to transfer file: https://repository.apache.org/content/repositories/snapshots/org/apache/struts/struts2-apps/2.3.1-SNAPSHOT/struts2-apps-2.3.1-20111003.085518-40.pom.
Return code is: 401
	at org.apache.maven.wagon.shared.http.AbstractHttpClientWagon.put(AbstractHttpClientWagon.java:368)
	at org.apache.maven.wagon.shared.http.AbstractHttpClientWagon.put(AbstractHttpClientWagon.java:280)
	at org.sonatype.aether.connector.wagon.WagonRepositoryConnector$PutTask.run(WagonRepositoryConnector.java:825)
	at org.sonatype.aether.connector.wagon.WagonRepositoryConnector.put(WagonRepositoryConnector.java:465)
	... 15 more
[INFO] Deployment failed after 0.44 sec
Build step 'Deploy artifacts to Maven repository' changed build result to FAILURE
Updating WW-3688


---------------------------------------------------------------------
To unsubscribe, e-mail: dev-unsubscribe@struts.apache.org
For additional commands, e-mail: dev-help@struts.apache.org


Mime
View raw message