struts-dev mailing list archives

Site index · List index
Message view « Date » · « Thread »
Top « Date » · « Thread »
From Apache Jenkins Server <jenk...@builds.apache.org>
Subject Build failed in Jenkins: Struts2 #323
Date Thu, 23 Jun 2011 21:33:51 GMT
See <https://builds.apache.org/job/Struts2/323/changes>

Changes:

[jogep] WW-3620: Bring Portlet 2.0 (JSR286) plugin from sandbox to trunk
Remove unnecessary Tests

------------------------------------------
[...truncated 6910 lines...]
[WARNING] Warning in manifest for org.apache.struts:struts2-archetype-portlet:jar:2.3.1-SNAPSHOT
: Superfluous export-package instructions: [archetype-resources.src, archetype-resources.src.main.webapp.WEB-INF.jsp,
archetype-resources.src.test, archetype-resources.src.main, archetype-resources.src.main.webapp]
[INFO] [INFO] Using 'UTF-8' encoding to copy filtered resources.
[INFO] skip non existing resourceDirectory <https://builds.apache.org/job/Struts2/ws/struts2/archetypes/struts2-archetype-portlet/src/test/resources>
[INFO] Copying 3 resources

[INFO] --- maven-resources-plugin:2.4:testResources (default-testResources) @ struts2-archetype-portlet
---
[INFO] Not compiling test sources
[INFO] 
[INFO] --- maven-compiler-plugin:2.0.2:testCompile (default-testCompile) @ struts2-archetype-portlet
---
[INFO] Tests are skipped.
[INFO] 
[INFO] --- maven-surefire-plugin:2.3.1:test (default-test) @ struts2-archetype-portlet ---
[INFO] 
[INFO] --- maven-jar-plugin:2.3:jar (default-jar) @ struts2-archetype-portlet ---
[INFO] Building jar: <https://builds.apache.org/job/Struts2/ws/struts2/archetypes/struts2-archetype-portlet/target/struts2-archetype-portlet-2.3.1-SNAPSHOT.jar>
mojo forkStarted org.apache.maven.plugins:maven-source-plugin:2.1.1(attach-source)
mojo forkSucceeded org.apache.maven.plugins:maven-source-plugin:2.1.1(attach-source)
ignoring exception during new ExecutedMojo null
[INFO] [INFO] Building jar: <https://builds.apache.org/job/Struts2/ws/struts2/archetypes/struts2-archetype-portlet/target/struts2-archetype-portlet-2.3.1-SNAPSHOT-sources.jar>

[INFO] --- maven-source-plugin:2.1.1:jar (attach-source) @ struts2-archetype-portlet ---
[INFO] Installing <https://builds.apache.org/job/Struts2/ws/struts2/archetypes/struts2-archetype-portlet/target/struts2-archetype-portlet-2.3.1-SNAPSHOT.jar>
to /home/hudson/.m2/repository/org/apache/struts/struts2-archetype-portlet/2.3.1-SNAPSHOT/struts2-archetype-portlet-2.3.1-SNAPSHOT.jar
[INFO] [INFO] Installing <https://builds.apache.org/job/Struts2/ws/struts2/archetypes/struts2-archetype-portlet/pom.xml>
to /home/hudson/.m2/repository/org/apache/struts/struts2-archetype-portlet/2.3.1-SNAPSHOT/struts2-archetype-portlet-2.3.1-SNAPSHOT.pom
[INFO] Installing <https://builds.apache.org/job/Struts2/ws/struts2/archetypes/struts2-archetype-portlet/target/struts2-archetype-portlet-2.3.1-SNAPSHOT-sources.jar>
to /home/hudson/.m2/repository/org/apache/struts/struts2-archetype-portlet/2.3.1-SNAPSHOT/struts2-archetype-portlet-2.3.1-SNAPSHOT-sources.jar

[INFO] --- maven-install-plugin:2.3:install (default-install) @ struts2-archetype-portlet
---
projectSucceeded org.apache.struts:struts2-archetype-portlet:2.3.1-SNAPSHOT
[JENKINS] Archiving <https://builds.apache.org/job/Struts2/ws/struts2/archetypes/struts2-archetype-portlet/pom.xml>
to /home/hudson/hudson/jobs/Struts2/modules/org.apache.struts$struts2-archetype-portlet/builds/2011-06-23_21-20-59/archive/org.apache.struts/struts2-archetype-portlet/2.3.1-SNAPSHOT/struts2-archetype-portlet-2.3.1-SNAPSHOT.pom
[JENKINS] Archiving <https://builds.apache.org/job/Struts2/ws/struts2/archetypes/struts2-archetype-portlet/target/struts2-archetype-portlet-2.3.1-SNAPSHOT.jar>
to /home/hudson/hudson/jobs/Struts2/modules/org.apache.struts$struts2-archetype-portlet/builds/2011-06-23_21-20-59/archive/org.apache.struts/struts2-archetype-portlet/2.3.1-SNAPSHOT/struts2-archetype-portlet-2.3.1-SNAPSHOT.jar
[JENKINS] Archiving <https://builds.apache.org/job/Struts2/ws/struts2/archetypes/struts2-archetype-portlet/target/struts2-archetype-portlet-2.3.1-SNAPSHOT-sources.jar>
to /home/hudson/hudson/jobs/Struts2/modules/org.apache.struts$struts2-archetype-portlet/builds/2011-06-23_21-20-59/archive/org.apache.struts/struts2-archetype-portlet/2.3.1-SNAPSHOT/struts2-archetype-portlet-2.3.1-SNAPSHOT-sources.jar
[INFO] Downloading: http://repo1.maven.org/maven2/org/apache/maven/plugins/maven-idea-plugin/maven-metadata.xml
                                                                        
[INFO] ------------------------------------------------------------------------
[INFO] Building Struts 2 Archetypes - Starter 2.3.1-SNAPSHOT
[INFO] ------------------------------------------------------------------------
Downloaded: http://repo1.maven.org/maven2/org/apache/maven/plugins/maven-idea-plugin/maven-metadata.xml
(436 B at 0.8 KB/sec)
[INFO] Deleting <https://builds.apache.org/job/Struts2/ws/struts2/archetypes/struts2-archetype-starter/target>
[INFO] 
[INFO] --- maven-clean-plugin:2.4.1:clean (default-clean) @ struts2-archetype-starter ---
[INFO] 
[INFO] --- maven-remote-resources-plugin:1.1:process (default) @ struts2-archetype-starter
---
[INFO] Using 'UTF-8' encoding to copy filtered resources.
[INFO] [INFO] Copying 36 resources
[INFO] Copying 3 resources

[INFO] --- maven-resources-plugin:2.4:resources (default-resources) @ struts2-archetype-starter
---
[INFO] [INFO] No sources to compile

[INFO] --- maven-compiler-plugin:2.0.2:compile (default-compile) @ struts2-archetype-starter
---
[INFO] [WARNING] Warning in manifest for org.apache.struts:struts2-archetype-starter:jar:2.3.1-SNAPSHOT
: Superfluous export-package instructions: [archetype-resources.src, archetype-resources.src.main,
archetype-resources.src.test]

[INFO] --- maven-bundle-plugin:2.1.0:manifest (bundle-manifest) @ struts2-archetype-starter
---
[INFO] Using 'UTF-8' encoding to copy filtered resources.
[INFO] [INFO] skip non existing resourceDirectory <https://builds.apache.org/job/Struts2/ws/struts2/archetypes/struts2-archetype-starter/src/test/resources>
[INFO] Copying 3 resources

[INFO] --- maven-resources-plugin:2.4:testResources (default-testResources) @ struts2-archetype-starter
---
[INFO] [INFO] Not compiling test sources

[INFO] --- maven-compiler-plugin:2.0.2:testCompile (default-testCompile) @ struts2-archetype-starter
---
[INFO] [INFO] Tests are skipped.

[INFO] --- maven-surefire-plugin:2.3.1:test (default-test) @ struts2-archetype-starter ---
[INFO] 
[INFO] --- maven-jar-plugin:2.3:jar (default-jar) @ struts2-archetype-starter ---
[INFO] Building jar: <https://builds.apache.org/job/Struts2/ws/struts2/archetypes/struts2-archetype-starter/target/struts2-archetype-starter-2.3.1-SNAPSHOT.jar>
mojo forkStarted org.apache.maven.plugins:maven-source-plugin:2.1.1(attach-source)
mojo forkSucceeded org.apache.maven.plugins:maven-source-plugin:2.1.1(attach-source)
ignoring exception during new ExecutedMojo null
[INFO] [INFO] Building jar: <https://builds.apache.org/job/Struts2/ws/struts2/archetypes/struts2-archetype-starter/target/struts2-archetype-starter-2.3.1-SNAPSHOT-sources.jar>

[INFO] --- maven-source-plugin:2.1.1:jar (attach-source) @ struts2-archetype-starter ---
[INFO] [INFO] Installing <https://builds.apache.org/job/Struts2/ws/struts2/archetypes/struts2-archetype-starter/target/struts2-archetype-starter-2.3.1-SNAPSHOT.jar>
to /home/hudson/.m2/repository/org/apache/struts/struts2-archetype-starter/2.3.1-SNAPSHOT/struts2-archetype-starter-2.3.1-SNAPSHOT.jar
[INFO] Installing <https://builds.apache.org/job/Struts2/ws/struts2/archetypes/struts2-archetype-starter/pom.xml>
to /home/hudson/.m2/repository/org/apache/struts/struts2-archetype-starter/2.3.1-SNAPSHOT/struts2-archetype-starter-2.3.1-SNAPSHOT.pom
[INFO] Installing <https://builds.apache.org/job/Struts2/ws/struts2/archetypes/struts2-archetype-starter/target/struts2-archetype-starter-2.3.1-SNAPSHOT-sources.jar>
to /home/hudson/.m2/repository/org/apache/struts/struts2-archetype-starter/2.3.1-SNAPSHOT/struts2-archetype-starter-2.3.1-SNAPSHOT-sources.jar

[INFO] --- maven-install-plugin:2.3:install (default-install) @ struts2-archetype-starter
---
projectSucceeded org.apache.struts:struts2-archetype-starter:2.3.1-SNAPSHOT
[JENKINS] Archiving <https://builds.apache.org/job/Struts2/ws/struts2/archetypes/struts2-archetype-starter/pom.xml>
to /home/hudson/hudson/jobs/Struts2/modules/org.apache.struts$struts2-archetype-starter/builds/2011-06-23_21-20-59/archive/org.apache.struts/struts2-archetype-starter/2.3.1-SNAPSHOT/struts2-archetype-starter-2.3.1-SNAPSHOT.pom
[JENKINS] Archiving <https://builds.apache.org/job/Struts2/ws/struts2/archetypes/struts2-archetype-starter/target/struts2-archetype-starter-2.3.1-SNAPSHOT.jar>
to /home/hudson/hudson/jobs/Struts2/modules/org.apache.struts$struts2-archetype-starter/builds/2011-06-23_21-20-59/archive/org.apache.struts/struts2-archetype-starter/2.3.1-SNAPSHOT/struts2-archetype-starter-2.3.1-SNAPSHOT.jar
[JENKINS] Archiving <https://builds.apache.org/job/Struts2/ws/struts2/archetypes/struts2-archetype-starter/target/struts2-archetype-starter-2.3.1-SNAPSHOT-sources.jar>
to /home/hudson/hudson/jobs/Struts2/modules/org.apache.struts$struts2-archetype-starter/builds/2011-06-23_21-20-59/archive/org.apache.struts/struts2-archetype-starter/2.3.1-SNAPSHOT/struts2-archetype-starter-2.3.1-SNAPSHOT-sources.jar
projectSkipped org.apache.struts:struts2-assembly:2.3.1-SNAPSHOT
[INFO]                                                                         
[INFO] ------------------------------------------------------------------------
[INFO] Skipping Struts 2 Assembly
[INFO] This project has been banned from the build due to previous failures.
[INFO] ------------------------------------------------------------------------
sessionEnded
[INFO] ------------------------------------------------------------------------
[INFO] Reactor Summary:
[INFO] 
[INFO] Struts 2 .......................................... SUCCESS [9.635s]
[INFO] XWork: Core ....................................... SUCCESS [37.484s]
[INFO] Struts 2 Core ..................................... SUCCESS [55.146s]
[INFO] Struts Plugins .................................... SUCCESS [3.377s]
[INFO] Struts 2 Spring Plugin ............................ SUCCESS [5.777s]
[INFO] Struts 2 JUnit Plugin ............................. SUCCESS [7.858s]
[INFO] Webapps ........................................... SUCCESS [4.446s]
[INFO] Blank Webapp ...................................... SUCCESS [8.107s]
[INFO] JBoss Blank Webapp ................................ SUCCESS [7.667s]
[INFO] Mail Reader Webapp ................................ SUCCESS [6.636s]
[INFO] Struts 2 Portlet Plugin ........................... SUCCESS [10.744s]
[INFO] Struts 2 DWR Plugin ............................... SUCCESS [5.937s]
[INFO] Portlet Webapp .................................... SUCCESS [18.686s]
[INFO] Struts 2 Struts 1 Plugin .......................... SUCCESS [7.885s]
[INFO] Struts 2 Dojo Plugin .............................. SUCCESS [14.246s]
[INFO] Struts 2 JSF Plugin ............................... SUCCESS [6.036s]
[INFO] Struts 2 Configuration Browser Plugin ............. SUCCESS [6.288s]
[INFO] Struts 2 Sitemesh Plugin .......................... SUCCESS [6.589s]
[INFO] Struts 2 Tiles Plugin ............................. SUCCESS [6.273s]
[INFO] Struts 2 Convention Plugin ........................ SUCCESS [8.631s]
[INFO] Showcase Webapp ................................... SUCCESS [9.607s]
[INFO] Struts 2 REST Plugin .............................. SUCCESS [7.867s]
[INFO] Struts 2 Rest Showcase Example .................... SUCCESS [6.635s]
[INFO] Struts 2 Codebehind Plugin ........................ SUCCESS [8.404s]
[INFO] Struts 2 Java Templates Plugin .................... SUCCESS [8.228s]
[INFO] Struts 2 Jasper Reports Plugin .................... SUCCESS [7.531s]
[INFO] Struts 2 JFreeChart Plugin ........................ SUCCESS [8.608s]
[INFO] Struts 2 Pell Multipart Plugin .................... SUCCESS [6.643s]
[INFO] Struts 2 Plexus Plugin ............................ SUCCESS [6.687s]
[INFO] Struts 2 Sitegraph Plugin ......................... SUCCESS [8.088s]
[INFO] Struts 2 TestNG Plugin ............................ SUCCESS [6.577s]
[INFO] Struts 2 OVal Plugin .............................. SUCCESS [8.287s]
[INFO] Struts 2 OSGi Plugin .............................. SUCCESS [6.619s]
[INFO] Struts 2 JSON Plugin .............................. SUCCESS [10.566s]
[INFO] Struts 2 Embedded JSP Plugin ...................... FAILURE [6.156s]
[INFO] Struts 2 GXP Plugin ............................... FAILURE [4.192s]
[INFO] Struts OSGi Bundles ............................... SUCCESS [4.092s]
[INFO] Struts 2 OSGi Admin Bundle ........................ SUCCESS [7.392s]
[INFO] Struts 2 OSGi Demo Bundle ......................... SUCCESS [7.040s]
[INFO] Struts 2 Maven Archetypes ......................... SUCCESS [4.609s]
[INFO] Struts 2 Archetypes - Blank ....................... SUCCESS [5.367s]
[INFO] Struts 2 Archetypes - Blank Convention ............ SUCCESS [5.455s]
[INFO] Struts 2 Archetypes - Database Portlet ............ SUCCESS [5.936s]
[INFO] Struts 2 Archetypes - Plugin ...................... SUCCESS [6.205s]
[INFO] Struts 2 Archetypes - Portlet ..................... SUCCESS [6.191s]
[INFO] Struts 2 Archetypes - Starter ..................... SUCCESS [6.574s]
[INFO] Struts 2 Assembly ................................. SKIPPED
[INFO] ------------------------------------------------------------------------
[INFO] BUILD FAILURE
[INFO] ------------------------------------------------------------------------
[INFO] Total time: 12:21.529s
[INFO] Finished at: Thu Jun 23 13:33:36 GMT-08:00 2011
[INFO] Final Memory: 76M/241M
[INFO] ------------------------------------------------------------------------
maven builder waiting
mavenExecutionResult exceptions not empty
message : Failed to execute goal org.apache.maven.plugins:maven-compiler-plugin:2.0.2:compile
(default-compile) on project struts2-embeddedjsp-plugin: Compilation failure
cause : Compilation failure
Stack trace : 
org.apache.maven.lifecycle.LifecycleExecutionException: Failed to execute goal org.apache.maven.plugins:maven-compiler-plugin:2.0.2:compile
(default-compile) on project struts2-embeddedjsp-plugin: Compilation failure
	at org.apache.maven.lifecycle.internal.MojoExecutor.execute(MojoExecutor.java:213)
	at org.apache.maven.lifecycle.internal.MojoExecutor.execute(MojoExecutor.java:153)
	at org.apache.maven.lifecycle.internal.MojoExecutor.execute(MojoExecutor.java:145)
	at org.apache.maven.lifecycle.internal.LifecycleModuleBuilder.buildProject(LifecycleModuleBuilder.java:84)
	at org.apache.maven.lifecycle.internal.LifecycleModuleBuilder.buildProject(LifecycleModuleBuilder.java:59)
	at org.apache.maven.lifecycle.internal.LifecycleStarter.singleThreadedBuild(LifecycleStarter.java:183)
	at org.apache.maven.lifecycle.internal.LifecycleStarter.execute(LifecycleStarter.java:161)
	at org.apache.maven.DefaultMaven.doExecute(DefaultMaven.java:319)
	at org.apache.maven.DefaultMaven.execute(DefaultMaven.java:156)
	at org.jvnet.hudson.maven3.launcher.Maven3Launcher.main(Maven3Launcher.java:79)
	at sun.reflect.NativeMethodAccessorImpl.invoke0(Native Method)
	at sun.reflect.NativeMethodAccessorImpl.invoke(NativeMethodAccessorImpl.java:39)
	at sun.reflect.DelegatingMethodAccessorImpl.invoke(DelegatingMethodAccessorImpl.java:25)
	at java.lang.reflect.Method.invoke(Method.java:592)
	at org.codehaus.plexus.classworlds.launcher.Launcher.launchStandard(Launcher.java:329)
	at org.codehaus.plexus.classworlds.launcher.Launcher.launch(Launcher.java:239)
	at org.jvnet.hudson.maven3.agent.Maven3Main.launch(Maven3Main.java:158)
	at hudson.maven.Maven3Builder.call(Maven3Builder.java:128)
	at hudson.maven.Maven3Builder.call(Maven3Builder.java:75)
	at hudson.remoting.UserRequest.perform(UserRequest.java:118)
	at hudson.remoting.UserRequest.perform(UserRequest.java:48)
	at hudson.remoting.Request$2.run(Request.java:270)
	at java.util.concurrent.Executors$RunnableAdapter.call(Executors.java:417)
	at java.util.concurrent.FutureTask$Sync.innerRun(FutureTask.java:269)
	at java.util.concurrent.FutureTask.run(FutureTask.java:123)
	at java.util.concurrent.ThreadPoolExecutor$Worker.runTask(ThreadPoolExecutor.java:651)
	at java.util.concurrent.ThreadPoolExecutor$Worker.run(ThreadPoolExecutor.java:676)
	at java.lang.Thread.run(Thread.java:595)
Caused by: org.apache.maven.plugin.CompilationFailureException: Compilation failure
	at org.apache.maven.plugin.AbstractCompilerMojo.execute(AbstractCompilerMojo.java:516)
	at org.apache.maven.plugin.CompilerMojo.execute(CompilerMojo.java:114)
	at org.apache.maven.plugin.DefaultBuildPluginManager.executeMojo(DefaultBuildPluginManager.java:101)
	at org.apache.maven.lifecycle.internal.MojoExecutor.execute(MojoExecutor.java:209)
	... 27 more
message : Failed to execute goal org.apache.maven.plugins:maven-compiler-plugin:2.0.2:compile
(default-compile) on project struts2-gxp-plugin: Compilation failure
<https://builds.apache.org/job/Struts2/ws/struts2/plugins/gxp/src/main/java/org/apache/struts2/views/gxp/GxpResult.java>:[23,-1]
cannot access com.google.gxp.base.GxpContext
bad class file: /home/hudson/.m2/repository/com/google/gxp/google-gxp/0.2.4-beta/google-gxp-0.2.4-beta.jar(com/google/gxp/base/GxpContext.class)
class file has wrong version 50.0, should be 49.0


cause : Compilation failure
<https://builds.apache.org/job/Struts2/ws/struts2/plugins/gxp/src/main/java/org/apache/struts2/views/gxp/GxpResult.java>:[23,-1]
cannot access com.google.gxp.base.GxpContext
bad class file: /home/hudson/.m2/repository/com/google/gxp/google-gxp/0.2.4-beta/google-gxp-0.2.4-beta.jar(com/google/gxp/base/GxpContext.class)
class file has wrong version 50.0, should be 49.0


Stack trace : 
org.apache.maven.lifecycle.LifecycleExecutionException: Failed to execute goal org.apache.maven.plugins:maven-compiler-plugin:2.0.2:compile
(default-compile) on project struts2-gxp-plugin: Compilation failure
<https://builds.apache.org/job/Struts2/ws/struts2/plugins/gxp/src/main/java/org/apache/struts2/views/gxp/GxpResult.java>:[23,-1]
cannot access com.google.gxp.base.GxpContext
bad class file: /home/hudson/.m2/repository/com/google/gxp/google-gxp/0.2.4-beta/google-gxp-0.2.4-beta.jar(com/google/gxp/base/GxpContext.class)
class file has wrong version 50.0, should be 49.0


	at org.apache.maven.lifecycle.internal.MojoExecutor.execute(MojoExecutor.java:213)
	at org.apache.maven.lifecycle.internal.MojoExecutor.execute(MojoExecutor.java:153)
	at org.apache.maven.lifecycle.internal.MojoExecutor.execute(MojoExecutor.java:145)
	at org.apache.maven.lifecycle.internal.LifecycleModuleBuilder.buildProject(LifecycleModuleBuilder.java:84)
	at org.apache.maven.lifecycle.internal.LifecycleModuleBuilder.buildProject(LifecycleModuleBuilder.java:59)
	at org.apache.maven.lifecycle.internal.LifecycleStarter.singleThreadedBuild(LifecycleStarter.java:183)
	at org.apache.maven.lifecycle.internal.LifecycleStarter.execute(LifecycleStarter.java:161)
	at org.apache.maven.DefaultMaven.doExecute(DefaultMaven.java:319)
	at org.apache.maven.DefaultMaven.execute(DefaultMaven.java:156)
	at org.jvnet.hudson.maven3.launcher.Maven3Launcher.main(Maven3Launcher.java:79)
	at sun.reflect.NativeMethodAccessorImpl.invoke0(Native Method)
	at sun.reflect.NativeMethodAccessorImpl.invoke(NativeMethodAccessorImpl.java:39)
	at sun.reflect.DelegatingMethodAccessorImpl.invoke(DelegatingMethodAccessorImpl.java:25)
	at java.lang.reflect.Method.invoke(Method.java:592)
	at org.codehaus.plexus.classworlds.launcher.Launcher.launchStandard(Launcher.java:329)
	at org.codehaus.plexus.classworlds.launcher.Launcher.launch(Launcher.java:239)
	at org.jvnet.hudson.maven3.agent.Maven3Main.launch(Maven3Main.java:158)
	at hudson.maven.Maven3Builder.call(Maven3Builder.java:128)
	at hudson.maven.Maven3Builder.call(Maven3Builder.java:75)
	at hudson.remoting.UserRequest.perform(UserRequest.java:118)
	at hudson.remoting.UserRequest.perform(UserRequest.java:48)
	at hudson.remoting.Request$2.run(Request.java:270)
	at java.util.concurrent.Executors$RunnableAdapter.call(Executors.java:417)
	at java.util.concurrent.FutureTask$Sync.innerRun(FutureTask.java:269)
	at java.util.concurrent.FutureTask.run(FutureTask.java:123)
	at java.util.concurrent.ThreadPoolExecutor$Worker.runTask(ThreadPoolExecutor.java:651)
	at java.util.concurrent.ThreadPoolExecutor$Worker.run(ThreadPoolExecutor.java:676)
	at java.lang.Thread.run(Thread.java:595)
Caused by: org.apache.maven.plugin.CompilationFailureException: Compilation failure
<https://builds.apache.org/job/Struts2/ws/struts2/plugins/gxp/src/main/java/org/apache/struts2/views/gxp/GxpResult.java>:[23,-1]
cannot access com.google.gxp.base.GxpContext
bad class file: /home/hudson/.m2/repository/com/google/gxp/google-gxp/0.2.4-beta/google-gxp-0.2.4-beta.jar(com/google/gxp/base/GxpContext.class)
class file has wrong version 50.0, should be 49.0


	at org.apache.maven.plugin.AbstractCompilerMojo.execute(AbstractCompilerMojo.java:516)
	at org.apache.maven.plugin.CompilerMojo.execute(CompilerMojo.java:114)
	at org.apache.maven.plugin.DefaultBuildPluginManager.executeMojo(DefaultBuildPluginManager.java:101)
	at org.apache.maven.lifecycle.internal.MojoExecutor.execute(MojoExecutor.java:209)
	... 27 more
Sending e-mails to: dev@struts.apache.org
Sending e-mails to: dev@struts.apache.org
Sending e-mails to: dev@struts.apache.org johgep@googlemail.com
channel stopped
[locks-and-latches] Releasing all the locks
[locks-and-latches] All the locks released


---------------------------------------------------------------------
To unsubscribe, e-mail: dev-unsubscribe@struts.apache.org
For additional commands, e-mail: dev-help@struts.apache.org


Mime
View raw message