struts-dev mailing list archives

Site index · List index
Message view « Date » · « Thread »
Top « Date » · « Thread »
From "Ted Husted" <hus...@apache.org>
Subject Re: 2.1.0 Build/Release Plan
Date Tue, 23 Oct 2007 14:18:12 GMT
Argh!

I'm getting test-build errors on the HEAD. I don't know if these are
the same we were having before, or a new issue. I double my heap
setting to 2048, but no joy. So, it's probably looping.

---

[#attr.templateDir]
2007-10-23 10:13:37,090 WARN  [CommonsLogger.java:46] : Could not find property
[#attr.templateDir]
Tests run: 5, Failures: 2, Errors: 0, Skipped: 3, Time elapsed: 32.296 sec <<< F
AILURE!
Running org.apache.struts2.dispatcher.StreamResultTest
Tests run: 12, Failures: 1, Errors: 0, Skipped: 11, Time elapsed: 21.157 sec <<<
 FAILURE!
Running org.apache.struts2.views.jsp.ui.LabelTest
org.apache.maven.surefire.booter.SurefireExecutionException: Java heap space; ne
sted exception is java.lang.OutOfMemoryError: Java heap space
java.lang.OutOfMemoryError: Java heap space
[INFO] ------------------------------------------------------------------------
[ERROR] BUILD FAILURE
[INFO] ------------------------------------------------------------------------
[INFO] There are test failures.
[INFO] ------------------------------------------------------------------------
[INFO] For more information, run Maven with the -e switch
[INFO] ------------------------------------------------------------------------
[INFO] Total time: 2 minutes 58 seconds
[INFO] Finished at: Tue Oct 23 10:14:49 EDT 2007
[INFO] Final Memory: 26M/47M
[INFO] ------------------------------------------------------------------------

---

I'm on my way to Boston for the AE today. I don't think I'll be able
to look into this myself, but someone else does, I should be able to
roll it on my laptop there.

-Ted.

---------------------------------------------------------------------
To unsubscribe, e-mail: dev-unsubscribe@struts.apache.org
For additional commands, e-mail: dev-help@struts.apache.org


Mime
View raw message