struts-dev mailing list archives

Site index · List index
Message view « Date » · « Thread »
Top « Date » · « Thread »
From "Ted Husted" <hus...@apache.org>
Subject [struts1] mvn site:run
Date Thu, 06 Jul 2006 18:38:48 GMT
So, working on the Site docs worked well for me this morning. site:run rocks!

But, Struts 1 in the afternoon, not so much :/

The site target seems to be chocking on the taglib references, and
site:run seems to be saying the site target doesn't exist. My checkout
is current. Is there something else I need to make this work?

----

current\struts1> mvn site

...

Results :
Tests run: 5, Failures: 0, Errors: 0, Skipped: 0

[INFO] [site:site]
[WARNING] Error loading report org.apache.maven.plugin.jxr.JxrReport - AbstractM
ethodError: canGenerateReport()
[INFO] Generate "Taglibdoc documentation" report.
[INFO] Generate "Tag reference" report.
[INFO] ------------------------------------------------------------------------
[ERROR] FATAL ERROR
[INFO] ------------------------------------------------------------------------
[INFO] org.w3c.dom.Node.getTextContent()Ljava/lang/String;
[INFO] ------------------------------------------------------------------------
[INFO] Trace
java.lang.NoSuchMethodError: org.w3c.dom.Node.getTextContent()Ljava/lang/String;

        at net.sf.maventaglib.checker.TldParser.parseTag(TldParser.java:135)
        at net.sf.maventaglib.checker.TldParser.parse(TldParser.java:101)
        at net.sf.maventaglib.TagreferenceMojo.executeReport(TagreferenceMojo.ja
va:186)
        at org.apache.maven.reporting.AbstractMavenReport.generate(AbstractMaven
Report.java:98)
        at org.apache.maven.plugins.site.SiteMojo.generateReportsPages(SiteMojo.
java:802)
        at org.apache.maven.plugins.site.SiteMojo.execute(SiteMojo.java:301)
        at org.apache.maven.plugin.DefaultPluginManager.executeMojo(DefaultPlugi
nManager.java:412)
        at org.apache.maven.lifecycle.DefaultLifecycleExecutor.executeGoals(Defa
ultLifecycleExecutor.java:534)
        at org.apache.maven.lifecycle.DefaultLifecycleExecutor.executeGoalWithLi
fecycle(DefaultLifecycleExecutor.java:475)
        at org.apache.maven.lifecycle.DefaultLifecycleExecutor.executeGoal(Defau
ltLifecycleExecutor.java:454)
        at org.apache.maven.lifecycle.DefaultLifecycleExecutor.executeGoalAndHan
dleFailures(DefaultLifecycleExecutor.java:306)
        at org.apache.maven.lifecycle.DefaultLifecycleExecutor.executeTaskSegmen
ts(DefaultLifecycleExecutor.java:273)
        at org.apache.maven.lifecycle.DefaultLifecycleExecutor.execute(DefaultLi
fecycleExecutor.java:140)
        at org.apache.maven.DefaultMaven.doExecute(DefaultMaven.java:322)
        at org.apache.maven.DefaultMaven.execute(DefaultMaven.java:115)
        at org.apache.maven.cli.MavenCli.main(MavenCli.java:256)
        at sun.reflect.NativeMethodAccessorImpl.invoke0(Native Method)
        at sun.reflect.NativeMethodAccessorImpl.invoke(NativeMethodAccessorImpl.
java:39)
        at sun.reflect.DelegatingMethodAccessorImpl.invoke(DelegatingMethodAcces
sorImpl.java:25)
        at java.lang.reflect.Method.invoke(Method.java:324)
        at org.codehaus.classworlds.Launcher.launchEnhanced(Launcher.java:315)
        at org.codehaus.classworlds.Launcher.launch(Launcher.java:255)
        at org.codehaus.classworlds.Launcher.mainWithExitCode(Launcher.java:430)

        at org.codehaus.classworlds.Launcher.main(Launcher.java:375)
[INFO] ------------------------------------------------------------------------
[INFO] Total time: 1 minute 10 seconds
[INFO] Finished at: Thu Jul 06 14:31:35 EDT 2006
[INFO] Final Memory: 27M/48M
[INFO] ------------------------------------------------------------------------





current\struts1>mvn site:run

[INFO] Scanning for projects...
[INFO] Reactor build order:
[INFO]   Struts
[INFO]   Struts Core
[INFO]   Struts Tiles
[INFO]   Struts Taglib
[INFO]   Struts EL
[INFO]   Struts Extras
[INFO]   Struts Faces
[INFO]   Struts Mailreader DAO
[INFO]   Struts Scripting
[INFO] Searching repository for plugin with prefix: 'site'.
[INFO] ------------------------------------------------------------------------
[ERROR] BUILD FAILURE
[INFO] ------------------------------------------------------------------------
[INFO] Required goal not found: site:run
[INFO] ------------------------------------------------------------------------
[INFO] For more information, run Maven with the -e switch
[INFO] ------------------------------------------------------------------------
[INFO] Total time: 1 second
[INFO] Finished at: Thu Jul 06 14:32:47 EDT 2006
[INFO] Final Memory: 1M/4M
[INFO] ------------------------------------------------------------------------

####

---------------------------------------------------------------------
To unsubscribe, e-mail: dev-unsubscribe@struts.apache.org
For additional commands, e-mail: dev-help@struts.apache.org


Mime
View raw message