struts-dev mailing list archives

Site index · List index
Message view « Date » · « Thread »
Top « Date » · « Thread »
From Don Brown <mr...@twdata.org>
Subject Re: Test failure in Struts Flow
Date Wed, 12 Oct 2005 21:59:02 GMT
Thanks, I'll look at it tonite.

Don

Wendy Smoak wrote:
> 
> The Maven build for Struts Flow isn't working after r307274 on 10/8.
> 
> In project.xml, the artifactId for the Struts 1.2.7 dependency should be 
> 'struts' instead of 'struts-core'.  Then,
> 
> $ maven site
> ...
> test:test:
>    [junit] Running org.apache.struts.flow.ibatis.TestSqlMap
>    [junit] Tests run: 1, Failures: 0, Errors: 1, Time elapsed: 0.703 sec
>    [junit] [ERROR] TEST org.apache.struts.flow.ibatis.TestSqlMap FAILED
> 
> BUILD FAILED
> 
> Thanks,
> Wendy
> 
> ---------------------------------------------------------------------
> To unsubscribe, e-mail: dev-unsubscribe@struts.apache.org
> For additional commands, e-mail: dev-help@struts.apache.org
> 


---------------------------------------------------------------------
To unsubscribe, e-mail: dev-unsubscribe@struts.apache.org
For additional commands, e-mail: dev-help@struts.apache.org


Mime
View raw message