struts-dev mailing list archives

Site index · List index
Message view « Date » · « Thread »
Top « Date » · « Thread »
From "Wendy Smoak" <j...@wendysmoak.com>
Subject Test failures in struts-tiles (was: svn commit: r265661)
Date Sat, 03 Sep 2005 04:13:43 GMT
> Author: niallp
> Date: Wed Aug 31 23:03:26 2005
> New Revision: 265661
>
> URL: http://svn.apache.org/viewcvs?rev=265661&view=rev
> Log:
> Remove I18nFactorySet copied code - highlighted by Sam Ruby

Ted reported this earlier today.  In /struts/current/tiles:

test:test:
    [junit] Running org.apache.struts.tiles.TestI18nFactorySet
    [junit] Tests run: 1, Failures: 1, Errors: 0, Time elapsed: 0.078 sec
    [junit] [ERROR] TEST org.apache.struts.tiles.TestI18nFactorySet FAILED
    [junit] Running org.apache.struts.tiles.TestTilesPlugin
    [junit] Tests run: 5, Failures: 0, Errors: 0, Time elapsed: 0.89 sec

BUILD FAILED

Tests are still passing in Standalone Tiles, but it doesn't have 
TestI18nFactorySet.

-- 
Wendy 



---------------------------------------------------------------------
To unsubscribe, e-mail: dev-unsubscribe@struts.apache.org
For additional commands, e-mail: dev-help@struts.apache.org


Mime
View raw message