streams-dev mailing list archives

Site index · List index
Message view « Date » · « Thread »
Top « Date » · « Thread »
From Apache Jenkins Server <jenk...@builds.apache.org>
Subject Build failed in Jenkins: Streams Examples #54
Date Fri, 04 Dec 2015 16:47:11 GMT
See <https://builds.apache.org/job/Streams%20Examples/54/>

------------------------------------------
[...truncated 6197 lines...]
[INFO] 
[INFO] --- maven-site-plugin:3.4:attach-descriptor (attach-descriptor) @ mongo-elasticsearch-sync
---
[INFO] 
[INFO] --- maven-shade-plugin:2.3:shade (default) @ mongo-elasticsearch-sync ---
[INFO] Including org.apache.lucene:lucene-core:jar:4.7.2 in the shaded jar.
[INFO] Including com.carrotsearch.randomizedtesting:randomizedtesting-runner:jar:2.0.13 in
the shaded jar.
[INFO] Including org.elasticsearch:elasticsearch:test-jar:tests:1.1.0 in the shaded jar.
[INFO] Including org.apache.lucene:lucene-analyzers-common:jar:4.7.0 in the shaded jar.
[INFO] Including org.apache.lucene:lucene-queries:jar:4.7.0 in the shaded jar.
[INFO] Including org.apache.lucene:lucene-memory:jar:4.7.0 in the shaded jar.
[INFO] Including org.apache.lucene:lucene-highlighter:jar:4.7.0 in the shaded jar.
[INFO] Including org.apache.lucene:lucene-queryparser:jar:4.7.0 in the shaded jar.
[INFO] Including org.apache.lucene:lucene-sandbox:jar:4.7.0 in the shaded jar.
[INFO] Including org.apache.lucene:lucene-suggest:jar:4.7.0 in the shaded jar.
[INFO] Including org.apache.lucene:lucene-misc:jar:4.7.0 in the shaded jar.
[INFO] Including org.apache.lucene:lucene-join:jar:4.7.0 in the shaded jar.
[INFO] Including org.apache.lucene:lucene-grouping:jar:4.7.0 in the shaded jar.
[INFO] Including org.apache.lucene:lucene-spatial:jar:4.7.0 in the shaded jar.
[INFO] Including com.spatial4j:spatial4j:jar:0.4.1 in the shaded jar.
[INFO] Including org.apache.streams:streams-core:jar:0.3-incubating-SNAPSHOT in the shaded
jar.
[INFO] Including org.apache.streams:streams-util:jar:0.3-incubating-SNAPSHOT in the shaded
jar.
[INFO] Including org.apache.commons:commons-lang3:jar:3.1 in the shaded jar.
[INFO] Including javax.ws.rs:jsr311-api:jar:1.1.1 in the shaded jar.
[INFO] Including com.fasterxml.jackson.core:jackson-core:jar:2.3.2 in the shaded jar.
[INFO] Including com.fasterxml.jackson.datatype:jackson-datatype-json-org:jar:2.3.2 in the
shaded jar.
[INFO] Including org.apache.streams:streams-pojo:jar:0.3-incubating-SNAPSHOT in the shaded
jar.
[INFO] Including org.slf4j:slf4j-api:jar:1.7.6 in the shaded jar.
[INFO] Including com.typesafe:config:jar:1.2.1 in the shaded jar.
[INFO] Including org.apache.streams:streams-config:jar:0.3-incubating-SNAPSHOT in the shaded
jar.
[INFO] Including com.google.guava:guava:jar:17.0 in the shaded jar.
[INFO] Including com.fasterxml.jackson.core:jackson-annotations:jar:2.3.2 in the shaded jar.
[INFO] Including org.jsonschema2pojo:jsonschema2pojo-core:jar:0.4.6 in the shaded jar.
[INFO] Including com.sun.codemodel:codemodel:jar:2.6 in the shaded jar.
[INFO] Including com.google.code.gson:gson:jar:2.2.4 in the shaded jar.
[INFO] Including commons-lang:commons-lang:jar:2.6 in the shaded jar.
[INFO] Including javax.validation:validation-api:jar:1.0.0.GA in the shaded jar.
[INFO] Including org.codehaus.jackson:jackson-mapper-asl:jar:1.9.11 in the shaded jar.
[INFO] Including org.codehaus.jackson:jackson-core-asl:jar:1.9.11 in the shaded jar.
[INFO] Including com.google.code.findbugs:annotations:jar:1.3.9 in the shaded jar.
[INFO] Including com.fasterxml.jackson.dataformat:jackson-dataformat-yaml:jar:2.3.2 in the
shaded jar.
[INFO] Including commons-io:commons-io:jar:2.4 in the shaded jar.
[INFO] Including org.apache.streams:streams-runtime-local:jar:0.3-incubating-SNAPSHOT in the
shaded jar.
[INFO] Including org.apache.streams:streams-monitoring:jar:0.3-incubating-SNAPSHOT in the
shaded jar.
[INFO] Skipping pom dependency org.apache.httpcomponents:httpcomponents-core:pom:4.3.3 in
the shaded jar.
[INFO] Including org.apache.httpcomponents:httpclient:jar:4.3.5 in the shaded jar.
[INFO] Including org.apache.httpcomponents:httpcore:jar:4.3.2 in the shaded jar.
[INFO] Including commons-codec:commons-codec:jar:1.6 in the shaded jar.
[INFO] Including org.apache.streams:streams-persist-elasticsearch:jar:0.3-incubating-SNAPSHOT
in the shaded jar.
[INFO] Including org.apache.streams:streams-pojo-extensions:jar:0.3-incubating-SNAPSHOT in
the shaded jar.
[INFO] Including org.elasticsearch:elasticsearch:jar:1.1.0 in the shaded jar.
[INFO] Including org.json:json:jar:20140107 in the shaded jar.
[INFO] Including org.apache.streams:streams-persist-mongo:jar:0.3-incubating-SNAPSHOT in the
shaded jar.
[INFO] Including org.mongodb:mongo-java-driver:jar:2.13.0 in the shaded jar.
[INFO] Including org.apache.streams:streams-pojo:test-jar:tests:0.3-incubating-SNAPSHOT in
the shaded jar.
[INFO] Including com.fasterxml.jackson.core:jackson-databind:jar:2.3.2 in the shaded jar.
[INFO] Including com.fasterxml.jackson.datatype:jackson-datatype-joda:jar:2.3.2 in the shaded
jar.
[INFO] Including com.fasterxml.jackson.module:jackson-module-scala_2.10:jar:2.3.2 in the shaded
jar.
[INFO] Including org.scala-lang:scala-library:jar:2.10.2 in the shaded jar.
[INFO] Including com.thoughtworks.paranamer:paranamer:jar:2.6 in the shaded jar.
[INFO] Including com.google.code.findbugs:jsr305:jar:2.0.1 in the shaded jar.
[INFO] Including com.fasterxml.jackson.dataformat:jackson-dataformat-xml:jar:2.3.2 in the
shaded jar.
[INFO] Including com.fasterxml.jackson.module:jackson-module-jaxb-annotations:jar:2.3.2 in
the shaded jar.
[INFO] Including org.codehaus.woodstox:stax2-api:jar:3.1.1 in the shaded jar.
[INFO] Including javax.xml.stream:stax-api:jar:1.0-2 in the shaded jar.
[INFO] Including com.fasterxml:jackson-xml-databind:jar:0.6.2 in the shaded jar.
[INFO] Including org.codehaus.jackson:jackson-xc:jar:1.9.2 in the shaded jar.
[INFO] Including com.fasterxml:aalto-xml:jar:0.9.9 in the shaded jar.
[INFO] Including joda-time:joda-time:jar:2.2 in the shaded jar.
[INFO] Including nz.net.ultraq.jaxb:jaxb-utilities:jar:1.2.6 in the shaded jar.
[INFO] Including com.sun.xml.bind:jaxb-impl:jar:2.2.7 in the shaded jar.
[INFO] Including com.sun.xml.bind:jaxb-core:jar:2.2.7 in the shaded jar.
[INFO] Including javax.xml.bind:jaxb-api:jar:2.2.7 in the shaded jar.
[INFO] Including com.sun.istack:istack-commons-runtime:jar:2.16 in the shaded jar.
[INFO] Including com.sun.xml.fastinfoset:FastInfoset:jar:1.2.12 in the shaded jar.
[INFO] Including javax.xml.bind:jsr173_api:jar:1.0 in the shaded jar.
[INFO] Including org.reflections:reflections:jar:0.9.9 in the shaded jar.
[INFO] Including org.javassist:javassist:jar:3.18.2-GA in the shaded jar.
[INFO] Including org.slf4j:log4j-over-slf4j:jar:1.7.6 in the shaded jar.
[INFO] Including org.slf4j:jcl-over-slf4j:jar:1.7.6 in the shaded jar.
[INFO] Including org.slf4j:jul-to-slf4j:jar:1.7.6 in the shaded jar.
[INFO] Including ch.qos.logback:logback-classic:jar:1.1.1 in the shaded jar.
[INFO] Including ch.qos.logback:logback-core:jar:1.1.1 in the shaded jar.
[WARNING] jsr173_api-1.0.jar, stax-api-1.0-2.jar define 37 overlappping classes: 
[WARNING]   - javax.xml.stream.XMLOutputFactory
[WARNING]   - javax.xml.stream.events.StartElement
[WARNING]   - javax.xml.stream.events.Namespace
[WARNING]   - javax.xml.stream.util.EventReaderDelegate
[WARNING]   - javax.xml.stream.XMLInputFactory
[WARNING]   - javax.xml.stream.events.Characters
[WARNING]   - javax.xml.stream.events.EntityReference
[WARNING]   - javax.xml.stream.XMLStreamReader
[WARNING]   - javax.xml.stream.StreamFilter
[WARNING]   - javax.xml.stream.events.NotationDeclaration
[WARNING]   - 27 more...
[WARNING] jaxb-core-2.2.7.jar, istack-commons-runtime-2.16.jar define 20 overlappping classes:

[WARNING]   - com.sun.istack.localization.Localizer
[WARNING]   - com.sun.istack.localization.NullLocalizable
[WARNING]   - com.sun.istack.XMLStreamException2
[WARNING]   - com.sun.istack.localization.LocalizableMessageFactory
[WARNING]   - com.sun.istack.Pool$Impl
[WARNING]   - com.sun.istack.SAXParseException2
[WARNING]   - com.sun.istack.Builder
[WARNING]   - com.sun.istack.Nullable
[WARNING]   - com.sun.istack.localization.LocalizableMessage
[WARNING]   - com.sun.istack.SAXException2
[WARNING]   - 10 more...
[WARNING] maven-shade-plugin has detected that some .class files
[WARNING] are present in two or more JARs. When this happens, only
[WARNING] one single version of the class is copied in the uberjar.
[WARNING] Usually this is not harmful and you can skeep these
[WARNING] warnings, otherwise try to manually exclude artifacts
[WARNING] based on mvn dependency:tree -Ddetail=true and the above
[WARNING] output
[WARNING] See http://docs.codehaus.org/display/MAVENUSER/Shade+Plugin
[INFO] Replacing original artifact with shaded artifact.
[INFO] Replacing <https://builds.apache.org/job/Streams%20Examples/ws/local/mongo-elasticsearch-sync/target/mongo-elasticsearch-sync-0.3-incubating-SNAPSHOT.jar>
with <https://builds.apache.org/job/Streams%20Examples/ws/local/mongo-elasticsearch-sync/target/mongo-elasticsearch-sync-0.3-incubating-SNAPSHOT-shaded.jar>
[INFO] Dependency-reduced POM written at: <https://builds.apache.org/job/Streams%20Examples/ws/local/mongo-elasticsearch-sync/dependency-reduced-pom.xml>
[INFO] 
[INFO] --- embedmongo-maven-plugin:0.1.12:start (start) @ mongo-elasticsearch-sync ---
Extract /home/jenkins/.embedmongo/linux/mongodb-linux-x86_64-2.4.0.tgz START
Extract /home/jenkins/.embedmongo/linux/mongodb-linux-x86_64-2.4.0.tgz DONE
[mongod output]note: noprealloc may hurt performance in many applications
[mongod output] Fri Dec  4 16:46:22.559 [DataFileSync] warning: --syncdelay 0 is not recommended
and can have strange performance
[mongod output] Fri Dec  4 16:46:22.566 [initandlisten] MongoDB starting : pid=3976 port=37017
dbpath=<https://builds.apache.org/job/Streams%20Examples/ws/local/mongo-elasticsearch-sync/target/mongotest>
64-bit host=pomona.apache.org
[mongod output] Fri Dec  4 16:46:22.566 [initandlisten] warning: failed to read from /proc/self/numa_maps:
errno:2 No such file or directory
[mongod output] Fri Dec  4 16:46:22.566 [initandlisten] 
[mongod output] Fri Dec  4 16:46:22.566 [initandlisten] db version v2.4.0
[mongod output] Fri Dec  4 16:46:22.566 [initandlisten] git version: ce2d666c04b4a80af58e8bbb3388b0680e8cfeb6
[mongod output] Fri Dec  4 16:46:22.566 [initandlisten] build info: Linux ip-10-2-29-40 2.6.21.7-2.ec2.v1.2.fc8xen
#1 SMP Fri Nov 20 17:48:28 EST 2009 x86_64 BOOST_LIB_VERSION=1_49
[mongod output] Fri Dec  4 16:46:22.566 [initandlisten] allocator: tcmalloc
[mongod output] Fri Dec  4 16:46:22.566 [initandlisten] options: { dbpath: "<https://builds.apache.org/job/Streams%20Examples/ws/local/mongo-elasticsearch-sync/target/mongotest",>
noauth: true, nohttpinterface: true, nojournal: true, noprealloc: true, port: 37017, smallfiles:
true, syncdelay: 0.0 }
[mongod output] Fri Dec  4 16:46:22.570 [initandlisten] waiting for connections on port 37017
[mongod output] [INFO] de.flapdoodle.embed.mongo.config.MongodConfigBuilder$ImmutableMongodConfig@cd812ba
[INFO] 
[INFO] --- maven-failsafe-plugin:2.12.4:integration-test (integration-tests) @ mongo-elasticsearch-sync
---
[INFO] Skipping execution of surefire because it has already been run for this configuration
[JENKINS] Recording test results[INFO] 
[INFO] --- embedmongo-maven-plugin:0.1.12:stop (stop) @ mongo-elasticsearch-sync ---
Fri Dec  4 16:46:22.736 [initandlisten] connection accepted from 127.0.0.1:41698 #1 (1 connection
now open)
[mongod output] Fri Dec  4 16:46:22.736 [conn1] terminating, shutdown command received
[mongod output] Fri Dec  4 16:46:22.736 dbexit: shutdown called
[mongod output] Fri Dec  4 16:46:22.736 [conn1] shutdown: going to close listening sockets...
[mongod output] Fri Dec  4 16:46:22.736 [conn1] closing listening socket: 7
[mongod output] Fri Dec  4 16:46:22.736 [conn1] closing listening socket: 8
[mongod output] Fri Dec  4 16:46:22.736 [conn1] removing socket file: /tmp/mongodb-37017.sock
[mongod output] Fri Dec  4 16:46:22.736 [conn1] shutdown: going to flush diaglog...
[mongod output] Fri Dec  4 16:46:22.736 [conn1] shutdown: going to close sockets...
[mongod output] Fri Dec  4 16:46:22.736 [conn1] shutdown: waiting for fs preallocator...
[mongod output] Fri Dec  4 16:46:22.736 [conn1] shutdown: closing all files...
[mongod output] Fri Dec  4 16:46:22.736 [conn1] closeAllFiles() finished
[mongod output] Fri Dec  4 16:46:22.736 [conn1] shutdown: removing fs lock...
[mongod output] Fri Dec  4 16:46:22.736 dbexit: really exiting now
[mongod output] 

[INFO] 
[INFO] --- maven-failsafe-plugin:2.12.4:verify (integration-tests) @ mongo-elasticsearch-sync
---
[INFO] Failsafe report directory: <https://builds.apache.org/job/Streams%20Examples/ws/local/mongo-elasticsearch-sync/target/failsafe-reports>
[JENKINS] Recording test results
[INFO]                                                                         
[INFO] ------------------------------------------------------------------------
[INFO] Building twitter-follow-graph 0.3-incubating-SNAPSHOT
[INFO] ------------------------------------------------------------------------
[INFO] 
[INFO] --- maven-clean-plugin:2.6:clean (default-clean) @ twitter-follow-graph ---
[INFO] Deleting <https://builds.apache.org/job/Streams%20Examples/ws/local/twitter-follow-graph/target>
[INFO] 
[INFO] --- maven-enforcer-plugin:1.3.1:enforce (enforce-java) @ twitter-follow-graph ---
[INFO] 
[INFO] --- maven-enforcer-plugin:1.3.1:enforce (enforce-banned-dependencies) @ twitter-follow-graph
---
[INFO] 
[INFO] --- maven-enforcer-plugin:1.3.1:enforce (enforce-no-snapshots) @ twitter-follow-graph
---
[INFO] 
[INFO] --- maven-resources-plugin:2.7:copy-resources (copy-resources) @ twitter-follow-graph
---
[INFO] Using 'UTF-8' encoding to copy filtered resources.
[INFO] Copying 1 resource
[INFO] skip non existing resourceDirectory <https://builds.apache.org/job/Streams%20Examples/ws/local/twitter-follow-graph/src/main/xmlschema>
[INFO] Copying 1 resource
[INFO] 
[INFO] --- jsonschema2pojo-maven-plugin:0.4.6:generate (default) @ twitter-follow-graph ---
[INFO] 
[INFO] --- build-helper-maven-plugin:1.8:add-source (add-source) @ twitter-follow-graph ---
[INFO] Source directory: <https://builds.apache.org/job/Streams%20Examples/ws/local/twitter-follow-graph/target/generated-sources/jsonschema2pojo>
added.
[INFO] 
[INFO] --- maven-remote-resources-plugin:1.4:process (default) @ twitter-follow-graph ---
[INFO] 
[INFO] --- maven-resources-plugin:2.7:resources (default-resources) @ twitter-follow-graph
---
[INFO] Using 'UTF-8' encoding to copy filtered resources.
[INFO] Copying 1 resource
[INFO] Copying 4 resources
[INFO] 
[INFO] --- maven-compiler-plugin:3.1:compile (default-compile) @ twitter-follow-graph ---
[INFO] Changes detected - recompiling the module!
[INFO] Compiling 2 source files to <https://builds.apache.org/job/Streams%20Examples/ws/local/twitter-follow-graph/target/classes>
[INFO] -------------------------------------------------------------
[ERROR] COMPILATION ERROR : 
[INFO] -------------------------------------------------------------
[ERROR] <https://builds.apache.org/job/Streams%20Examples/ws/local/twitter-follow-graph/src/main/java/org/apache/streams/example/graph/TwitterFollowGraph.java>:[62,54]
no suitable constructor found for TwitterFollowingProvider(org.apache.streams.twitter.TwitterUserInformationConfiguration)
    constructor org.apache.streams.twitter.provider.TwitterFollowingProvider.TwitterFollowingProvider(org.apache.streams.twitter.TwitterFollowingConfiguration)
is not applicable
      (actual argument org.apache.streams.twitter.TwitterUserInformationConfiguration cannot
be converted to org.apache.streams.twitter.TwitterFollowingConfiguration by method invocation
conversion)
    constructor org.apache.streams.twitter.provider.TwitterFollowingProvider.TwitterFollowingProvider()
is not applicable
      (actual and formal argument lists differ in length)
[INFO] 1 error
[INFO] -------------------------------------------------------------
[INFO] ------------------------------------------------------------------------
[INFO] Reactor Summary:
[INFO] 
[INFO] streams-examples .................................. SUCCESS [  8.945 s]
[INFO] streams-examples-local ............................ SUCCESS [  0.567 s]
[INFO] elasticsearch-hdfs ................................ SUCCESS [02:21 min]
[INFO] elasticsearch-reindex ............................. SUCCESS [01:44 min]
[INFO] mongo-elasticsearch-sync .......................... SUCCESS [ 51.188 s]
[INFO] twitter-follow-graph .............................. FAILURE [  1.824 s]
[INFO] twitter-history-elasticsearch ..................... SKIPPED
[INFO] twitter-userstream-elasticsearch .................. SKIPPED
[INFO] ------------------------------------------------------------------------
[INFO] BUILD FAILURE
[INFO] ------------------------------------------------------------------------
[INFO] Total time: 05:17 min
[INFO] Finished at: 2015-12-04T16:46:28+00:00
[INFO] Final Memory: 65M/875M
[INFO] ------------------------------------------------------------------------
[ERROR] Failed to execute goal org.apache.maven.plugins:maven-compiler-plugin:3.1:compile
(default-compile) on project twitter-follow-graph: Compilation failure
[ERROR] <https://builds.apache.org/job/Streams%20Examples/ws/local/twitter-follow-graph/src/main/java/org/apache/streams/example/graph/TwitterFollowGraph.java>:[62,54]
no suitable constructor found for TwitterFollowingProvider(org.apache.streams.twitter.TwitterUserInformationConfiguration)
[ERROR] constructor org.apache.streams.twitter.provider.TwitterFollowingProvider.TwitterFollowingProvider(org.apache.streams.twitter.TwitterFollowingConfiguration)
is not applicable
[ERROR] (actual argument org.apache.streams.twitter.TwitterUserInformationConfiguration cannot
be converted to org.apache.streams.twitter.TwitterFollowingConfiguration by method invocation
conversion)
[ERROR] constructor org.apache.streams.twitter.provider.TwitterFollowingProvider.TwitterFollowingProvider()
is not applicable
[ERROR] (actual and formal argument lists differ in length)
[ERROR] -> [Help 1]
[ERROR] 
[ERROR] To see the full stack trace of the errors, re-run Maven with the -e switch.
[ERROR] Re-run Maven using the -X switch to enable full debug logging.
[ERROR] 
[ERROR] For more information about the errors and possible solutions, please read the following
articles:
[ERROR] [Help 1] http://cwiki.apache.org/confluence/display/MAVEN/MojoFailureException
[ERROR] 
[ERROR] After correcting the problems, you can resume the build with the command
[ERROR]   mvn <goals> -rf :twitter-follow-graph
[JENKINS] Archiving <https://builds.apache.org/job/Streams%20Examples/ws/local/pom.xml>
to org.apache.streams/streams-examples-local/0.3-incubating-SNAPSHOT/streams-examples-local-0.3-incubating-SNAPSHOT.pom
[JENKINS] Archiving <https://builds.apache.org/job/Streams%20Examples/ws/local/twitter-history-elasticsearch/pom.xml>
to org.apache.streams/twitter-history-elasticsearch/0.3-incubating-SNAPSHOT/twitter-history-elasticsearch-0.3-incubating-SNAPSHOT.pom
[JENKINS] Archiving <https://builds.apache.org/job/Streams%20Examples/ws/local/twitter-follow-graph/pom.xml>
to org.apache.streams/twitter-follow-graph/0.3-incubating-SNAPSHOT/twitter-follow-graph-0.3-incubating-SNAPSHOT.pom
[JENKINS] Archiving <https://builds.apache.org/job/Streams%20Examples/ws/local/elasticsearch-reindex/dependency-reduced-pom.xml>
to org.apache.streams/elasticsearch-reindex/0.3-incubating-SNAPSHOT/elasticsearch-reindex-0.3-incubating-SNAPSHOT.pom
[JENKINS] Archiving <https://builds.apache.org/job/Streams%20Examples/ws/local/elasticsearch-reindex/target/elasticsearch-reindex-0.3-incubating-SNAPSHOT.jar>
to org.apache.streams/elasticsearch-reindex/0.3-incubating-SNAPSHOT/elasticsearch-reindex-0.3-incubating-SNAPSHOT.jar
[JENKINS] Archiving <https://builds.apache.org/job/Streams%20Examples/ws/pom.xml> to
org.apache.streams/streams-examples/0.3-incubating-SNAPSHOT/streams-examples-0.3-incubating-SNAPSHOT.pom
[JENKINS] Archiving <https://builds.apache.org/job/Streams%20Examples/ws/local/twitter-userstream-elasticsearch/pom.xml>
to org.apache.streams/twitter-userstream-elasticsearch/0.3-incubating-SNAPSHOT/twitter-userstream-elasticsearch-0.3-incubating-SNAPSHOT.pom
[JENKINS] Archiving <https://builds.apache.org/job/Streams%20Examples/ws/local/elasticsearch-hdfs/dependency-reduced-pom.xml>
to org.apache.streams/elasticsearch-hdfs/0.3-incubating-SNAPSHOT/elasticsearch-hdfs-0.3-incubating-SNAPSHOT.pom
[JENKINS] Archiving <https://builds.apache.org/job/Streams%20Examples/ws/local/elasticsearch-hdfs/target/elasticsearch-hdfs-0.3-incubating-SNAPSHOT.jar>
to org.apache.streams/elasticsearch-hdfs/0.3-incubating-SNAPSHOT/elasticsearch-hdfs-0.3-incubating-SNAPSHOT.jar
[JENKINS] Archiving <https://builds.apache.org/job/Streams%20Examples/ws/local/mongo-elasticsearch-sync/dependency-reduced-pom.xml>
to org.apache.streams/mongo-elasticsearch-sync/0.3-incubating-SNAPSHOT/mongo-elasticsearch-sync-0.3-incubating-SNAPSHOT.pom
[JENKINS] Archiving <https://builds.apache.org/job/Streams%20Examples/ws/local/mongo-elasticsearch-sync/target/mongo-elasticsearch-sync-0.3-incubating-SNAPSHOT.jar>
to org.apache.streams/mongo-elasticsearch-sync/0.3-incubating-SNAPSHOT/mongo-elasticsearch-sync-0.3-incubating-SNAPSHOT.jar
channel stopped

Mime
View raw message