streams-dev mailing list archives

Site index · List index
Message view « Date » · « Thread »
Top « Date » · « Thread »
From Apache Jenkins Server <jenk...@builds.apache.org>
Subject Build failed in Jenkins: Streams Examples #32
Date Sun, 30 Aug 2015 16:49:08 GMT
See <https://builds.apache.org/job/Streams%20Examples/32/>

------------------------------------------
[...truncated 6619 lines...]
[INFO] Including org.apache.streams:streams-persist-mongo:jar:0.3-incubating-SNAPSHOT in the
shaded jar.
[INFO] Including org.mongodb:mongo-java-driver:jar:2.13.0 in the shaded jar.
[INFO] Including org.apache.streams:streams-pojo:test-jar:tests:0.3-incubating-SNAPSHOT in
the shaded jar.
[INFO] Including com.fasterxml.jackson.core:jackson-databind:jar:2.3.2 in the shaded jar.
[INFO] Including com.fasterxml.jackson.datatype:jackson-datatype-joda:jar:2.3.2 in the shaded
jar.
[INFO] Including com.fasterxml.jackson.dataformat:jackson-dataformat-xml:jar:2.3.2 in the
shaded jar.
[INFO] Including com.fasterxml.jackson.module:jackson-module-jaxb-annotations:jar:2.3.2 in
the shaded jar.
[INFO] Including org.codehaus.woodstox:stax2-api:jar:3.1.1 in the shaded jar.
[INFO] Including javax.xml.stream:stax-api:jar:1.0-2 in the shaded jar.
[INFO] Including com.fasterxml:jackson-xml-databind:jar:0.6.2 in the shaded jar.
[INFO] Including org.codehaus.jackson:jackson-xc:jar:1.9.2 in the shaded jar.
[INFO] Including com.fasterxml:aalto-xml:jar:0.9.9 in the shaded jar.
[INFO] Including joda-time:joda-time:jar:2.2 in the shaded jar.
[INFO] Including nz.net.ultraq.jaxb:jaxb-utilities:jar:1.2.6 in the shaded jar.
[INFO] Including com.sun.xml.bind:jaxb-impl:jar:2.2.7 in the shaded jar.
[INFO] Including com.sun.xml.bind:jaxb-core:jar:2.2.7 in the shaded jar.
[INFO] Including javax.xml.bind:jaxb-api:jar:2.2.7 in the shaded jar.
[INFO] Including com.sun.istack:istack-commons-runtime:jar:2.16 in the shaded jar.
[INFO] Including com.sun.xml.fastinfoset:FastInfoset:jar:1.2.12 in the shaded jar.
[INFO] Including javax.xml.bind:jsr173_api:jar:1.0 in the shaded jar.
[INFO] Including org.reflections:reflections:jar:0.9.9 in the shaded jar.
[INFO] Including org.javassist:javassist:jar:3.18.2-GA in the shaded jar.
[INFO] Including org.slf4j:log4j-over-slf4j:jar:1.7.6 in the shaded jar.
[INFO] Including org.slf4j:jcl-over-slf4j:jar:1.7.6 in the shaded jar.
[INFO] Including org.slf4j:jul-to-slf4j:jar:1.7.6 in the shaded jar.
[INFO] Including ch.qos.logback:logback-classic:jar:1.1.1 in the shaded jar.
[INFO] Including ch.qos.logback:logback-core:jar:1.1.1 in the shaded jar.
[WARNING] stax-api-1.0-2.jar, jsr173_api-1.0.jar define 37 overlapping classes: 
[WARNING]   - javax.xml.stream.XMLOutputFactory
[WARNING]   - javax.xml.stream.events.StartElement
[WARNING]   - javax.xml.stream.events.Namespace
[WARNING]   - javax.xml.stream.XMLInputFactory
[WARNING]   - javax.xml.stream.util.EventReaderDelegate
[WARNING]   - javax.xml.stream.events.Characters
[WARNING]   - javax.xml.stream.XMLStreamReader
[WARNING]   - javax.xml.stream.events.EntityReference
[WARNING]   - javax.xml.stream.StreamFilter
[WARNING]   - javax.xml.stream.XMLStreamWriter
[WARNING]   - 27 more...
[WARNING] jaxb-core-2.2.7.jar, istack-commons-runtime-2.16.jar define 20 overlapping classes:

[WARNING]   - com.sun.istack.localization.Localizer
[WARNING]   - com.sun.istack.localization.NullLocalizable
[WARNING]   - com.sun.istack.XMLStreamException2
[WARNING]   - com.sun.istack.localization.LocalizableMessageFactory
[WARNING]   - com.sun.istack.Pool$Impl
[WARNING]   - com.sun.istack.SAXParseException2
[WARNING]   - com.sun.istack.Builder
[WARNING]   - com.sun.istack.Nullable
[WARNING]   - com.sun.istack.localization.LocalizableMessage
[WARNING]   - com.sun.istack.SAXException2
[WARNING]   - 10 more...
[WARNING] maven-shade-plugin has detected that some class files are
[WARNING] present in two or more JARs. When this happens, only one
[WARNING] single version of the class is copied to the uber jar.
[WARNING] Usually this is not harmful and you can skip these warnings,
[WARNING] otherwise try to manually exclude artifacts based on
[WARNING] mvn dependency:tree -Ddetail=true and the above output.
[WARNING] See http://docs.codehaus.org/display/MAVENUSER/Shade+Plugin
[INFO] Replacing original artifact with shaded artifact.
[INFO] Replacing <https://builds.apache.org/job/Streams%20Examples/ws/local/mongo-elasticsearch-sync/target/mongo-elasticsearch-sync-0.3-incubating-SNAPSHOT.jar>
with <https://builds.apache.org/job/Streams%20Examples/ws/local/mongo-elasticsearch-sync/target/mongo-elasticsearch-sync-0.3-incubating-SNAPSHOT-shaded.jar>
[INFO] Dependency-reduced POM written at: <https://builds.apache.org/job/Streams%20Examples/ws/local/mongo-elasticsearch-sync/dependency-reduced-pom.xml>
[INFO] 
[INFO] --- embedmongo-maven-plugin:0.1.12:start (start) @ mongo-elasticsearch-sync ---
Extract /home/jenkins/.embedmongo/linux/mongodb-linux-x86_64-2.4.0.tgz START
Extract /home/jenkins/.embedmongo/linux/mongodb-linux-x86_64-2.4.0.tgz DONE
[mongod output]note: noprealloc may hurt performance in many applications
[mongod output] Sun Aug 30 16:49:40.115 [DataFileSync] warning: --syncdelay 0 is not recommended
and can have strange performance
[mongod output] Sun Aug 30 16:49:40.122 [initandlisten] MongoDB starting : pid=20646 port=37017
dbpath=<https://builds.apache.org/job/Streams%20Examples/ws/local/mongo-elasticsearch-sync/target/mongotest>
64-bit host=pomona.apache.org
[mongod output] Sun Aug 30 16:49:40.122 [initandlisten] warning: failed to read from /proc/self/numa_maps:
errno:2 No such file or directory
[mongod output] Sun Aug 30 16:49:40.122 [initandlisten] 
[mongod output] Sun Aug 30 16:49:40.122 [initandlisten] db version v2.4.0
[mongod output] Sun Aug 30 16:49:40.122 [initandlisten] git version: ce2d666c04b4a80af58e8bbb3388b0680e8cfeb6
[mongod output] Sun Aug 30 16:49:40.122 [initandlisten] build info: Linux ip-10-2-29-40 2.6.21.7-2.ec2.v1.2.fc8xen
#1 SMP Fri Nov 20 17:48:28 EST 2009 x86_64 BOOST_LIB_VERSION=1_49
[mongod output] Sun Aug 30 16:49:40.122 [initandlisten] allocator: tcmalloc
[mongod output] Sun Aug 30 16:49:40.122 [initandlisten] options: { dbpath: "<https://builds.apache.org/job/Streams%20Examples/ws/local/mongo-elasticsearch-sync/target/mongotest",>
noauth: true, nohttpinterface: true, nojournal: true, noprealloc: true, port: 37017, smallfiles:
true, syncdelay: 0.0 }
[mongod output] Sun Aug 30 16:49:40.127 [initandlisten] waiting for connections on port 37017
[mongod output] [INFO] de.flapdoodle.embed.mongo.config.MongodConfigBuilder$ImmutableMongodConfig@5b9464be
[INFO] 
[INFO] --- maven-failsafe-plugin:2.12.4:integration-test (integration-tests) @ mongo-elasticsearch-sync
---
[INFO] Skipping execution of surefire because it has already been run for this configuration
[JENKINS] Recording test results[INFO] 
[INFO] --- embedmongo-maven-plugin:0.1.12:stop (stop) @ mongo-elasticsearch-sync ---
Sun Aug 30 16:49:40.247 [initandlisten] connection accepted from 127.0.0.1:45862 #1 (1 connection
now open)
[mongod output] Sun Aug 30 16:49:40.247 [conn1] terminating, shutdown command received
[mongod output] Sun Aug 30 16:49:40.247 dbexit: shutdown called
[mongod output] Sun Aug 30 16:49:40.247 [conn1] shutdown: going to close listening sockets...
[mongod output] Sun Aug 30 16:49:40.247 [conn1] closing listening socket: 7
[mongod output] Sun Aug 30 16:49:40.247 [conn1] closing listening socket: 8
[mongod output] Sun Aug 30 16:49:40.247 [conn1] removing socket file: /tmp/mongodb-37017.sock
[mongod output] Sun Aug 30 16:49:40.247 [conn1] shutdown: going to flush diaglog...
[mongod output] Sun Aug 30 16:49:40.247 [conn1] shutdown: going to close sockets...
[mongod output] Sun Aug 30 16:49:40.247 [conn1] shutdown: waiting for fs preallocator...
[mongod output] Sun Aug 30 16:49:40.247 [conn1] shutdown: closing all files...
[mongod output] Sun Aug 30 16:49:40.248 [conn1] closeAllFiles() finished
[mongod output] Sun Aug 30 16:49:40.248 [conn1] shutdown: removing fs lock...
[mongod output] Sun Aug 30 16:49:40.248 dbexit: really exiting now
[mongod output] 

[INFO] 
[INFO] --- maven-failsafe-plugin:2.12.4:verify (integration-tests) @ mongo-elasticsearch-sync
---
[INFO] Failsafe report directory: <https://builds.apache.org/job/Streams%20Examples/ws/local/mongo-elasticsearch-sync/target/failsafe-reports>
[JENKINS] Recording test results
[INFO]                                                                         
[INFO] ------------------------------------------------------------------------
[INFO] Building twitter-follow-graph 0.3-incubating-SNAPSHOT
[INFO] ------------------------------------------------------------------------
[INFO] 
[INFO] --- maven-clean-plugin:2.6:clean (default-clean) @ twitter-follow-graph ---
[INFO] Deleting <https://builds.apache.org/job/Streams%20Examples/ws/local/twitter-follow-graph/target>
[INFO] 
[INFO] --- maven-enforcer-plugin:1.3.1:enforce (enforce-java) @ twitter-follow-graph ---
[INFO] 
[INFO] --- maven-enforcer-plugin:1.3.1:enforce (enforce-banned-dependencies) @ twitter-follow-graph
---
[INFO] 
[INFO] --- maven-enforcer-plugin:1.3.1:enforce (enforce-no-snapshots) @ twitter-follow-graph
---
[INFO] 
[INFO] --- maven-resources-plugin:2.7:copy-resources (copy-resources) @ twitter-follow-graph
---
[INFO] Using 'UTF-8' encoding to copy filtered resources.
[INFO] Copying 1 resource
[INFO] skip non existing resourceDirectory <https://builds.apache.org/job/Streams%20Examples/ws/local/twitter-follow-graph/src/main/xmlschema>
[INFO] Copying 1 resource
[INFO] 
[INFO] --- jsonschema2pojo-maven-plugin:0.4.6:generate (default) @ twitter-follow-graph ---
[INFO] 
[INFO] --- build-helper-maven-plugin:1.8:add-source (add-source) @ twitter-follow-graph ---
[INFO] Source directory: <https://builds.apache.org/job/Streams%20Examples/ws/local/twitter-follow-graph/target/generated-sources/jsonschema2pojo>
added.
[INFO] 
[INFO] --- maven-remote-resources-plugin:1.4:process (default) @ twitter-follow-graph ---
[INFO] 
[INFO] --- maven-resources-plugin:2.7:resources (default-resources) @ twitter-follow-graph
---
[INFO] Using 'UTF-8' encoding to copy filtered resources.
[INFO] Copying 1 resource
[INFO] Copying 4 resources
[INFO] 
[INFO] --- maven-compiler-plugin:3.1:compile (default-compile) @ twitter-follow-graph ---
[INFO] Changes detected - recompiling the module!
[INFO] Compiling 3 source files to <https://builds.apache.org/job/Streams%20Examples/ws/local/twitter-follow-graph/target/classes>
[INFO] -------------------------------------------------------------
[ERROR] COMPILATION ERROR : 
[INFO] -------------------------------------------------------------
[ERROR] <https://builds.apache.org/job/Streams%20Examples/ws/local/twitter-follow-graph/src/main/java/org/apache/streams/example/graph/TwitterFollowGraph.java>:[33,32]
cannot find symbol
  symbol:   class GraphHttpPersistWriter
  location: package org.apache.streams.graph
[ERROR] <https://builds.apache.org/job/Streams%20Examples/ws/local/twitter-follow-graph/src/main/java/org/apache/streams/example/graph/TwitterFollowGraph.java>:[72,9]
cannot find symbol
  symbol:   class GraphHttpPersistWriter
  location: class org.apache.streams.example.graph.TwitterFollowGraph
[ERROR] <https://builds.apache.org/job/Streams%20Examples/ws/local/twitter-follow-graph/src/main/java/org/apache/streams/example/graph/TwitterFollowGraph.java>:[72,57]
cannot find symbol
  symbol:   class GraphHttpPersistWriter
  location: class org.apache.streams.example.graph.TwitterFollowGraph
[INFO] 3 errors 
[INFO] -------------------------------------------------------------
[INFO] ------------------------------------------------------------------------
[INFO] Reactor Summary:
[INFO] 
[INFO] streams-examples .................................. SUCCESS [  3.104 s]
[INFO] streams-examples-local ............................ SUCCESS [  0.456 s]
[INFO] elasticsearch-hdfs ................................ SUCCESS [02:09 min]
[INFO] elasticsearch-reindex ............................. SUCCESS [01:51 min]
[INFO] mongo-elasticsearch-sync .......................... SUCCESS [ 50.040 s]
[INFO] twitter-follow-graph .............................. FAILURE [  1.471 s]
[INFO] twitter-history-elasticsearch ..................... SKIPPED
[INFO] twitter-userstream-elasticsearch .................. SKIPPED
[INFO] ------------------------------------------------------------------------
[INFO] BUILD FAILURE
[INFO] ------------------------------------------------------------------------
[INFO] Total time: 05:02 min
[INFO] Finished at: 2015-08-30T16:49:44+00:00
[INFO] Final Memory: 76M/860M
[INFO] ------------------------------------------------------------------------
[ERROR] Failed to execute goal org.apache.maven.plugins:maven-compiler-plugin:3.1:compile
(default-compile) on project twitter-follow-graph: Compilation failure: Compilation failure:
[ERROR] <https://builds.apache.org/job/Streams%20Examples/ws/local/twitter-follow-graph/src/main/java/org/apache/streams/example/graph/TwitterFollowGraph.java>:[33,32]
cannot find symbol
[ERROR] symbol:   class GraphHttpPersistWriter
[ERROR] location: package org.apache.streams.graph
[ERROR] <https://builds.apache.org/job/Streams%20Examples/ws/local/twitter-follow-graph/src/main/java/org/apache/streams/example/graph/TwitterFollowGraph.java>:[72,9]
cannot find symbol
[ERROR] symbol:   class GraphHttpPersistWriter
[ERROR] location: class org.apache.streams.example.graph.TwitterFollowGraph
[ERROR] <https://builds.apache.org/job/Streams%20Examples/ws/local/twitter-follow-graph/src/main/java/org/apache/streams/example/graph/TwitterFollowGraph.java>:[72,57]
cannot find symbol
[ERROR] symbol:   class GraphHttpPersistWriter
[ERROR] location: class org.apache.streams.example.graph.TwitterFollowGraph
[ERROR] -> [Help 1]
[ERROR] 
[ERROR] To see the full stack trace of the errors, re-run Maven with the -e switch.
[ERROR] Re-run Maven using the -X switch to enable full debug logging.
[ERROR] 
[ERROR] For more information about the errors and possible solutions, please read the following
articles:
[ERROR] [Help 1] http://cwiki.apache.org/confluence/display/MAVEN/MojoFailureException
[ERROR] 
[ERROR] After correcting the problems, you can resume the build with the command
[ERROR]   mvn <goals> -rf :twitter-follow-graph
[JENKINS] Archiving <https://builds.apache.org/job/Streams%20Examples/ws/local/pom.xml>
to org.apache.streams/streams-examples-local/0.3-incubating-SNAPSHOT/streams-examples-local-0.3-incubating-SNAPSHOT.pom
Sending artifact delta relative to Streams Examples » streams-examples-local #31
Archived 1 artifacts
Archive block size is 32768
Received 0 blocks and 1967 bytes
Compression is 0.0%
Took 26 ms
[JENKINS] Archiving <https://builds.apache.org/job/Streams%20Examples/ws/local/twitter-history-elasticsearch/pom.xml>
to org.apache.streams/twitter-history-elasticsearch/0.3-incubating-SNAPSHOT/twitter-history-elasticsearch-0.3-incubating-SNAPSHOT.pom
Sending artifact delta relative to Streams Examples » twitter-history-elasticsearch #28
Archived 1 artifacts
Archive block size is 32768
Received 0 blocks and 14397 bytes
Compression is 0.0%
Took 0.64 sec
[JENKINS] Archiving <https://builds.apache.org/job/Streams%20Examples/ws/local/twitter-follow-graph/pom.xml>
to org.apache.streams/twitter-follow-graph/0.3-incubating-SNAPSHOT/twitter-follow-graph-0.3-incubating-SNAPSHOT.pom
Sending artifact delta relative to Streams Examples » twitter-follow-graph #28
Archived 1 artifacts
Archive block size is 32768
Received 0 blocks and 12821 bytes
Compression is 0.0%
Took 0.31 sec
[JENKINS] Archiving <https://builds.apache.org/job/Streams%20Examples/ws/local/elasticsearch-reindex/dependency-reduced-pom.xml>
to org.apache.streams/elasticsearch-reindex/0.3-incubating-SNAPSHOT/elasticsearch-reindex-0.3-incubating-SNAPSHOT.pom
[JENKINS] Archiving <https://builds.apache.org/job/Streams%20Examples/ws/local/elasticsearch-reindex/target/elasticsearch-reindex-0.3-incubating-SNAPSHOT.jar>
to org.apache.streams/elasticsearch-reindex/0.3-incubating-SNAPSHOT/elasticsearch-reindex-0.3-incubating-SNAPSHOT.jar
Sending artifact delta relative to Streams Examples » elasticsearch-reindex #31
Archived 2 artifacts
Archive block size is 32768
Received 11 blocks and 30642746 bytes
Compression is 1.2%
Took 8.2 sec
[JENKINS] Archiving <https://builds.apache.org/job/Streams%20Examples/ws/pom.xml> to
org.apache.streams/streams-examples/0.3-incubating-SNAPSHOT/streams-examples-0.3-incubating-SNAPSHOT.pom
Sending artifact delta relative to Streams Examples » streams-examples #31
Archived 1 artifacts
Archive block size is 32768
Received 0 blocks and 2938 bytes
Compression is 0.0%
Took 41 ms
[JENKINS] Archiving <https://builds.apache.org/job/Streams%20Examples/ws/local/twitter-userstream-elasticsearch/pom.xml>
to org.apache.streams/twitter-userstream-elasticsearch/0.3-incubating-SNAPSHOT/twitter-userstream-elasticsearch-0.3-incubating-SNAPSHOT.pom
Sending artifact delta relative to Streams Examples » twitter-userstream-elasticsearch #28
Archived 1 artifacts
Archive block size is 32768
Received 0 blocks and 12014 bytes
Compression is 0.0%
Took 0.73 sec
[JENKINS] Archiving <https://builds.apache.org/job/Streams%20Examples/ws/local/elasticsearch-hdfs/dependency-reduced-pom.xml>
to org.apache.streams/elasticsearch-hdfs/0.3-incubating-SNAPSHOT/elasticsearch-hdfs-0.3-incubating-SNAPSHOT.pom
[JENKINS] Archiving <https://builds.apache.org/job/Streams%20Examples/ws/local/elasticsearch-hdfs/target/elasticsearch-hdfs-0.3-incubating-SNAPSHOT.jar>
to org.apache.streams/elasticsearch-hdfs/0.3-incubating-SNAPSHOT/elasticsearch-hdfs-0.3-incubating-SNAPSHOT.jar
Sending artifact delta relative to Streams Examples » elasticsearch-hdfs #31
Archived 2 artifacts
Archive block size is 32768
Received 37 blocks and 53820687 bytes
Compression is 2.2%
Took 14 sec
[JENKINS] Archiving <https://builds.apache.org/job/Streams%20Examples/ws/local/mongo-elasticsearch-sync/dependency-reduced-pom.xml>
to org.apache.streams/mongo-elasticsearch-sync/0.3-incubating-SNAPSHOT/mongo-elasticsearch-sync-0.3-incubating-SNAPSHOT.pom
[JENKINS] Archiving <https://builds.apache.org/job/Streams%20Examples/ws/local/mongo-elasticsearch-sync/target/mongo-elasticsearch-sync-0.3-incubating-SNAPSHOT.jar>
to org.apache.streams/mongo-elasticsearch-sync/0.3-incubating-SNAPSHOT/mongo-elasticsearch-sync-0.3-incubating-SNAPSHOT.jar
Sending artifact delta relative to Streams Examples » mongo-elasticsearch-sync #31
Archived 2 artifacts
Archive block size is 32768
Received 11 blocks and 31259874 bytes
Compression is 1.1%
Took 8.6 sec
channel stopped

Mime
View raw message