streams-dev mailing list archives

Site index · List index
Message view « Date » · « Thread »
Top « Date » · « Thread »
From Apache Jenkins Server <jenk...@builds.apache.org>
Subject Build failed in Jenkins: Streams Master #20
Date Wed, 19 Aug 2015 06:19:35 GMT
See <https://builds.apache.org/job/Streams%20Master/20/>

------------------------------------------
Started by upstream project "Streams Trunk" build number 187
originally caused by:
 Started by an SCM change
 Started by an SCM change
 Started by an SCM change
 Started by an SCM change
 Started by an SCM change
 Started by an SCM change
 Started by an SCM change
Building remotely on jenkins-ubuntu-1404-4gb-e8c (jenkins-cloud-4GB cloud-slave Ubuntu ubuntu)
in workspace <https://builds.apache.org/job/Streams%20Master/ws/>
Wiping out workspace first.
Cloning the remote Git repository
Cloning repository https://git-wip-us.apache.org/repos/asf/incubator-streams-master.git
 > git init <https://builds.apache.org/job/Streams%20Master/ws/> # timeout=10
Fetching upstream changes from https://git-wip-us.apache.org/repos/asf/incubator-streams-master.git
 > git --version # timeout=10
 > git fetch --tags --progress https://git-wip-us.apache.org/repos/asf/incubator-streams-master.git
+refs/heads/*:refs/remotes/origin/*
 > git config remote.origin.url https://git-wip-us.apache.org/repos/asf/incubator-streams-master.git
# timeout=10
 > git config remote.origin.fetch +refs/heads/*:refs/remotes/origin/* # timeout=10
 > git config remote.origin.url https://git-wip-us.apache.org/repos/asf/incubator-streams-master.git
# timeout=10
Cleaning workspace
 > git rev-parse --verify HEAD # timeout=10
No valid HEAD. Skipping the resetting
 > git clean -fdx # timeout=10
Fetching upstream changes from https://git-wip-us.apache.org/repos/asf/incubator-streams-master.git
 > git fetch --tags --progress https://git-wip-us.apache.org/repos/asf/incubator-streams-master.git
+refs/heads/*:refs/remotes/origin/*
 > git rev-parse origin/master^{commit} # timeout=10
Checking out Revision b5a4dba4f337ca57a8b916032b3d330dde4219f9 (origin/master)
 > git config core.sparsecheckout # timeout=10
 > git checkout -f b5a4dba4f337ca57a8b916032b3d330dde4219f9
 > git rev-list b5a4dba4f337ca57a8b916032b3d330dde4219f9 # timeout=10
Parsing POMs
maven31-agent.jar already up to date
maven31-interceptor.jar already up to date
maven3-interceptor-commons.jar already up to date
[Streams Master] $ /jenkins/tools/hudson.model.JDK/jdk-1.7u51/bin/java -Xmx2g -Xms256m -XX:MaxPermSize=512m
-Dfile.encoding=UTF-8 -cp /jenkins/maven31-agent.jar:/jenkins/tools/hudson.tasks.Maven_MavenInstallation/maven-3.2.1/boot/plexus-classworlds-2.5.1.jar:/jenkins/tools/hudson.tasks.Maven_MavenInstallation/maven-3.2.1/conf/logging
jenkins.maven3.agent.Maven31Main /jenkins/tools/hudson.tasks.Maven_MavenInstallation/maven-3.2.1
/jenkins/slave.jar /jenkins/maven31-interceptor.jar /jenkins/maven3-interceptor-commons.jar
58770
<===[JENKINS Rchannel started
EMOTING CAPACITY]===>   Executing Maven:  -B -f <https://builds.apache.org/job/Streams%20Master/ws/pom.xml>
-Dmaven.repo.local=/jenkins/maven-repositories/0 clean install verify
[INFO] Scanning for projects...
[INFO] 
[INFO] Using the builder org.apache.maven.lifecycle.internal.builder.singlethreaded.SingleThreadedBuilder
with a thread count of 1
[INFO]                                                                         
[INFO] ------------------------------------------------------------------------
[INFO] Building Apache Streams :: streams-master 0.3-incubating-SNAPSHOT
[INFO] ------------------------------------------------------------------------
[INFO] Downloading: http://repo.maven.apache.org/maven2/org/apache/maven/plugins/maven-project-info-reports-plugin/2.8/maven-project-info-reports-plugin-2.8.pom
[INFO] Downloaded: http://repo.maven.apache.org/maven2/org/apache/maven/plugins/maven-project-info-reports-plugin/2.8/maven-project-info-reports-plugin-2.8.pom
(19 KB at 92.4 KB/sec)
[INFO] Downloading: http://repo.maven.apache.org/maven2/org/apache/maven/plugins/maven-project-info-reports-plugin/2.8/maven-project-info-reports-plugin-2.8.jar
[INFO] Downloaded: http://repo.maven.apache.org/maven2/org/apache/maven/plugins/maven-project-info-reports-plugin/2.8/maven-project-info-reports-plugin-2.8.jar
(294 KB at 3534.5 KB/sec)
[INFO] Downloading: http://repo.maven.apache.org/maven2/org/apache/maven/plugins/maven-clean-plugin/2.6/maven-clean-plugin-2.6.pom
[INFO] Downloaded: http://repo.maven.apache.org/maven2/org/apache/maven/plugins/maven-clean-plugin/2.6/maven-clean-plugin-2.6.pom
(6 KB at 190.9 KB/sec)
[INFO] Downloading: http://repo.maven.apache.org/maven2/org/apache/maven/plugins/maven-clean-plugin/2.6/maven-clean-plugin-2.6.jar
[INFO] Downloaded: http://repo.maven.apache.org/maven2/org/apache/maven/plugins/maven-clean-plugin/2.6/maven-clean-plugin-2.6.jar
(28 KB at 932.9 KB/sec)
[INFO] 
[INFO] --- maven-clean-plugin:2.6:clean (default-clean) @ streams-master ---
[INFO] 
[INFO] --- maven-remote-resources-plugin:1.4:process (default) @ streams-master ---
[INFO] Downloading: https://repository.apache.org/content/repositories/releases/org/apache/apache-incubator-disclaimer-resource-bundle/1.1/apache-incubator-disclaimer-resource-bundle-1.1.jar
[INFO] Downloading: http://repo.maven.apache.org/maven2/org/apache/apache-incubator-disclaimer-resource-bundle/1.1/apache-incubator-disclaimer-resource-bundle-1.1.jar
[INFO] Downloaded: http://repo.maven.apache.org/maven2/org/apache/apache-incubator-disclaimer-resource-bundle/1.1/apache-incubator-disclaimer-resource-bundle-1.1.jar
(7 KB at 230.7 KB/sec)
[INFO] 
[INFO] --- maven-site-plugin:3.4:attach-descriptor (attach-descriptor) @ streams-master ---
[INFO] Downloading: http://repo.maven.apache.org/maven2/org/apache/maven/wagon/wagon-scm/2.8/wagon-scm-2.8.pom
[INFO] Downloaded: http://repo.maven.apache.org/maven2/org/apache/maven/wagon/wagon-scm/2.8/wagon-scm-2.8.pom
(3 KB at 109.3 KB/sec)
[INFO] Downloading: http://repo.maven.apache.org/maven2/org/apache/maven/wagon/wagon-providers/2.8/wagon-providers-2.8.pom
[INFO] Downloaded: http://repo.maven.apache.org/maven2/org/apache/maven/wagon/wagon-providers/2.8/wagon-providers-2.8.pom
(3 KB at 102.4 KB/sec)
[INFO] Downloading: http://repo.maven.apache.org/maven2/org/apache/maven/wagon/wagon/2.8/wagon-2.8.pom
[INFO] Downloaded: http://repo.maven.apache.org/maven2/org/apache/maven/wagon/wagon/2.8/wagon-2.8.pom
(19 KB at 577.9 KB/sec)
[INFO] Downloading: http://repo.maven.apache.org/maven2/org/apache/maven/scm/maven-scm-api/1.5/maven-scm-api-1.5.pom
[INFO] Downloaded: http://repo.maven.apache.org/maven2/org/apache/maven/scm/maven-scm-api/1.5/maven-scm-api-1.5.pom
(2 KB at 61.6 KB/sec)
[INFO] Downloading: http://repo.maven.apache.org/maven2/org/apache/maven/scm/maven-scm-manager-plexus/1.5/maven-scm-manager-plexus-1.5.pom
[INFO] Downloaded: http://repo.maven.apache.org/maven2/org/apache/maven/scm/maven-scm-manager-plexus/1.5/maven-scm-manager-plexus-1.5.pom
(3 KB at 88.1 KB/sec)
[INFO] Downloading: http://repo.maven.apache.org/maven2/org/apache/maven/scm/maven-scm-managers/1.5/maven-scm-managers-1.5.pom
[INFO] Downloaded: http://repo.maven.apache.org/maven2/org/apache/maven/scm/maven-scm-managers/1.5/maven-scm-managers-1.5.pom
(2 KB at 58.2 KB/sec)
[INFO] Downloading: http://repo.maven.apache.org/maven2/org/apache/maven/wagon/wagon-provider-api/2.8/wagon-provider-api-2.8.pom
[INFO] Downloaded: http://repo.maven.apache.org/maven2/org/apache/maven/wagon/wagon-provider-api/2.8/wagon-provider-api-2.8.pom
(2 KB at 28.2 KB/sec)
[INFO] Downloading: http://repo.maven.apache.org/maven2/org/apache/maven/scm/maven-scm-api/1.9.4/maven-scm-api-1.9.4.pom
[INFO] Downloaded: http://repo.maven.apache.org/maven2/org/apache/maven/scm/maven-scm-api/1.9.4/maven-scm-api-1.9.4.pom
(2 KB at 64.2 KB/sec)
[INFO] Downloading: http://repo.maven.apache.org/maven2/org/apache/maven/scm/maven-scm/1.9.4/maven-scm-1.9.4.pom
[INFO] Downloaded: http://repo.maven.apache.org/maven2/org/apache/maven/scm/maven-scm/1.9.4/maven-scm-1.9.4.pom
(22 KB at 771.1 KB/sec)
[INFO] Downloading: http://repo.maven.apache.org/maven2/org/apache/maven/scm/maven-scm-provider-svn-commons/1.9.4/maven-scm-provider-svn-commons-1.9.4.pom
[INFO] Downloaded: http://repo.maven.apache.org/maven2/org/apache/maven/scm/maven-scm-provider-svn-commons/1.9.4/maven-scm-provider-svn-commons-1.9.4.pom
(3 KB at 109.9 KB/sec)
[INFO] Downloading: http://repo.maven.apache.org/maven2/org/apache/maven/scm/maven-scm-providers-svn/1.9.4/maven-scm-providers-svn-1.9.4.pom
[INFO] Downloaded: http://repo.maven.apache.org/maven2/org/apache/maven/scm/maven-scm-providers-svn/1.9.4/maven-scm-providers-svn-1.9.4.pom
(3 KB at 86.5 KB/sec)
[INFO] Downloading: http://repo.maven.apache.org/maven2/org/apache/maven/scm/maven-scm-providers/1.9.4/maven-scm-providers-1.9.4.pom
[INFO] Downloaded: http://repo.maven.apache.org/maven2/org/apache/maven/scm/maven-scm-providers/1.9.4/maven-scm-providers-1.9.4.pom
(4 KB at 136.9 KB/sec)
[INFO] Downloading: http://repo.maven.apache.org/maven2/org/apache/maven/scm/maven-scm-provider-svnexe/1.9.4/maven-scm-provider-svnexe-1.9.4.pom
[INFO] Downloaded: http://repo.maven.apache.org/maven2/org/apache/maven/scm/maven-scm-provider-svnexe/1.9.4/maven-scm-provider-svnexe-1.9.4.pom
(3 KB at 103.2 KB/sec)
[INFO] Downloading: http://repo.maven.apache.org/maven2/org/apache/maven/wagon/wagon-scm/2.8/wagon-scm-2.8.jar
[INFO] Downloading: http://repo.maven.apache.org/maven2/org/apache/maven/scm/maven-scm-api/1.9.4/maven-scm-api-1.9.4.jar
[INFO] Downloading: http://repo.maven.apache.org/maven2/org/apache/maven/scm/maven-scm-manager-plexus/1.5/maven-scm-manager-plexus-1.5.jar
[INFO] Downloading: http://repo.maven.apache.org/maven2/org/apache/maven/scm/maven-scm-provider-svn-commons/1.9.4/maven-scm-provider-svn-commons-1.9.4.jar
[INFO] Downloading: http://repo.maven.apache.org/maven2/org/apache/maven/scm/maven-scm-provider-svnexe/1.9.4/maven-scm-provider-svnexe-1.9.4.jar
[INFO] Downloaded: http://repo.maven.apache.org/maven2/org/apache/maven/wagon/wagon-scm/2.8/wagon-scm-2.8.jar
(16 KB at 246.8 KB/sec)
[INFO] Downloaded: http://repo.maven.apache.org/maven2/org/apache/maven/scm/maven-scm-manager-plexus/1.5/maven-scm-manager-plexus-1.5.jar
(11 KB at 156.3 KB/sec)
[INFO] Downloaded: http://repo.maven.apache.org/maven2/org/apache/maven/scm/maven-scm-api/1.9.4/maven-scm-api-1.9.4.jar
(105 KB at 1175.4 KB/sec)
[INFO] Downloaded: http://repo.maven.apache.org/maven2/org/apache/maven/scm/maven-scm-provider-svn-commons/1.9.4/maven-scm-provider-svn-commons-1.9.4.jar
(37 KB at 439.1 KB/sec)
[INFO] Downloaded: http://repo.maven.apache.org/maven2/org/apache/maven/scm/maven-scm-provider-svnexe/1.9.4/maven-scm-provider-svnexe-1.9.4.jar
(76 KB at 1377.8 KB/sec)
[INFO] 
[INFO] --- maven-install-plugin:2.5.2:install (default-install) @ streams-master ---
[INFO] Installing <https://builds.apache.org/job/Streams%20Master/ws/pom.xml> to /jenkins/maven-repositories/0/org/apache/streams/streams-master/0.3-incubating-SNAPSHOT/streams-master-0.3-incubating-SNAPSHOT.pom
[INFO] 
[INFO] --- maven-remote-resources-plugin:1.4:process (default) @ streams-master ---
[INFO] 
[INFO] --- maven-site-plugin:3.4:attach-descriptor (attach-descriptor) @ streams-master ---
[INFO] ------------------------------------------------------------------------
[INFO] BUILD SUCCESS
[INFO] ------------------------------------------------------------------------
[INFO] Total time: 13.709 s
[INFO] Finished at: 2015-08-19T06:20:25+00:00
[INFO] Final Memory: 20M/246M
[INFO] ------------------------------------------------------------------------
Waiting for Jenkins to finish collecting data
[JENKINS] Archiving <https://builds.apache.org/job/Streams%20Master/ws/pom.xml> to org.apache.streams/streams-master/0.3-incubating-SNAPSHOT/streams-master-0.3-incubating-SNAPSHOT.pom
Sending artifact delta relative to Streams Master ยป Apache Streams :: streams-master #19
Archived 1 artifacts
Archive block size is 32768
Received 1 blocks and 1113 bytes
Compression is 96.7%
Took 0.16 sec
channel stopped
Maven RedeployPublisher use remote jenkins-ubuntu-1404-4gb-e8c maven settings from : /home/jenkins/.m2/settings.xml
[INFO] Deployment in https://repository.apache.org/content/repositories/snapshots (id=streams.snapshots,uniqueVersion=true)
Deploying the main artifact streams-master-0.3-incubating-SNAPSHOT.pom
Downloading: https://repository.apache.org/content/repositories/snapshots/org/apache/streams/streams-master/0.3-incubating-SNAPSHOT/maven-metadata.xml
Uploading: https://repository.apache.org/content/repositories/snapshots/org/apache/streams/streams-master/0.3-incubating-SNAPSHOT/streams-master-0.3-incubating-20150819.061933-1.pom
ERROR: Failed to deploy artifacts: Could not transfer artifact org.apache.streams:streams-master:pom:0.3-incubating-20150819.061933-1
from/to streams.snapshots (https://repository.apache.org/content/repositories/snapshots):
Failed to transfer file: https://repository.apache.org/content/repositories/snapshots/org/apache/streams/streams-master/0.3-incubating-SNAPSHOT/streams-master-0.3-incubating-20150819.061933-1.pom.
Return code is: 401, ReasonPhrase: Unauthorized.
org.apache.maven.artifact.deployer.ArtifactDeploymentException: Failed to deploy artifacts:
Could not transfer artifact org.apache.streams:streams-master:pom:0.3-incubating-20150819.061933-1
from/to streams.snapshots (https://repository.apache.org/content/repositories/snapshots):
Failed to transfer file: https://repository.apache.org/content/repositories/snapshots/org/apache/streams/streams-master/0.3-incubating-SNAPSHOT/streams-master-0.3-incubating-20150819.061933-1.pom.
Return code is: 401, ReasonPhrase: Unauthorized.
	at org.apache.maven.artifact.deployer.DefaultArtifactDeployer.deploy(DefaultArtifactDeployer.java:143)
	at hudson.maven.reporters.MavenArtifactRecord.deploy(MavenArtifactRecord.java:193)
	at hudson.maven.RedeployPublisher.perform(RedeployPublisher.java:176)
	at hudson.tasks.BuildStepMonitor$1.perform(BuildStepMonitor.java:20)
	at hudson.model.AbstractBuild$AbstractBuildExecution.perform(AbstractBuild.java:756)
	at hudson.model.AbstractBuild$AbstractBuildExecution.performAllBuildSteps(AbstractBuild.java:720)
	at hudson.maven.MavenModuleSetBuild$MavenModuleSetBuildExecution.post2(MavenModuleSetBuild.java:1037)
	at hudson.model.AbstractBuild$AbstractBuildExecution.post(AbstractBuild.java:669)
	at hudson.model.Run.execute(Run.java:1731)
	at hudson.maven.MavenModuleSetBuild.run(MavenModuleSetBuild.java:529)
	at hudson.model.ResourceController.execute(ResourceController.java:88)
	at hudson.model.Executor.run(Executor.java:232)
Caused by: org.eclipse.aether.deployment.DeploymentException: Failed to deploy artifacts:
Could not transfer artifact org.apache.streams:streams-master:pom:0.3-incubating-20150819.061933-1
from/to streams.snapshots (https://repository.apache.org/content/repositories/snapshots):
Failed to transfer file: https://repository.apache.org/content/repositories/snapshots/org/apache/streams/streams-master/0.3-incubating-SNAPSHOT/streams-master-0.3-incubating-20150819.061933-1.pom.
Return code is: 401, ReasonPhrase: Unauthorized.
	at org.eclipse.aether.internal.impl.DefaultDeployer.deploy(DefaultDeployer.java:341)
	at org.eclipse.aether.internal.impl.DefaultDeployer.deploy(DefaultDeployer.java:269)
	at org.eclipse.aether.internal.impl.DefaultRepositorySystem.deploy(DefaultRepositorySystem.java:413)
	at org.apache.maven.artifact.deployer.DefaultArtifactDeployer.deploy(DefaultArtifactDeployer.java:139)
	... 11 more
Caused by: org.eclipse.aether.transfer.ArtifactTransferException: Could not transfer artifact
org.apache.streams:streams-master:pom:0.3-incubating-20150819.061933-1 from/to streams.snapshots
(https://repository.apache.org/content/repositories/snapshots): Failed to transfer file: https://repository.apache.org/content/repositories/snapshots/org/apache/streams/streams-master/0.3-incubating-SNAPSHOT/streams-master-0.3-incubating-20150819.061933-1.pom.
Return code is: 401, ReasonPhrase: Unauthorized.
	at org.eclipse.aether.connector.wagon.WagonRepositoryConnector$6.wrap(WagonRepositoryConnector.java:1016)
	at org.eclipse.aether.connector.wagon.WagonRepositoryConnector$6.wrap(WagonRepositoryConnector.java:1004)
	at org.eclipse.aether.connector.wagon.WagonRepositoryConnector$PutTask.run(WagonRepositoryConnector.java:895)
	at org.eclipse.aether.connector.wagon.WagonRepositoryConnector.put(WagonRepositoryConnector.java:522)
	at org.eclipse.aether.internal.impl.DefaultDeployer.deploy(DefaultDeployer.java:335)
	... 14 more
Caused by: org.apache.maven.wagon.TransferFailedException: Failed to transfer file: https://repository.apache.org/content/repositories/snapshots/org/apache/streams/streams-master/0.3-incubating-SNAPSHOT/streams-master-0.3-incubating-20150819.061933-1.pom.
Return code is: 401, ReasonPhrase: Unauthorized.
	at org.apache.maven.wagon.shared.http4.AbstractHttpClientWagon.put(AbstractHttpClientWagon.java:626)
	at org.apache.maven.wagon.shared.http4.AbstractHttpClientWagon.put(AbstractHttpClientWagon.java:524)
	at org.apache.maven.wagon.shared.http4.AbstractHttpClientWagon.put(AbstractHttpClientWagon.java:505)
	at org.apache.maven.wagon.shared.http4.AbstractHttpClientWagon.put(AbstractHttpClientWagon.java:485)
	at org.eclipse.aether.connector.wagon.WagonRepositoryConnector$PutTask.run(WagonRepositoryConnector.java:871)
	... 16 more
[INFO] Deployment failed after 5.1 sec
Build step 'Deploy artifacts to Maven repository' changed build result to FAILURE

Mime
View raw message