streams-dev mailing list archives

Site index · List index
Message view « Date » · « Thread »
Top « Date » · « Thread »
From Apache Jenkins Server <jenk...@builds.apache.org>
Subject Build failed in Jenkins: Streams Master #17
Date Mon, 06 Jul 2015 23:21:25 GMT
See <https://builds.apache.org/job/Streams%20Master/17/>

------------------------------------------
[...truncated 1829 lines...]
jdk1.7.0_51/jre/lib/security/cacerts
jdk1.7.0_51/jre/lib/security/java.policy
jdk1.7.0_51/jre/lib/security/US_export_policy.jar
jdk1.7.0_51/jre/lib/security/java.security
jdk1.7.0_51/jre/lib/security/blacklist
jdk1.7.0_51/jre/lib/security/javaws.policy
jdk1.7.0_51/jre/lib/jfxrt.jar
jdk1.7.0_51/jre/lib/fontconfig.Turbo.properties.src
jdk1.7.0_51/jre/lib/jfr/
jdk1.7.0_51/jre/lib/jfr/profile.jfc
jdk1.7.0_51/jre/lib/jfr/default.jfc
jdk1.7.0_51/jre/lib/fontconfig.RedHat.5.properties.src
jdk1.7.0_51/jre/lib/net.properties
jdk1.7.0_51/jre/lib/content-types.properties
jdk1.7.0_51/jre/lib/fontconfig.RedHat.5.bfc
jdk1.7.0_51/jre/lib/alt-rt.jar
jdk1.7.0_51/jre/lib/logging.properties
jdk1.7.0_51/jre/lib/applet/
jdk1.7.0_51/jre/lib/cmm/
jdk1.7.0_51/jre/lib/cmm/LINEAR_RGB.pf
jdk1.7.0_51/jre/lib/cmm/GRAY.pf
jdk1.7.0_51/jre/lib/cmm/sRGB.pf
jdk1.7.0_51/jre/lib/cmm/PYCC.pf
jdk1.7.0_51/jre/lib/cmm/CIEXYZ.pf
jdk1.7.0_51/jre/lib/locale/
jdk1.7.0_51/jre/lib/locale/zh_TW.BIG5/
jdk1.7.0_51/jre/lib/locale/zh_TW.BIG5/LC_MESSAGES/
jdk1.7.0_51/jre/lib/locale/zh_TW.BIG5/LC_MESSAGES/sunw_java_plugin.mo
jdk1.7.0_51/jre/lib/locale/pt_BR/
jdk1.7.0_51/jre/lib/locale/pt_BR/LC_MESSAGES/
jdk1.7.0_51/jre/lib/locale/pt_BR/LC_MESSAGES/sunw_java_plugin.mo
jdk1.7.0_51/jre/lib/locale/de/
jdk1.7.0_51/jre/lib/locale/de/LC_MESSAGES/
jdk1.7.0_51/jre/lib/locale/de/LC_MESSAGES/sunw_java_plugin.mo
jdk1.7.0_51/jre/lib/locale/it/
jdk1.7.0_51/jre/lib/locale/it/LC_MESSAGES/
jdk1.7.0_51/jre/lib/locale/it/LC_MESSAGES/sunw_java_plugin.mo
jdk1.7.0_51/jre/lib/locale/zh_TW/
jdk1.7.0_51/jre/lib/locale/zh_TW/LC_MESSAGES/
jdk1.7.0_51/jre/lib/locale/zh_TW/LC_MESSAGES/sunw_java_plugin.mo
jdk1.7.0_51/jre/lib/locale/zh/
jdk1.7.0_51/jre/lib/locale/zh/LC_MESSAGES/
jdk1.7.0_51/jre/lib/locale/zh/LC_MESSAGES/sunw_java_plugin.mo
jdk1.7.0_51/jre/lib/locale/ja/
jdk1.7.0_51/jre/lib/locale/ja/LC_MESSAGES/
jdk1.7.0_51/jre/lib/locale/ja/LC_MESSAGES/sunw_java_plugin.mo
jdk1.7.0_51/jre/lib/locale/fr/
jdk1.7.0_51/jre/lib/locale/fr/LC_MESSAGES/
jdk1.7.0_51/jre/lib/locale/fr/LC_MESSAGES/sunw_java_plugin.mo
jdk1.7.0_51/jre/lib/locale/ko/
jdk1.7.0_51/jre/lib/locale/ko/LC_MESSAGES/
jdk1.7.0_51/jre/lib/locale/ko/LC_MESSAGES/sunw_java_plugin.mo
jdk1.7.0_51/jre/lib/locale/ko.UTF-8/
jdk1.7.0_51/jre/lib/locale/ko.UTF-8/LC_MESSAGES/
jdk1.7.0_51/jre/lib/locale/ko.UTF-8/LC_MESSAGES/sunw_java_plugin.mo
jdk1.7.0_51/jre/lib/locale/zh.GBK/
jdk1.7.0_51/jre/lib/locale/zh.GBK/LC_MESSAGES/
jdk1.7.0_51/jre/lib/locale/zh.GBK/LC_MESSAGES/sunw_java_plugin.mo
jdk1.7.0_51/jre/lib/locale/sv/
jdk1.7.0_51/jre/lib/locale/sv/LC_MESSAGES/
jdk1.7.0_51/jre/lib/locale/sv/LC_MESSAGES/sunw_java_plugin.mo
jdk1.7.0_51/jre/lib/locale/zh_HK.BIG5HK/
jdk1.7.0_51/jre/lib/locale/zh_HK.BIG5HK/LC_MESSAGES/
jdk1.7.0_51/jre/lib/locale/zh_HK.BIG5HK/LC_MESSAGES/sunw_java_plugin.mo
jdk1.7.0_51/jre/lib/locale/es/
jdk1.7.0_51/jre/lib/locale/es/LC_MESSAGES/
jdk1.7.0_51/jre/lib/locale/es/LC_MESSAGES/sunw_java_plugin.mo
jdk1.7.0_51/jre/lib/fonts/
jdk1.7.0_51/jre/lib/fonts/LucidaBrightDemiBold.ttf
jdk1.7.0_51/jre/lib/fonts/LucidaBrightItalic.ttf
jdk1.7.0_51/jre/lib/fonts/LucidaSansDemiBold.ttf
jdk1.7.0_51/jre/lib/fonts/LucidaTypewriterRegular.ttf
jdk1.7.0_51/jre/lib/fonts/LucidaBrightDemiItalic.ttf
jdk1.7.0_51/jre/lib/fonts/LucidaTypewriterBold.ttf
jdk1.7.0_51/jre/lib/fonts/LucidaSansRegular.ttf
jdk1.7.0_51/jre/lib/fonts/fonts.dir
jdk1.7.0_51/jre/lib/fonts/LucidaBrightRegular.ttf
jdk1.7.0_51/jre/lib/ext/
jdk1.7.0_51/jre/lib/ext/sunjce_provider.jar
jdk1.7.0_51/jre/lib/ext/meta-index
jdk1.7.0_51/jre/lib/ext/zipfs.jar
jdk1.7.0_51/jre/lib/ext/sunpkcs11.jar
jdk1.7.0_51/jre/lib/ext/dnsns.jar
jdk1.7.0_51/jre/lib/ext/localedata.jar
jdk1.7.0_51/jre/lib/ext/sunec.jar
jdk1.7.0_51/jre/lib/fontconfig.Turbo.bfc
jdk1.7.0_51/jre/lib/fontconfig.properties.src
jdk1.7.0_51/jre/lib/jce.jar
jdk1.7.0_51/jre/lib/fontconfig.RedHat.6.bfc
jdk1.7.0_51/jre/lib/currency.data
jdk1.7.0_51/jre/lib/javafx.properties
jdk1.7.0_51/jre/THIRDPARTYLICENSEREADME.txt
jdk1.7.0_51/jre/Welcome.html
jdk1.7.0_51/jre/LICENSE
jdk1.7.0_51/jre/plugin/
jdk1.7.0_51/jre/plugin/desktop/
jdk1.7.0_51/jre/plugin/desktop/sun_java.png
jdk1.7.0_51/jre/plugin/desktop/sun_java.desktop
jdk1.7.0_51/jre/COPYRIGHT
jdk1.7.0_51/jre/THIRDPARTYLICENSEREADME-JAVAFX.txt
jdk1.7.0_51/LICENSE
jdk1.7.0_51/COPYRIGHT
jdk1.7.0_51/THIRDPARTYLICENSEREADME-JAVAFX.txt
Wiping out workspace first.
Cloning the remote Git repository
Cloning repository https://git-wip-us.apache.org/repos/asf/incubator-streams-master.git
 > git init <https://builds.apache.org/job/Streams%20Master/ws/> # timeout=10
Fetching upstream changes from https://git-wip-us.apache.org/repos/asf/incubator-streams-master.git
 > git --version # timeout=10
 > git fetch --tags --progress https://git-wip-us.apache.org/repos/asf/incubator-streams-master.git
+refs/heads/*:refs/remotes/origin/*
 > git config remote.origin.url https://git-wip-us.apache.org/repos/asf/incubator-streams-master.git
# timeout=10
 > git config remote.origin.fetch +refs/heads/*:refs/remotes/origin/* # timeout=10
 > git config remote.origin.url https://git-wip-us.apache.org/repos/asf/incubator-streams-master.git
# timeout=10
Cleaning workspace
 > git rev-parse --verify HEAD # timeout=10
No valid HEAD. Skipping the resetting
 > git clean -fdx # timeout=10
Fetching upstream changes from https://git-wip-us.apache.org/repos/asf/incubator-streams-master.git
 > git fetch --tags --progress https://git-wip-us.apache.org/repos/asf/incubator-streams-master.git
+refs/heads/*:refs/remotes/origin/*
 > git rev-parse origin/master^{commit} # timeout=10
Checking out Revision f45df142e90bb50df220d8b8a2e29981b2c4319f (origin/master)
 > git config core.sparsecheckout # timeout=10
 > git checkout -f f45df142e90bb50df220d8b8a2e29981b2c4319f
 > git rev-list f45df142e90bb50df220d8b8a2e29981b2c4319f # timeout=10
Parsing POMs
maven31-agent.jar already up to date
maven31-interceptor.jar already up to date
maven3-interceptor-commons.jar already up to date
[Streams Master] $ /jenkins/tools/hudson.model.JDK/jdk-1.7u51/bin/java -Xmx2g -Xms256m -XX:MaxPermSize=512m
-Dfile.encoding=UTF-8 -cp /jenkins/maven31-agent.jar:/jenkins/tools/hudson.tasks.Maven_MavenInstallation/maven-3.2.1/boot/plexus-classworlds-2.5.1.jar:/jenkins/tools/hudson.tasks.Maven_MavenInstallation/maven-3.2.1/conf/logging
jenkins.maven3.agent.Maven31Main /jenkins/tools/hudson.tasks.Maven_MavenInstallation/maven-3.2.1
/jenkins/slave.jar /jenkins/maven31-interceptor.jar /jenkins/maven3-interceptor-commons.jar
56429
<===[JENKchannel started
INS REMOTING CAPACITY]===>   Executing Maven:  -B -f <https://builds.apache.org/job/Streams%20Master/ws/pom.xml>
-Dmaven.repo.local=/jenkins/maven-repositories/0 clean install verify
[INFO] Scanning for projects...
[INFO] 
[INFO] Using the builder org.apache.maven.lifecycle.internal.builder.singlethreaded.SingleThreadedBuilder
with a thread count of 1
[INFO]                                                                         
[INFO] ------------------------------------------------------------------------
[INFO] Building Apache Streams :: streams-master 0.3-incubating-SNAPSHOT
[INFO] ------------------------------------------------------------------------
[INFO] Downloading: http://repo.maven.apache.org/maven2/org/apache/maven/plugins/maven-project-info-reports-plugin/maven-metadata.xml
[INFO] Downloaded: http://repo.maven.apache.org/maven2/org/apache/maven/plugins/maven-project-info-reports-plugin/maven-metadata.xml
(853 B at 4.4 KB/sec)
[INFO] Downloading: http://repo.maven.apache.org/maven2/org/apache/maven/plugins/maven-project-info-reports-plugin/2.8/maven-project-info-reports-plugin-2.8.jar
[INFO] Downloaded: http://repo.maven.apache.org/maven2/org/apache/maven/plugins/maven-project-info-reports-plugin/2.8/maven-project-info-reports-plugin-2.8.jar
(294 KB at 3296.2 KB/sec)
[INFO] Downloading: http://repo.maven.apache.org/maven2/org/apache/maven/plugins/maven-remote-resources-plugin/1.4/maven-remote-resources-plugin-1.4.pom
[INFO] Downloaded: http://repo.maven.apache.org/maven2/org/apache/maven/plugins/maven-remote-resources-plugin/1.4/maven-remote-resources-plugin-1.4.pom
(14 KB at 444.2 KB/sec)
[INFO] Downloading: http://repo.maven.apache.org/maven2/org/apache/maven/plugins/maven-remote-resources-plugin/1.4/maven-remote-resources-plugin-1.4.jar
[INFO] Downloaded: http://repo.maven.apache.org/maven2/org/apache/maven/plugins/maven-remote-resources-plugin/1.4/maven-remote-resources-plugin-1.4.jar
(66 KB at 1772.6 KB/sec)
[INFO] 
[INFO] --- maven-clean-plugin:2.6:clean (default-clean) @ streams-master ---
[INFO] 
[INFO] --- maven-remote-resources-plugin:1.4:process (default) @ streams-master ---
[INFO] 
[INFO] --- maven-site-plugin:3.4:attach-descriptor (attach-descriptor) @ streams-master ---
[INFO] Downloading: http://repo.maven.apache.org/maven2/org/apache/maven/wagon/wagon-scm/2.8/wagon-scm-2.8.pom
[INFO] Downloaded: http://repo.maven.apache.org/maven2/org/apache/maven/wagon/wagon-scm/2.8/wagon-scm-2.8.pom
(3 KB at 83.6 KB/sec)
[INFO] Downloading: http://repo.maven.apache.org/maven2/org/apache/maven/wagon/wagon-providers/2.8/wagon-providers-2.8.pom
[INFO] Downloaded: http://repo.maven.apache.org/maven2/org/apache/maven/wagon/wagon-providers/2.8/wagon-providers-2.8.pom
(3 KB at 102.4 KB/sec)
[INFO] Downloading: http://repo.maven.apache.org/maven2/org/apache/maven/wagon/wagon/2.8/wagon-2.8.pom
[INFO] Downloaded: http://repo.maven.apache.org/maven2/org/apache/maven/wagon/wagon/2.8/wagon-2.8.pom
(19 KB at 660.4 KB/sec)
[INFO] Downloading: http://repo.maven.apache.org/maven2/org/apache/maven/scm/maven-scm-manager-plexus/1.5/maven-scm-manager-plexus-1.5.pom
[INFO] Downloaded: http://repo.maven.apache.org/maven2/org/apache/maven/scm/maven-scm-manager-plexus/1.5/maven-scm-manager-plexus-1.5.pom
(3 KB at 72.9 KB/sec)
[INFO] Downloading: http://repo.maven.apache.org/maven2/org/apache/maven/scm/maven-scm-managers/1.5/maven-scm-managers-1.5.pom
[INFO] Downloaded: http://repo.maven.apache.org/maven2/org/apache/maven/scm/maven-scm-managers/1.5/maven-scm-managers-1.5.pom
(2 KB at 60.6 KB/sec)
[INFO] Downloading: http://repo.maven.apache.org/maven2/org/apache/maven/wagon/wagon-provider-api/2.8/wagon-provider-api-2.8.pom
[INFO] Downloaded: http://repo.maven.apache.org/maven2/org/apache/maven/wagon/wagon-provider-api/2.8/wagon-provider-api-2.8.pom
(2 KB at 67.6 KB/sec)
[INFO] Downloading: http://repo.maven.apache.org/maven2/org/apache/maven/scm/maven-scm-api/1.9.4/maven-scm-api-1.9.4.pom
[INFO] Downloaded: http://repo.maven.apache.org/maven2/org/apache/maven/scm/maven-scm-api/1.9.4/maven-scm-api-1.9.4.pom
(2 KB at 61.7 KB/sec)
[INFO] Downloading: http://repo.maven.apache.org/maven2/org/apache/maven/scm/maven-scm/1.9.4/maven-scm-1.9.4.pom
[INFO] Downloaded: http://repo.maven.apache.org/maven2/org/apache/maven/scm/maven-scm/1.9.4/maven-scm-1.9.4.pom
(22 KB at 744.5 KB/sec)
[INFO] Downloading: http://repo.maven.apache.org/maven2/org/apache/maven/scm/maven-scm-provider-svn-commons/1.9.4/maven-scm-provider-svn-commons-1.9.4.pom
[INFO] Downloaded: http://repo.maven.apache.org/maven2/org/apache/maven/scm/maven-scm-provider-svn-commons/1.9.4/maven-scm-provider-svn-commons-1.9.4.pom
(3 KB at 101.5 KB/sec)
[INFO] Downloading: http://repo.maven.apache.org/maven2/org/apache/maven/scm/maven-scm-providers-svn/1.9.4/maven-scm-providers-svn-1.9.4.pom
[INFO] Downloaded: http://repo.maven.apache.org/maven2/org/apache/maven/scm/maven-scm-providers-svn/1.9.4/maven-scm-providers-svn-1.9.4.pom
(3 KB at 86.5 KB/sec)
[INFO] Downloading: http://repo.maven.apache.org/maven2/org/apache/maven/scm/maven-scm-providers/1.9.4/maven-scm-providers-1.9.4.pom
[INFO] Downloaded: http://repo.maven.apache.org/maven2/org/apache/maven/scm/maven-scm-providers/1.9.4/maven-scm-providers-1.9.4.pom
(4 KB at 136.9 KB/sec)
[INFO] Downloading: http://repo.maven.apache.org/maven2/org/apache/maven/scm/maven-scm-provider-svnexe/1.9.4/maven-scm-provider-svnexe-1.9.4.pom
[INFO] Downloaded: http://repo.maven.apache.org/maven2/org/apache/maven/scm/maven-scm-provider-svnexe/1.9.4/maven-scm-provider-svnexe-1.9.4.pom
(3 KB at 99.2 KB/sec)
[INFO] Downloading: http://repo.maven.apache.org/maven2/org/apache/maven/wagon/wagon-scm/2.8/wagon-scm-2.8.jar
[INFO] Downloading: http://repo.maven.apache.org/maven2/org/apache/maven/scm/maven-scm-manager-plexus/1.5/maven-scm-manager-plexus-1.5.jar
[INFO] Downloading: http://repo.maven.apache.org/maven2/org/apache/maven/scm/maven-scm-api/1.9.4/maven-scm-api-1.9.4.jar
[INFO] Downloading: http://repo.maven.apache.org/maven2/org/apache/maven/scm/maven-scm-provider-svn-commons/1.9.4/maven-scm-provider-svn-commons-1.9.4.jar
[INFO] Downloading: http://repo.maven.apache.org/maven2/org/apache/maven/scm/maven-scm-provider-svnexe/1.9.4/maven-scm-provider-svnexe-1.9.4.jar
[INFO] Downloaded: http://repo.maven.apache.org/maven2/org/apache/maven/wagon/wagon-scm/2.8/wagon-scm-2.8.jar
(16 KB at 350.1 KB/sec)
[INFO] Downloaded: http://repo.maven.apache.org/maven2/org/apache/maven/scm/maven-scm-provider-svn-commons/1.9.4/maven-scm-provider-svn-commons-1.9.4.jar
(37 KB at 617.7 KB/sec)
[INFO] Downloaded: http://repo.maven.apache.org/maven2/org/apache/maven/scm/maven-scm-manager-plexus/1.5/maven-scm-manager-plexus-1.5.jar
(11 KB at 161.1 KB/sec)
[INFO] Downloaded: http://repo.maven.apache.org/maven2/org/apache/maven/scm/maven-scm-provider-svnexe/1.9.4/maven-scm-provider-svnexe-1.9.4.jar
(76 KB at 1202.9 KB/sec)
[INFO] Downloaded: http://repo.maven.apache.org/maven2/org/apache/maven/scm/maven-scm-api/1.9.4/maven-scm-api-1.9.4.jar
(105 KB at 1307.6 KB/sec)
[INFO] 
[INFO] --- maven-install-plugin:2.5.2:install (default-install) @ streams-master ---
[INFO] Installing <https://builds.apache.org/job/Streams%20Master/ws/pom.xml> to /jenkins/maven-repositories/0/org/apache/streams/streams-master/0.3-incubating-SNAPSHOT/streams-master-0.3-incubating-SNAPSHOT.pom
[INFO] 
[INFO] --- maven-remote-resources-plugin:1.4:process (default) @ streams-master ---
[INFO] 
[INFO] --- maven-site-plugin:3.4:attach-descriptor (attach-descriptor) @ streams-master ---
[INFO] ------------------------------------------------------------------------
[INFO] BUILD SUCCESS
[INFO] ------------------------------------------------------------------------
[INFO] Total time: 9.454 s
[INFO] Finished at: 2015-07-06T23:21:29+00:00
[INFO] Final Memory: 19M/246M
[INFO] ------------------------------------------------------------------------
[JENKINS] Archiving <https://builds.apache.org/job/Streams%20Master/ws/pom.xml> to org.apache.streams/streams-master/0.3-incubating-SNAPSHOT/streams-master-0.3-incubating-SNAPSHOT.pom
Sending artifact delta relative to Streams Master ยป Apache Streams :: streams-master #16
Archived 1 artifacts
Archive block size is 32768
Received 1 blocks and 305 bytes
Compression is 99.1%
Took 0.15 sec
channel stopped
Maven RedeployPublisher use remote jenkins-ubuntu-1404-4gb-2ec maven settings from : /home/jenkins/.m2/settings.xml
[INFO] Deployment in https://repository.apache.org/content/repositories/snapshots (id=streams.snapshots,uniqueVersion=true)
Deploying the main artifact streams-master-0.3-incubating-SNAPSHOT.pom
Downloading: https://repository.apache.org/content/repositories/snapshots/org/apache/streams/streams-master/0.3-incubating-SNAPSHOT/maven-metadata.xml
Uploading: https://repository.apache.org/content/repositories/snapshots/org/apache/streams/streams-master/0.3-incubating-SNAPSHOT/streams-master-0.3-incubating-20150706.232125-1.pom
ERROR: Failed to deploy artifacts: Could not transfer artifact org.apache.streams:streams-master:pom:0.3-incubating-20150706.232125-1
from/to streams.snapshots (https://repository.apache.org/content/repositories/snapshots):
Failed to transfer file: https://repository.apache.org/content/repositories/snapshots/org/apache/streams/streams-master/0.3-incubating-SNAPSHOT/streams-master-0.3-incubating-20150706.232125-1.pom.
Return code is: 401, ReasonPhrase: Unauthorized.
org.apache.maven.artifact.deployer.ArtifactDeploymentException: Failed to deploy artifacts:
Could not transfer artifact org.apache.streams:streams-master:pom:0.3-incubating-20150706.232125-1
from/to streams.snapshots (https://repository.apache.org/content/repositories/snapshots):
Failed to transfer file: https://repository.apache.org/content/repositories/snapshots/org/apache/streams/streams-master/0.3-incubating-SNAPSHOT/streams-master-0.3-incubating-20150706.232125-1.pom.
Return code is: 401, ReasonPhrase: Unauthorized.
	at org.apache.maven.artifact.deployer.DefaultArtifactDeployer.deploy(DefaultArtifactDeployer.java:143)
	at hudson.maven.reporters.MavenArtifactRecord.deploy(MavenArtifactRecord.java:193)
	at hudson.maven.RedeployPublisher.perform(RedeployPublisher.java:176)
	at hudson.tasks.BuildStepMonitor$1.perform(BuildStepMonitor.java:20)
	at hudson.model.AbstractBuild$AbstractBuildExecution.perform(AbstractBuild.java:756)
	at hudson.model.AbstractBuild$AbstractBuildExecution.performAllBuildSteps(AbstractBuild.java:720)
	at hudson.maven.MavenModuleSetBuild$MavenModuleSetBuildExecution.post2(MavenModuleSetBuild.java:1037)
	at hudson.model.AbstractBuild$AbstractBuildExecution.post(AbstractBuild.java:669)
	at hudson.model.Run.execute(Run.java:1731)
	at hudson.maven.MavenModuleSetBuild.run(MavenModuleSetBuild.java:529)
	at hudson.model.ResourceController.execute(ResourceController.java:88)
	at hudson.model.Executor.run(Executor.java:232)
Caused by: org.eclipse.aether.deployment.DeploymentException: Failed to deploy artifacts:
Could not transfer artifact org.apache.streams:streams-master:pom:0.3-incubating-20150706.232125-1
from/to streams.snapshots (https://repository.apache.org/content/repositories/snapshots):
Failed to transfer file: https://repository.apache.org/content/repositories/snapshots/org/apache/streams/streams-master/0.3-incubating-SNAPSHOT/streams-master-0.3-incubating-20150706.232125-1.pom.
Return code is: 401, ReasonPhrase: Unauthorized.
	at org.eclipse.aether.internal.impl.DefaultDeployer.deploy(DefaultDeployer.java:341)
	at org.eclipse.aether.internal.impl.DefaultDeployer.deploy(DefaultDeployer.java:269)
	at org.eclipse.aether.internal.impl.DefaultRepositorySystem.deploy(DefaultRepositorySystem.java:413)
	at org.apache.maven.artifact.deployer.DefaultArtifactDeployer.deploy(DefaultArtifactDeployer.java:139)
	... 11 more
Caused by: org.eclipse.aether.transfer.ArtifactTransferException: Could not transfer artifact
org.apache.streams:streams-master:pom:0.3-incubating-20150706.232125-1 from/to streams.snapshots
(https://repository.apache.org/content/repositories/snapshots): Failed to transfer file: https://repository.apache.org/content/repositories/snapshots/org/apache/streams/streams-master/0.3-incubating-SNAPSHOT/streams-master-0.3-incubating-20150706.232125-1.pom.
Return code is: 401, ReasonPhrase: Unauthorized.
	at org.eclipse.aether.connector.wagon.WagonRepositoryConnector$6.wrap(WagonRepositoryConnector.java:1016)
	at org.eclipse.aether.connector.wagon.WagonRepositoryConnector$6.wrap(WagonRepositoryConnector.java:1004)
	at org.eclipse.aether.connector.wagon.WagonRepositoryConnector$PutTask.run(WagonRepositoryConnector.java:895)
	at org.eclipse.aether.connector.wagon.WagonRepositoryConnector.put(WagonRepositoryConnector.java:522)
	at org.eclipse.aether.internal.impl.DefaultDeployer.deploy(DefaultDeployer.java:335)
	... 14 more
Caused by: org.apache.maven.wagon.TransferFailedException: Failed to transfer file: https://repository.apache.org/content/repositories/snapshots/org/apache/streams/streams-master/0.3-incubating-SNAPSHOT/streams-master-0.3-incubating-20150706.232125-1.pom.
Return code is: 401, ReasonPhrase: Unauthorized.
	at org.apache.maven.wagon.shared.http4.AbstractHttpClientWagon.put(AbstractHttpClientWagon.java:626)
	at org.apache.maven.wagon.shared.http4.AbstractHttpClientWagon.put(AbstractHttpClientWagon.java:524)
	at org.apache.maven.wagon.shared.http4.AbstractHttpClientWagon.put(AbstractHttpClientWagon.java:505)
	at org.apache.maven.wagon.shared.http4.AbstractHttpClientWagon.put(AbstractHttpClientWagon.java:485)
	at org.eclipse.aether.connector.wagon.WagonRepositoryConnector$PutTask.run(WagonRepositoryConnector.java:871)
	... 16 more
[INFO] Deployment failed after 0.89 sec
Build step 'Deploy artifacts to Maven repository' changed build result to FAILURE

Mime
View raw message