streams-dev mailing list archives

Site index · List index
Message view « Date » · « Thread »
Top « Date » · « Thread »
From Apache Jenkins Server <jenk...@builds.apache.org>
Subject Build failed in Jenkins: Streams Examples #29
Date Thu, 30 Jul 2015 21:59:25 GMT
See <https://builds.apache.org/job/Streams%20Examples/29/changes>

Changes:

[sblackmon] version bump to 0.3-incubator-SNAPSHOT

[sblackmon] Tweaks to accomodate changes in streams-project from STREAMS-313

------------------------------------------
[...truncated 6600 lines...]
[WARNING]   - javax.xml.stream.util.EventReaderDelegate
[WARNING]   - javax.xml.stream.events.Characters
[WARNING]   - javax.xml.stream.XMLStreamReader
[WARNING]   - javax.xml.stream.events.EntityReference
[WARNING]   - javax.xml.stream.StreamFilter
[WARNING]   - javax.xml.stream.XMLStreamWriter
[WARNING]   - 27 more...
[WARNING] jaxb-core-2.2.7.jar, istack-commons-runtime-2.16.jar define 20 overlapping classes:

[WARNING]   - com.sun.istack.localization.Localizer
[WARNING]   - com.sun.istack.localization.NullLocalizable
[WARNING]   - com.sun.istack.XMLStreamException2
[WARNING]   - com.sun.istack.localization.LocalizableMessageFactory
[WARNING]   - com.sun.istack.Pool$Impl
[WARNING]   - com.sun.istack.SAXParseException2
[WARNING]   - com.sun.istack.Builder
[WARNING]   - com.sun.istack.Nullable
[WARNING]   - com.sun.istack.localization.LocalizableMessage
[WARNING]   - com.sun.istack.SAXException2
[WARNING]   - 10 more...
[WARNING] maven-shade-plugin has detected that some class files are
[WARNING] present in two or more JARs. When this happens, only one
[WARNING] single version of the class is copied to the uber jar.
[WARNING] Usually this is not harmful and you can skip these warnings,
[WARNING] otherwise try to manually exclude artifacts based on
[WARNING] mvn dependency:tree -Ddetail=true and the above output.
[WARNING] See http://docs.codehaus.org/display/MAVENUSER/Shade+Plugin
[INFO] Replacing original artifact with shaded artifact.
[INFO] Replacing <https://builds.apache.org/job/Streams%20Examples/ws/local/mongo-elasticsearch-sync/target/mongo-elasticsearch-sync-0.3-incubating-SNAPSHOT.jar>
with <https://builds.apache.org/job/Streams%20Examples/ws/local/mongo-elasticsearch-sync/target/mongo-elasticsearch-sync-0.3-incubating-SNAPSHOT-shaded.jar>
[INFO] Dependency-reduced POM written at: <https://builds.apache.org/job/Streams%20Examples/ws/local/mongo-elasticsearch-sync/dependency-reduced-pom.xml>
[INFO] 
[INFO] --- embedmongo-maven-plugin:0.1.12:start (start) @ mongo-elasticsearch-sync ---
Extract /home/jenkins/.embedmongo/linux/mongodb-linux-x86_64-2.4.0.tgz START
Extract /home/jenkins/.embedmongo/linux/mongodb-linux-x86_64-2.4.0.tgz DONE
[mongod output]note: noprealloc may hurt performance in many applications
[mongod output] Thu Jul 30 21:59:10.454 [DataFileSync] warning: --syncdelay 0 is not recommended
and can have strange performance
[mongod output] Thu Jul 30 21:59:10.464 [initandlisten] MongoDB starting : pid=3449 port=37017
dbpath=<https://builds.apache.org/job/Streams%20Examples/ws/local/mongo-elasticsearch-sync/target/mongotest>
64-bit host=hemera
[mongod output] Thu Jul 30 21:59:10.464 [initandlisten] warning: failed to read from /proc/self/numa_maps:
errno:2 No such file or directory
[mongod output] Thu Jul 30 21:59:10.464 [initandlisten] 
[mongod output] Thu Jul 30 21:59:10.464 [initandlisten] db version v2.4.0
[mongod output] Thu Jul 30 21:59:10.464 [initandlisten] git version: ce2d666c04b4a80af58e8bbb3388b0680e8cfeb6
[mongod output] Thu Jul 30 21:59:10.464 [initandlisten] build info: Linux ip-10-2-29-40 2.6.21.7-2.ec2.v1.2.fc8xen
#1 SMP Fri Nov 20 17:48:28 EST 2009 x86_64 BOOST_LIB_VERSION=1_49
[mongod output] Thu Jul 30 21:59:10.464 [initandlisten] allocator: tcmalloc
[mongod output] Thu Jul 30 21:59:10.465 [initandlisten] options: { dbpath: "<https://builds.apache.org/job/Streams%20Examples/ws/local/mongo-elasticsearch-sync/target/mongotest",>
noauth: true, nohttpinterface: true, nojournal: true, noprealloc: true, port: 37017, smallfiles:
true, syncdelay: 0.0 }
[mongod output] Thu Jul 30 21:59:10.517 [initandlisten] waiting for connections on port 37017
[mongod output] [INFO] de.flapdoodle.embed.mongo.config.MongodConfigBuilder$ImmutableMongodConfig@7f73c926
[INFO] 
[INFO] --- maven-failsafe-plugin:2.12.4:integration-test (integration-tests) @ mongo-elasticsearch-sync
---
[INFO] Skipping execution of surefire because it has already been run for this configuration
[JENKINS] Recording test results[INFO] 

[INFO] --- embedmongo-maven-plugin:0.1.12:stop (stop) @ mongo-elasticsearch-sync ---
Thu Jul 30 21:59:10.617 [initandlisten] connection accepted from 127.0.0.1:46891 #1 (1 connection
now open)
[mongod output] Thu Jul 30 21:59:10.617 [conn1] terminating, shutdown command received
[mongod output] Thu Jul 30 21:59:10.617 dbexit: shutdown called
[mongod output] Thu Jul 30 21:59:10.617 [conn1] shutdown: going to close listening sockets...
[mongod output] Thu Jul 30 21:59:10.617 [conn1] closing listening socket: 7
[mongod output] Thu Jul 30 21:59:10.617 [conn1] closing listening socket: 8
[mongod output] Thu Jul 30 21:59:10.617 [conn1] removing socket file: /tmp/mongodb-37017.sock
[mongod output] Thu Jul 30 21:59:10.617 [conn1] shutdown: going to flush diaglog...
[mongod output] Thu Jul 30 21:59:10.617 [conn1] shutdown: going to close sockets...
[mongod output] Thu Jul 30 21:59:10.617 [conn1] shutdown: waiting for fs preallocator...
[mongod output] Thu Jul 30 21:59:10.617 [conn1] shutdown: closing all files...
[mongod output] Thu Jul 30 21:59:10.618 [conn1] closeAllFiles() finished
[mongod output] Thu Jul 30 21:59:10.618 [conn1] shutdown: removing fs lock...
[mongod output] Thu Jul 30 21:59:10.618 dbexit: really exiting now
[mongod output] 
[INFO] 
[INFO] --- maven-failsafe-plugin:2.12.4:verify (integration-tests) @ mongo-elasticsearch-sync
---
[INFO] Failsafe report directory: <https://builds.apache.org/job/Streams%20Examples/ws/local/mongo-elasticsearch-sync/target/failsafe-reports>
[JENKINS] Recording test results
[INFO]                                                                         
[INFO] ------------------------------------------------------------------------
[INFO] Building twitter-follow-graph 0.3-incubating-SNAPSHOT
[INFO] ------------------------------------------------------------------------
[INFO] Downloading: http://repo.maven.apache.org/maven2/org/jsonschema2pojo/jsonschema2pojo-maven-plugin/0.4.6/jsonschema2pojo-maven-plugin-0.4.6.pom
[INFO] Downloaded: http://repo.maven.apache.org/maven2/org/jsonschema2pojo/jsonschema2pojo-maven-plugin/0.4.6/jsonschema2pojo-maven-plugin-0.4.6.pom
(3 KB at 19.6 KB/sec)
[INFO] Downloading: http://repo.maven.apache.org/maven2/org/jsonschema2pojo/jsonschema2pojo-maven-plugin/0.4.6/jsonschema2pojo-maven-plugin-0.4.6.jar
[INFO] Downloaded: http://repo.maven.apache.org/maven2/org/jsonschema2pojo/jsonschema2pojo-maven-plugin/0.4.6/jsonschema2pojo-maven-plugin-0.4.6.jar
(19 KB at 135.3 KB/sec)
[INFO] Downloading: http://repository.apache.org/snapshots/org/apache/streams/streams-provider-twitter/0.3-incubating-SNAPSHOT/maven-metadata.xml
[INFO] Downloaded: http://repository.apache.org/snapshots/org/apache/streams/streams-provider-twitter/0.3-incubating-SNAPSHOT/maven-metadata.xml
(819 B at 1.9 KB/sec)
[INFO] Downloading: http://repository.apache.org/snapshots/org/apache/streams/streams-provider-twitter/0.3-incubating-SNAPSHOT/streams-provider-twitter-0.3-incubating-20150412.015108-2.pom
[INFO] Downloaded: http://repository.apache.org/snapshots/org/apache/streams/streams-provider-twitter/0.3-incubating-SNAPSHOT/streams-provider-twitter-0.3-incubating-20150412.015108-2.pom
(8 KB at 20.3 KB/sec)
[INFO] Downloading: http://repository.apache.org/snapshots/org/apache/streams/streams-converters/0.3-incubating-SNAPSHOT/maven-metadata.xml
[INFO] Downloaded: http://repository.apache.org/snapshots/org/apache/streams/streams-converters/0.3-incubating-SNAPSHOT/maven-metadata.xml
(813 B at 4.1 KB/sec)
[INFO] Downloading: http://repository.apache.org/snapshots/org/apache/streams/streams-converters/0.3-incubating-SNAPSHOT/streams-converters-0.3-incubating-20150412.015102-2.pom
[INFO] Downloaded: http://repository.apache.org/snapshots/org/apache/streams/streams-converters/0.3-incubating-SNAPSHOT/streams-converters-0.3-incubating-20150412.015102-2.pom
(6 KB at 82.1 KB/sec)
[INFO] Downloading: http://repository.apache.org/snapshots/org/apache/streams/streams-components/0.3-incubating-SNAPSHOT/maven-metadata.xml
[INFO] Downloaded: http://repository.apache.org/snapshots/org/apache/streams/streams-components/0.3-incubating-SNAPSHOT/maven-metadata.xml
(631 B at 5.6 KB/sec)
[INFO] Downloading: http://repository.apache.org/snapshots/org/apache/streams/streams-components/0.3-incubating-SNAPSHOT/streams-components-0.3-incubating-20150412.014928-2.pom
[INFO] Downloaded: http://repository.apache.org/snapshots/org/apache/streams/streams-components/0.3-incubating-SNAPSHOT/streams-components-0.3-incubating-20150412.014928-2.pom
(3 KB at 7.5 KB/sec)
[INFO] Downloading: http://repository.apache.org/snapshots/org/apache/streams/streams-http/0.3-incubating-SNAPSHOT/maven-metadata.xml
[INFO] Downloaded: http://repository.apache.org/snapshots/org/apache/streams/streams-http/0.3-incubating-SNAPSHOT/maven-metadata.xml
(807 B at 2.3 KB/sec)
[INFO] Downloading: http://repository.apache.org/snapshots/org/apache/streams/streams-http/0.3-incubating-SNAPSHOT/streams-http-0.3-incubating-20150412.014932-2.pom
[INFO] Downloaded: http://repository.apache.org/snapshots/org/apache/streams/streams-http/0.3-incubating-SNAPSHOT/streams-http-0.3-incubating-20150412.014932-2.pom
(7 KB at 19.0 KB/sec)
[INFO] Downloading: http://repository.apache.org/snapshots/org/apache/streams/streams-persist-graph/0.3-incubating-SNAPSHOT/maven-metadata.xml
[INFO] Downloaded: http://repository.apache.org/snapshots/org/apache/streams/streams-persist-graph/0.3-incubating-SNAPSHOT/maven-metadata.xml
(816 B at 2.0 KB/sec)
[INFO] Downloading: http://repository.apache.org/snapshots/org/apache/streams/streams-persist-graph/0.3-incubating-SNAPSHOT/streams-persist-graph-0.3-incubating-20150412.014936-2.pom
[INFO] Downloaded: http://repository.apache.org/snapshots/org/apache/streams/streams-persist-graph/0.3-incubating-SNAPSHOT/streams-persist-graph-0.3-incubating-20150412.014936-2.pom
(5 KB at 14.2 KB/sec)
[INFO] Downloading: http://repository.apache.org/snapshots/org/apache/streams/streams-provider-twitter/0.3-incubating-SNAPSHOT/streams-provider-twitter-0.3-incubating-20150412.015108-2.jar
[INFO] Downloading: http://repository.apache.org/snapshots/org/apache/streams/streams-converters/0.3-incubating-SNAPSHOT/streams-converters-0.3-incubating-20150412.015102-2.jar
[INFO] Downloading: http://repository.apache.org/snapshots/org/apache/streams/streams-http/0.3-incubating-SNAPSHOT/streams-http-0.3-incubating-20150412.014932-2.jar
[INFO] Downloading: http://repository.apache.org/snapshots/org/apache/streams/streams-persist-graph/0.3-incubating-SNAPSHOT/streams-persist-graph-0.3-incubating-20150412.014936-2.jar
[INFO] Downloaded: http://repository.apache.org/snapshots/org/apache/streams/streams-converters/0.3-incubating-SNAPSHOT/streams-converters-0.3-incubating-20150412.015102-2.jar
(29 KB at 65.8 KB/sec)
[INFO] Downloaded: http://repository.apache.org/snapshots/org/apache/streams/streams-persist-graph/0.3-incubating-SNAPSHOT/streams-persist-graph-0.3-incubating-20150412.014936-2.jar
(35 KB at 76.9 KB/sec)
[INFO] Downloaded: http://repository.apache.org/snapshots/org/apache/streams/streams-http/0.3-incubating-SNAPSHOT/streams-http-0.3-incubating-20150412.014932-2.jar
(43 KB at 84.8 KB/sec)
[INFO] Downloaded: http://repository.apache.org/snapshots/org/apache/streams/streams-provider-twitter/0.3-incubating-SNAPSHOT/streams-provider-twitter-0.3-incubating-20150412.015108-2.jar
(112 KB at 202.9 KB/sec)
[INFO] 
[INFO] --- maven-clean-plugin:2.6:clean (default-clean) @ twitter-follow-graph ---
[INFO] 
[INFO] --- maven-enforcer-plugin:1.3.1:enforce (enforce-java) @ twitter-follow-graph ---
[INFO] 
[INFO] --- maven-enforcer-plugin:1.3.1:enforce (enforce-banned-dependencies) @ twitter-follow-graph
---
[INFO] 
[INFO] --- maven-enforcer-plugin:1.3.1:enforce (enforce-no-snapshots) @ twitter-follow-graph
---
[INFO] 
[INFO] --- maven-resources-plugin:2.7:copy-resources (copy-resources) @ twitter-follow-graph
---
[INFO] Using 'UTF-8' encoding to copy filtered resources.
[INFO] Copying 1 resource
[INFO] skip non existing resourceDirectory <https://builds.apache.org/job/Streams%20Examples/ws/local/twitter-follow-graph/src/main/xmlschema>
[INFO] Copying 1 resource
[INFO] 
[INFO] --- jsonschema2pojo-maven-plugin:0.4.6:generate (default) @ twitter-follow-graph ---
[INFO] 
[INFO] --- build-helper-maven-plugin:1.8:add-source (add-source) @ twitter-follow-graph ---
[INFO] Source directory: <https://builds.apache.org/job/Streams%20Examples/ws/local/twitter-follow-graph/target/generated-sources/jsonschema2pojo>
added.
[INFO] 
[INFO] --- maven-remote-resources-plugin:1.4:process (default) @ twitter-follow-graph ---
[INFO] 
[INFO] --- maven-resources-plugin:2.7:resources (default-resources) @ twitter-follow-graph
---
[INFO] Using 'UTF-8' encoding to copy filtered resources.
[INFO] Copying 1 resource
[INFO] Copying 4 resources
[INFO] 
[INFO] --- maven-compiler-plugin:3.1:compile (default-compile) @ twitter-follow-graph ---
[INFO] Changes detected - recompiling the module!
[INFO] Compiling 3 source files to <https://builds.apache.org/job/Streams%20Examples/ws/local/twitter-follow-graph/target/classes>
[INFO] -------------------------------------------------------------
[ERROR] COMPILATION ERROR : 
[INFO] -------------------------------------------------------------
[ERROR] <https://builds.apache.org/job/Streams%20Examples/ws/local/twitter-follow-graph/src/main/java/org/apache/streams/example/graph/TwitterFollowGraph.java>:[33,32]
cannot find symbol
  symbol:   class GraphHttpPersistWriter
  location: package org.apache.streams.graph
[ERROR] <https://builds.apache.org/job/Streams%20Examples/ws/local/twitter-follow-graph/src/main/java/org/apache/streams/example/graph/TwitterFollowGraph.java>:[72,9]
cannot find symbol
  symbol:   class GraphHttpPersistWriter
  location: class org.apache.streams.example.graph.TwitterFollowGraph
[ERROR] <https://builds.apache.org/job/Streams%20Examples/ws/local/twitter-follow-graph/src/main/java/org/apache/streams/example/graph/TwitterFollowGraph.java>:[72,57]
cannot find symbol
  symbol:   class GraphHttpPersistWriter
  location: class org.apache.streams.example.graph.TwitterFollowGraph
[INFO] 3 errors 
[INFO] -------------------------------------------------------------
[INFO] ------------------------------------------------------------------------
[INFO] Reactor Summary:
[INFO] 
[INFO] streams-examples .................................. SUCCESS [  2.066 s]
[INFO] streams-examples-local ............................ SUCCESS [  0.352 s]
[INFO] elasticsearch-hdfs ................................ SUCCESS [02:27 min]
[INFO] elasticsearch-reindex ............................. SUCCESS [01:50 min]
[INFO] mongo-elasticsearch-sync .......................... SUCCESS [01:19 min]
[INFO] twitter-follow-graph .............................. FAILURE [  5.526 s]
[INFO] twitter-history-elasticsearch ..................... SKIPPED
[INFO] twitter-userstream-elasticsearch .................. SKIPPED
[INFO] ------------------------------------------------------------------------
[INFO] BUILD FAILURE
[INFO] ------------------------------------------------------------------------
[INFO] Total time: 05:52 min
[INFO] Finished at: 2015-07-30T21:59:18+00:00
[INFO] Final Memory: 62M/711M
[INFO] ------------------------------------------------------------------------
Waiting for Jenkins to finish collecting data
[ERROR] Failed to execute goal org.apache.maven.plugins:maven-compiler-plugin:3.1:compile
(default-compile) on project twitter-follow-graph: Compilation failure: Compilation failure:
[ERROR] <https://builds.apache.org/job/Streams%20Examples/ws/local/twitter-follow-graph/src/main/java/org/apache/streams/example/graph/TwitterFollowGraph.java>:[33,32]
cannot find symbol
[ERROR] symbol:   class GraphHttpPersistWriter
[ERROR] location: package org.apache.streams.graph
[ERROR] <https://builds.apache.org/job/Streams%20Examples/ws/local/twitter-follow-graph/src/main/java/org/apache/streams/example/graph/TwitterFollowGraph.java>:[72,9]
cannot find symbol
[ERROR] symbol:   class GraphHttpPersistWriter
[ERROR] location: class org.apache.streams.example.graph.TwitterFollowGraph
[ERROR] <https://builds.apache.org/job/Streams%20Examples/ws/local/twitter-follow-graph/src/main/java/org/apache/streams/example/graph/TwitterFollowGraph.java>:[72,57]
cannot find symbol
[ERROR] symbol:   class GraphHttpPersistWriter
[ERROR] location: class org.apache.streams.example.graph.TwitterFollowGraph
[ERROR] -> [Help 1]
[ERROR] 
[ERROR] To see the full stack trace of the errors, re-run Maven with the -e switch.
[ERROR] Re-run Maven using the -X switch to enable full debug logging.
[ERROR] 
[ERROR] For more information about the errors and possible solutions, please read the following
articles:
[ERROR] [Help 1] http://cwiki.apache.org/confluence/display/MAVEN/MojoFailureException
[ERROR] 
[ERROR] After correcting the problems, you can resume the build with the command
[ERROR]   mvn <goals> -rf :twitter-follow-graph
[JENKINS] Archiving <https://builds.apache.org/job/Streams%20Examples/ws/local/pom.xml>
to org.apache.streams/streams-examples-local/0.3-incubating-SNAPSHOT/streams-examples-local-0.3-incubating-SNAPSHOT.pom
Sending artifact delta relative to Streams Examples ? streams-examples-local #28
Archived 1 artifacts
Archive block size is 32768
Received 0 blocks and 1967 bytes
Compression is 0.0%
Took 0.4 sec
[JENKINS] Archiving <https://builds.apache.org/job/Streams%20Examples/ws/local/twitter-history-elasticsearch/pom.xml>
to org.apache.streams/twitter-history-elasticsearch/0.3-incubating-SNAPSHOT/twitter-history-elasticsearch-0.3-incubating-SNAPSHOT.pom
Sending artifact delta relative to Streams Examples ? twitter-history-elasticsearch #28
Archived 1 artifacts
Archive block size is 32768
Received 0 blocks and 14397 bytes
Compression is 0.0%
Took 3.3 sec
[JENKINS] Archiving <https://builds.apache.org/job/Streams%20Examples/ws/local/twitter-follow-graph/pom.xml>
to org.apache.streams/twitter-follow-graph/0.3-incubating-SNAPSHOT/twitter-follow-graph-0.3-incubating-SNAPSHOT.pom
Sending artifact delta relative to Streams Examples ? twitter-follow-graph #28
Archived 1 artifacts
Archive block size is 32768
Received 0 blocks and 12821 bytes
Compression is 0.0%
Took 1.1 sec
[JENKINS] Archiving <https://builds.apache.org/job/Streams%20Examples/ws/local/elasticsearch-reindex/dependency-reduced-pom.xml>
to org.apache.streams/elasticsearch-reindex/0.3-incubating-SNAPSHOT/elasticsearch-reindex-0.3-incubating-SNAPSHOT.pom
[JENKINS] Archiving <https://builds.apache.org/job/Streams%20Examples/ws/local/elasticsearch-reindex/target/elasticsearch-reindex-0.3-incubating-SNAPSHOT.jar>
to org.apache.streams/elasticsearch-reindex/0.3-incubating-SNAPSHOT/elasticsearch-reindex-0.3-incubating-SNAPSHOT.jar
Sending artifact delta relative to Streams Examples ? elasticsearch-reindex #28
Archived 2 artifacts
Archive block size is 32768
Received 10 blocks and 30675420 bytes
Compression is 1.1%
Took 6.8 sec
[JENKINS] Archiving <https://builds.apache.org/job/Streams%20Examples/ws/pom.xml> to
org.apache.streams/streams-examples/0.3-incubating-SNAPSHOT/streams-examples-0.3-incubating-SNAPSHOT.pom
Sending artifact delta relative to Streams Examples ? streams-examples #28
Archived 1 artifacts
Archive block size is 32768
Received 0 blocks and 2875 bytes
Compression is 0.0%
Took 0.18 sec
[JENKINS] Archiving <https://builds.apache.org/job/Streams%20Examples/ws/local/twitter-userstream-elasticsearch/pom.xml>
to org.apache.streams/twitter-userstream-elasticsearch/0.3-incubating-SNAPSHOT/twitter-userstream-elasticsearch-0.3-incubating-SNAPSHOT.pom
Sending artifact delta relative to Streams Examples ? twitter-userstream-elasticsearch #28
Archived 1 artifacts
Archive block size is 32768
Received 0 blocks and 12014 bytes
Compression is 0.0%
Took 1.9 sec
[JENKINS] Archiving <https://builds.apache.org/job/Streams%20Examples/ws/local/elasticsearch-hdfs/dependency-reduced-pom.xml>
to org.apache.streams/elasticsearch-hdfs/0.3-incubating-SNAPSHOT/elasticsearch-hdfs-0.3-incubating-SNAPSHOT.pom
[JENKINS] Archiving <https://builds.apache.org/job/Streams%20Examples/ws/local/elasticsearch-hdfs/target/elasticsearch-hdfs-0.3-incubating-SNAPSHOT.jar>
to org.apache.streams/elasticsearch-hdfs/0.3-incubating-SNAPSHOT/elasticsearch-hdfs-0.3-incubating-SNAPSHOT.jar
Sending artifact delta relative to Streams Examples ? elasticsearch-hdfs #28
Archived 2 artifacts
Archive block size is 32768
Received 37 blocks and 53820592 bytes
Compression is 2.2%
Took 13 sec
[JENKINS] Archiving <https://builds.apache.org/job/Streams%20Examples/ws/local/mongo-elasticsearch-sync/dependency-reduced-pom.xml>
to org.apache.streams/mongo-elasticsearch-sync/0.3-incubating-SNAPSHOT/mongo-elasticsearch-sync-0.3-incubating-SNAPSHOT.pom
[JENKINS] Archiving <https://builds.apache.org/job/Streams%20Examples/ws/local/mongo-elasticsearch-sync/target/mongo-elasticsearch-sync-0.3-incubating-SNAPSHOT.jar>
to org.apache.streams/mongo-elasticsearch-sync/0.3-incubating-SNAPSHOT/mongo-elasticsearch-sync-0.3-incubating-SNAPSHOT.jar
Sending artifact delta relative to Streams Examples ? mongo-elasticsearch-sync #28
Archived 2 artifacts
Archive block size is 32768
Received 11 blocks and 31259779 bytes
Compression is 1.1%
Took 8.2 sec
channel stopped

Mime
View raw message