streams-dev mailing list archives

Site index · List index
Message view « Date » · « Thread »
Top « Date » · « Thread »
From Apache Jenkins Server <jenk...@builds.apache.org>
Subject Build failed in Jenkins: Streams Master #2
Date Sat, 20 Jun 2015 17:10:48 GMT
See <https://builds.apache.org/job/Streams%20Master/2/changes>

Changes:

[sblackmon] additional sections including dist mgmt

------------------------------------------
Started by user sblackmon
Building remotely on ubuntu-4 (docker Ubuntu ubuntu4 ubuntu) in workspace <https://builds.apache.org/job/Streams%20Master/ws/>
Wiping out workspace first.
Cloning the remote Git repository
Cloning repository https://git-wip-us.apache.org/repos/asf/incubator-streams-master.git
 > git init <https://builds.apache.org/job/Streams%20Master/ws/> # timeout=10
Fetching upstream changes from https://git-wip-us.apache.org/repos/asf/incubator-streams-master.git
 > git --version # timeout=10
 > git fetch --tags --progress https://git-wip-us.apache.org/repos/asf/incubator-streams-master.git
+refs/heads/*:refs/remotes/origin/*
 > git config remote.origin.url https://git-wip-us.apache.org/repos/asf/incubator-streams-master.git
# timeout=10
 > git config remote.origin.fetch +refs/heads/*:refs/remotes/origin/* # timeout=10
 > git config remote.origin.url https://git-wip-us.apache.org/repos/asf/incubator-streams-master.git
# timeout=10
Cleaning workspace
 > git rev-parse --verify HEAD # timeout=10
No valid HEAD. Skipping the resetting
 > git clean -fdx # timeout=10
Fetching upstream changes from https://git-wip-us.apache.org/repos/asf/incubator-streams-master.git
 > git fetch --tags --progress https://git-wip-us.apache.org/repos/asf/incubator-streams-master.git
+refs/heads/*:refs/remotes/origin/*
 > git rev-parse origin/master^{commit} # timeout=10
Checking out Revision f45df142e90bb50df220d8b8a2e29981b2c4319f (origin/master)
 > git config core.sparsecheckout # timeout=10
 > git checkout -f f45df142e90bb50df220d8b8a2e29981b2c4319f
 > git rev-list ecaa2030c267f0716f3b9d5ab6d992c47970b264 # timeout=10
Parsing POMs
maven31-agent.jar already up to date
maven31-interceptor.jar already up to date
maven3-interceptor-commons.jar already up to date
[Streams Master] $ /home/jenkins/jenkins-slave/tools/hudson.model.JDK/jdk-1.7u51/bin/java
-Xmx2g -Xms256m -XX:MaxPermSize=512m -Dfile.encoding=ISO-8859-1 -cp /home/jenkins/jenkins-slave/maven31-agent.jar:/home/jenkins/jenkins-slave/tools/hudson.tasks.Maven_MavenInstallation/maven-3.2.1/boot/plexus-classworlds-2.5.1.jar:/home/jenkins/jenkins-slave/tools/hudson.tasks.Maven_MavenInstallation/maven-3.2.1/conf/logging
jenkins.maven3.agent.Maven31Main /home/jenkins/jenkins-slave/tools/hudson.tasks.Maven_MavenInstallation/maven-3.2.1
/home/jenkins/jenkins-slave/slave.jar /home/jenkins/jenkins-slave/maven31-interceptor.jar
/home/jenkins/jenkins-slave/maven3-interceptor-commons.jar 52746
<===[JENKINS REMOTING CAPACITY]===>   channel started
Executing Maven:  -B -f <https://builds.apache.org/job/Streams%20Master/ws/pom.xml>
-Dmaven.repo.local=/home/jenkins/jenkins-slave/maven-repositories/1 clean install verify
[INFO] Scanning for projects...
[INFO] 
[INFO] Using the builder org.apache.maven.lifecycle.internal.builder.singlethreaded.SingleThreadedBuilder
with a thread count of 1
[INFO]                                                                         
[INFO] ------------------------------------------------------------------------
[INFO] Building Apache Streams :: streams-master 0.3-incubating-SNAPSHOT
[INFO] ------------------------------------------------------------------------
[INFO] 
[INFO] --- maven-clean-plugin:2.6:clean (default-clean) @ streams-master ---
[INFO] 
[INFO] --- maven-remote-resources-plugin:1.4:process (default) @ streams-master ---
[INFO] 
[INFO] --- maven-site-plugin:3.4:attach-descriptor (attach-descriptor) @ streams-master ---
[INFO] 
[INFO] --- maven-install-plugin:2.5.2:install (default-install) @ streams-master ---
[INFO] Installing <https://builds.apache.org/job/Streams%20Master/ws/pom.xml> to /home/jenkins/jenkins-slave/maven-repositories/1/org/apache/streams/streams-master/0.3-incubating-SNAPSHOT/streams-master-0.3-incubating-SNAPSHOT.pom
[INFO] 
[INFO] --- maven-remote-resources-plugin:1.4:process (default) @ streams-master ---
[INFO] 
[INFO] --- maven-site-plugin:3.4:attach-descriptor (attach-descriptor) @ streams-master ---
[INFO] ------------------------------------------------------------------------
[INFO] BUILD SUCCESS
[INFO] ------------------------------------------------------------------------
[INFO] Total time: 4.631 s
[INFO] Finished at: 2015-06-20T17:10:47+00:00
[INFO] Final Memory: 17M/246M
[INFO] ------------------------------------------------------------------------
[JENKINS] Archiving <https://builds.apache.org/job/Streams%20Master/ws/pom.xml> to org.apache.streams/streams-master/0.3-incubating-SNAPSHOT/streams-master-0.3-incubating-SNAPSHOT.pom
Sending artifact delta relative to Streams Master ยป Apache Streams :: streams-master #1
Archived 1 artifacts
Archive block size is 32768
Received 0 blocks and 33073 bytes
Compression is 0.0%
Took 79 ms
channel stopped
Maven RedeployPublisher use remote ubuntu-4 maven settings from : /home/jenkins/.m2/settings.xml
[INFO] Deployment in https://repository.apache.org/content/repositories/snapshots (id=streams.snapshots,uniqueVersion=true)
Deploying the main artifact streams-master-0.3-incubating-SNAPSHOT.pom
Downloading: https://repository.apache.org/content/repositories/snapshots/org/apache/streams/streams-master/0.3-incubating-SNAPSHOT/maven-metadata.xml
Uploading: https://repository.apache.org/content/repositories/snapshots/org/apache/streams/streams-master/0.3-incubating-SNAPSHOT/streams-master-0.3-incubating-20150620.171048-1.pom
ERROR: Failed to deploy artifacts: Could not transfer artifact org.apache.streams:streams-master:pom:0.3-incubating-20150620.171048-1
from/to streams.snapshots (https://repository.apache.org/content/repositories/snapshots):
Failed to transfer file: https://repository.apache.org/content/repositories/snapshots/org/apache/streams/streams-master/0.3-incubating-SNAPSHOT/streams-master-0.3-incubating-20150620.171048-1.pom.
Return code is: 401, ReasonPhrase: Unauthorized.
org.apache.maven.artifact.deployer.ArtifactDeploymentException: Failed to deploy artifacts:
Could not transfer artifact org.apache.streams:streams-master:pom:0.3-incubating-20150620.171048-1
from/to streams.snapshots (https://repository.apache.org/content/repositories/snapshots):
Failed to transfer file: https://repository.apache.org/content/repositories/snapshots/org/apache/streams/streams-master/0.3-incubating-SNAPSHOT/streams-master-0.3-incubating-20150620.171048-1.pom.
Return code is: 401, ReasonPhrase: Unauthorized.
	at org.apache.maven.artifact.deployer.DefaultArtifactDeployer.deploy(DefaultArtifactDeployer.java:143)
	at hudson.maven.reporters.MavenArtifactRecord.deploy(MavenArtifactRecord.java:193)
	at hudson.maven.RedeployPublisher.perform(RedeployPublisher.java:176)
	at hudson.tasks.BuildStepMonitor$1.perform(BuildStepMonitor.java:20)
	at hudson.model.AbstractBuild$AbstractBuildExecution.perform(AbstractBuild.java:756)
	at hudson.model.AbstractBuild$AbstractBuildExecution.performAllBuildSteps(AbstractBuild.java:720)
	at hudson.maven.MavenModuleSetBuild$MavenModuleSetBuildExecution.post2(MavenModuleSetBuild.java:1037)
	at hudson.model.AbstractBuild$AbstractBuildExecution.post(AbstractBuild.java:669)
	at hudson.model.Run.execute(Run.java:1731)
	at hudson.maven.MavenModuleSetBuild.run(MavenModuleSetBuild.java:529)
	at hudson.model.ResourceController.execute(ResourceController.java:88)
	at hudson.model.Executor.run(Executor.java:232)
Caused by: org.eclipse.aether.deployment.DeploymentException: Failed to deploy artifacts:
Could not transfer artifact org.apache.streams:streams-master:pom:0.3-incubating-20150620.171048-1
from/to streams.snapshots (https://repository.apache.org/content/repositories/snapshots):
Failed to transfer file: https://repository.apache.org/content/repositories/snapshots/org/apache/streams/streams-master/0.3-incubating-SNAPSHOT/streams-master-0.3-incubating-20150620.171048-1.pom.
Return code is: 401, ReasonPhrase: Unauthorized.
	at org.eclipse.aether.internal.impl.DefaultDeployer.deploy(DefaultDeployer.java:341)
	at org.eclipse.aether.internal.impl.DefaultDeployer.deploy(DefaultDeployer.java:269)
	at org.eclipse.aether.internal.impl.DefaultRepositorySystem.deploy(DefaultRepositorySystem.java:413)
	at org.apache.maven.artifact.deployer.DefaultArtifactDeployer.deploy(DefaultArtifactDeployer.java:139)
	... 11 more
Caused by: org.eclipse.aether.transfer.ArtifactTransferException: Could not transfer artifact
org.apache.streams:streams-master:pom:0.3-incubating-20150620.171048-1 from/to streams.snapshots
(https://repository.apache.org/content/repositories/snapshots): Failed to transfer file: https://repository.apache.org/content/repositories/snapshots/org/apache/streams/streams-master/0.3-incubating-SNAPSHOT/streams-master-0.3-incubating-20150620.171048-1.pom.
Return code is: 401, ReasonPhrase: Unauthorized.
	at org.eclipse.aether.connector.wagon.WagonRepositoryConnector$6.wrap(WagonRepositoryConnector.java:1016)
	at org.eclipse.aether.connector.wagon.WagonRepositoryConnector$6.wrap(WagonRepositoryConnector.java:1004)
	at org.eclipse.aether.connector.wagon.WagonRepositoryConnector$PutTask.run(WagonRepositoryConnector.java:895)
	at org.eclipse.aether.connector.wagon.WagonRepositoryConnector.put(WagonRepositoryConnector.java:522)
	at org.eclipse.aether.internal.impl.DefaultDeployer.deploy(DefaultDeployer.java:335)
	... 14 more
Caused by: org.apache.maven.wagon.TransferFailedException: Failed to transfer file: https://repository.apache.org/content/repositories/snapshots/org/apache/streams/streams-master/0.3-incubating-SNAPSHOT/streams-master-0.3-incubating-20150620.171048-1.pom.
Return code is: 401, ReasonPhrase: Unauthorized.
	at org.apache.maven.wagon.shared.http4.AbstractHttpClientWagon.put(AbstractHttpClientWagon.java:626)
	at org.apache.maven.wagon.shared.http4.AbstractHttpClientWagon.put(AbstractHttpClientWagon.java:524)
	at org.apache.maven.wagon.shared.http4.AbstractHttpClientWagon.put(AbstractHttpClientWagon.java:505)
	at org.apache.maven.wagon.shared.http4.AbstractHttpClientWagon.put(AbstractHttpClientWagon.java:485)
	at org.eclipse.aether.connector.wagon.WagonRepositoryConnector$PutTask.run(WagonRepositoryConnector.java:871)
	... 16 more
[INFO] Deployment failed after 0.49 sec
Build step 'Deploy artifacts to Maven repository' changed build result to FAILURE

Mime
View raw message