streams-dev mailing list archives

Site index · List index
Message view « Date » · « Thread »
Top « Date » · « Thread »
From Apache Jenkins Server <jenk...@builds.apache.org>
Subject Build failed in Jenkins: Streams Examples #6
Date Fri, 27 Feb 2015 22:42:16 GMT
See <https://builds.apache.org/job/Streams%20Examples/6/>

------------------------------------------
Started by upstream project "Streams Trunk" build number 149
originally caused by:
 Started by an SCM change
Building remotely on ubuntu-6 (docker Ubuntu ubuntu) in workspace <https://builds.apache.org/job/Streams%20Examples/ws/>
 > git rev-parse --is-inside-work-tree # timeout=10
Fetching changes from the remote Git repository
 > git config remote.origin.url https://git-wip-us.apache.org/repos/asf/incubator-streams-examples.git
# timeout=10
Fetching upstream changes from https://git-wip-us.apache.org/repos/asf/incubator-streams-examples.git
 > git --version # timeout=10
 > git fetch --tags --progress https://git-wip-us.apache.org/repos/asf/incubator-streams-examples.git
+refs/heads/*:refs/remotes/origin/*
 > git rev-parse origin/master^{commit} # timeout=10
Checking out Revision a05d4c9bfc300b31fc50ae17dcf513e161a7b13d (origin/master)
 > git config core.sparsecheckout # timeout=10
 > git checkout -f a05d4c9bfc300b31fc50ae17dcf513e161a7b13d
 > git rev-list a05d4c9bfc300b31fc50ae17dcf513e161a7b13d # timeout=10
Unable to access upstream artifacts area /x1/jenkins/jenkins-home/jobs/Streams Trunk/builds/2015-02-27_22-21-40/archive.
Does source project archive artifacts?
Copied 2 artifacts from "Streams Trunk » gnip-edc-facebook" build number 149
Copied 2 artifacts from "Streams Trunk » gnip-edc-flickr" build number 149
Copied 2 artifacts from "Streams Trunk » gnip-edc-googleplus" build number 149
Copied 2 artifacts from "Streams Trunk » gnip-edc-instagram" build number 149
Copied 2 artifacts from "Streams Trunk » gnip-edc-reddit" build number 149
Copied 2 artifacts from "Streams Trunk » gnip-edc-youtube" build number 149
Copied 2 artifacts from "Streams Trunk » gnip-powertrack" build number 149
Copied 2 artifacts from "Streams Trunk » google-gmail" build number 149
Copied 2 artifacts from "Streams Trunk » google-gplus" build number 149
Copied 1 artifact from "Streams Trunk » streams-amazon-aws" build number 149
Copied 1 artifact from "Streams Trunk » streams-components" build number 149
Copied 2 artifacts from "Streams Trunk » streams-config" build number 149
Copied 1 artifact from "Streams Trunk » streams-contrib" build number 149
Copied 2 artifacts from "Streams Trunk » streams-converters" build number 149
Copied 2 artifacts from "Streams Trunk » streams-core" build number 149
Copied 2 artifacts from "Streams Trunk » streams-http" build number 149
Copied 2 artifacts from "Streams Trunk » streams-monitoring" build number 149
Copied 2 artifacts from "Streams Trunk » streams-persist-cassandra" build number 149
Copied 2 artifacts from "Streams Trunk » streams-persist-console" build number 149
Copied 2 artifacts from "Streams Trunk » streams-persist-elasticsearch" build number 149
Copied 2 artifacts from "Streams Trunk » streams-persist-hbase" build number 149
Copied 2 artifacts from "Streams Trunk » streams-persist-hdfs" build number 149
Copied 2 artifacts from "Streams Trunk » streams-persist-kafka" build number 149
Copied 2 artifacts from "Streams Trunk » streams-persist-mongo" build number 149
Copied 2 artifacts from "Streams Trunk » streams-persist-s3" build number 149
Copied 3 artifacts from "Streams Trunk » streams-pojo" build number 149
Copied 2 artifacts from "Streams Trunk » streams-pojo-extensions" build number 149
Copied 2 artifacts from "Streams Trunk » streams-processor-jackson" build number 149
Copied 2 artifacts from "Streams Trunk » streams-processor-json" build number 149
Copied 2 artifacts from "Streams Trunk » streams-processor-peoplepattern" build number 149
Copied 2 artifacts from "Streams Trunk » streams-processor-regex" build number 149
Copied 2 artifacts from "Streams Trunk » streams-processor-urls" build number 149
Copied 1 artifact from "Streams Trunk » Apache Streams Project Parent POM" build number 149
Copied 2 artifacts from "Streams Trunk » streams-provider-datasift" build number 149
Copied 2 artifacts from "Streams Trunk » streams-provider-facebook" build number 149
Copied 1 artifact from "Streams Trunk » streams-provider-gnip" build number 149
Copied 1 artifact from "Streams Trunk » streams-provider-google" build number 149
Copied 2 artifacts from "Streams Trunk » streams-provider-instagram" build number 149
Copied 2 artifacts from "Streams Trunk » streams-provider-moreover" build number 149
Copied 2 artifacts from "Streams Trunk » streams-provider-rss" build number 149
Copied 2 artifacts from "Streams Trunk » streams-provider-sysomos" build number 149
Copied 2 artifacts from "Streams Trunk » streams-provider-twitter" build number 149
Copied 2 artifacts from "Streams Trunk » streams-provider-youtube" build number 149
Copied 3 artifacts from "Streams Trunk » streams-runtime-dropwizard" build number 149
Copied 3 artifacts from "Streams Trunk » streams-runtime-local" build number 149
Copied 3 artifacts from "Streams Trunk » streams-runtime-pig" build number 149
Copied 2 artifacts from "Streams Trunk » streams-runtime-storm" build number 149
Copied 2 artifacts from "Streams Trunk » streams-eip-routes [org.apache.streams]" build number
149
Copied 1 artifact from "Streams Trunk » streams-runtimes" build number 149
Copied 3 artifacts from "Streams Trunk » streams-util" build number 149
Copied 2 artifacts from "Streams Trunk » activity-consumer-bundle [org.apache.streams.osgi.components.activityconsumer]"
build number 149
Copied 2 artifacts from "Streams Trunk » activity-registration-bundle [org.apache.streams.osgi.components]"
build number 149
Copied 2 artifacts from "Streams Trunk » activity-subscriber-bundle [org.apache.streams.osgi.components.activitysubscriber]"
build number 149
Copied 1 artifact from "Streams Trunk » Apache Streams OSGI Components" build number 149
Parsing POMs
maven31-agent.jar already up to date
maven31-interceptor.jar already up to date
maven3-interceptor-commons.jar already up to date
[Streams Examples] $ /home/jenkins/jenkins-slave/tools/hudson.model.JDK/jdk-1.7u51/bin/java
-Xmx2g -Xms256m -XX:MaxPermSize=512m -Dfile.encoding=ISO-8859-1 -cp /home/jenkins/jenkins-slave/maven31-agent.jar:/home/jenkins/jenkins-slave/tools/hudson.tasks.Maven_MavenInstallation/maven-3.2.1/boot/plexus-classworlds-2.5.1.jar:/home/jenkins/jenkins-slave/tools/hudson.tasks.Maven_MavenInstallation/maven-3.2.1/conf/logging
jenkins.maven3.agent.Maven31Main /home/jenkins/jenkins-slave/tools/hudson.tasks.Maven_MavenInstallation/maven-3.2.1
/home/jenkins/jenkins-slave/slave.jar /home/jenkins/jenkins-slave/maven31-interceptor.jar
/home/jenkins/jenkins-slave/maven3-interceptor-commons.jar 44530
<===[JENKINS REMOTING CAPACITY]===>   channel started
Executing Maven:  -B -f <https://builds.apache.org/job/Streams%20Examples/ws/pom.xml>
-Dmaven.repo.local=/home/jenkins/jenkins-slave/maven-repositories/0 clean install verify
[INFO] Scanning for projects...
[WARNING] 
[WARNING] Some problems were encountered while building the effective model for org.apache.streams:elasticsearch-reindex:jar:0.2-incubating-SNAPSHOT
[WARNING] 'build.plugins.plugin.version' for org.apache.maven.plugins:maven-shade-plugin is
missing. @ line 182, column 17
[WARNING] 
[WARNING] It is highly recommended to fix these problems because they threaten the stability
of your build.
[WARNING] 
[WARNING] For this reason, future Maven versions might no longer support building such malformed
projects.
[WARNING] 
[INFO] ------------------------------------------------------------------------
[INFO] Reactor Build Order:
[INFO] 
[INFO] streams-examples
[INFO] streams-examples-local
[INFO] elasticsearch-reindex
[INFO] 
[INFO] Using the builder org.apache.maven.lifecycle.internal.builder.singlethreaded.SingleThreadedBuilder
with a thread count of 1
[INFO]                                                                         
[INFO] ------------------------------------------------------------------------
[INFO] Building streams-examples 0.2-incubating-SNAPSHOT
[INFO] ------------------------------------------------------------------------
[INFO] 
[INFO] --- maven-clean-plugin:2.5:clean (default-clean) @ streams-examples ---
[INFO] Deleting <https://builds.apache.org/job/Streams%20Examples/ws/target>
[INFO] 
[INFO] --- maven-enforcer-plugin:1.3.1:enforce (enforce-no-snapshots) @ streams-examples ---
[INFO] 
[INFO] --- maven-remote-resources-plugin:1.4:process (default) @ streams-examples ---
[INFO] 
[INFO] --- maven-site-plugin:3.4:attach-descriptor (attach-descriptor) @ streams-examples
---
[INFO] 
[INFO] --- maven-install-plugin:2.5.2:install (default-install) @ streams-examples ---
[INFO] Installing <https://builds.apache.org/job/Streams%20Examples/ws/pom.xml> to /home/jenkins/jenkins-slave/maven-repositories/0/org/apache/streams/streams-examples/0.2-incubating-SNAPSHOT/streams-examples-0.2-incubating-SNAPSHOT.pom
[INFO] 
[INFO] --- maven-enforcer-plugin:1.3.1:enforce (enforce-no-snapshots) @ streams-examples ---
[INFO] 
[INFO] --- maven-remote-resources-plugin:1.4:process (default) @ streams-examples ---
[INFO] 
[INFO] --- maven-site-plugin:3.4:attach-descriptor (attach-descriptor) @ streams-examples
---
[INFO]                                                                         
[INFO] ------------------------------------------------------------------------
[INFO] Building streams-examples-local 0.2-incubating-SNAPSHOT
[INFO] ------------------------------------------------------------------------
[INFO] 
[INFO] --- maven-clean-plugin:2.5:clean (default-clean) @ streams-examples-local ---
[INFO] Deleting <https://builds.apache.org/job/Streams%20Examples/ws/local/target>
[INFO] 
[INFO] --- maven-enforcer-plugin:1.3.1:enforce (enforce-no-snapshots) @ streams-examples-local
---
[INFO] 
[INFO] --- maven-remote-resources-plugin:1.4:process (default) @ streams-examples-local ---
[INFO] 
[INFO] --- maven-site-plugin:3.4:attach-descriptor (attach-descriptor) @ streams-examples-local
---
[INFO] 
[INFO] --- maven-install-plugin:2.5.2:install (default-install) @ streams-examples-local ---
[INFO] Installing <https://builds.apache.org/job/Streams%20Examples/ws/local/pom.xml>
to /home/jenkins/jenkins-slave/maven-repositories/0/org/apache/streams/streams-examples-local/0.2-incubating-SNAPSHOT/streams-examples-local-0.2-incubating-SNAPSHOT.pom
[INFO] 
[INFO] --- maven-enforcer-plugin:1.3.1:enforce (enforce-no-snapshots) @ streams-examples-local
---
[INFO] 
[INFO] --- maven-remote-resources-plugin:1.4:process (default) @ streams-examples-local ---
[INFO] 
[INFO] --- maven-site-plugin:3.4:attach-descriptor (attach-descriptor) @ streams-examples-local
---
[INFO]                                                                         
[INFO] ------------------------------------------------------------------------
[INFO] Building elasticsearch-reindex 0.2-incubating-SNAPSHOT
[INFO] ------------------------------------------------------------------------
[INFO] ------------------------------------------------------------------------
[INFO] Reactor Summary:
[INFO] 
[INFO] streams-examples .................................. SUCCESS [  3.492 s]
[INFO] streams-examples-local ............................ SUCCESS [  0.786 s]
[INFO] elasticsearch-reindex ............................. FAILURE [  0.670 s]
[INFO] ------------------------------------------------------------------------
[INFO] BUILD FAILURE
[INFO] ------------------------------------------------------------------------
[INFO] Total time: 8.229 s
[INFO] Finished at: 2015-02-27T22:42:15+00:00
[INFO] Final Memory: 24M/310M
[INFO] ------------------------------------------------------------------------
[ERROR] Failed to execute goal on project elasticsearch-reindex: Could not resolve dependencies
for project org.apache.streams:elasticsearch-reindex:jar:0.2-incubating-SNAPSHOT: Failure
to find org.apache.streams:streams-pojo:jar:tests:0.2-incubating-SNAPSHOT in http://repository.apache.org/snapshots
was cached in the local repository, resolution will not be reattempted until the update interval
of Nexus has elapsed or updates are forced -> [Help 1]
[ERROR] 
[ERROR] To see the full stack trace of the errors, re-run Maven with the -e switch.
[ERROR] Re-run Maven using the -X switch to enable full debug logging.
[ERROR] 
[ERROR] For more information about the errors and possible solutions, please read the following
articles:
[ERROR] [Help 1] http://cwiki.apache.org/confluence/display/MAVEN/DependencyResolutionException
[ERROR] 
[ERROR] After correcting the problems, you can resume the build with the command
[ERROR]   mvn <goals> -rf :elasticsearch-reindex
[JENKINS] Archiving <https://builds.apache.org/job/Streams%20Examples/ws/local/pom.xml>
to org.apache.streams/streams-examples-local/0.2-incubating-SNAPSHOT/streams-examples-local-0.2-incubating-SNAPSHOT.pom
Sending artifact delta relative to Streams Examples » streams-examples-local #5
Archived 1 artifacts
Archive block size is 32768
Received 0 blocks and 1702 bytes
Compression is 0.0%
Took 70 ms
[JENKINS] Archiving <https://builds.apache.org/job/Streams%20Examples/ws/local/elasticsearch-reindex/pom.xml>
to org.apache.streams/elasticsearch-reindex/0.2-incubating-SNAPSHOT/elasticsearch-reindex-0.2-incubating-SNAPSHOT.pom
Sending artifact delta relative to Streams Examples » elasticsearch-reindex #5
Archived 1 artifacts
Archive block size is 32768
Received 0 blocks and 13524 bytes
Compression is 0.0%
Took 0.53 sec
[JENKINS] Archiving <https://builds.apache.org/job/Streams%20Examples/ws/pom.xml> to
org.apache.streams/streams-examples/0.2-incubating-SNAPSHOT/streams-examples-0.2-incubating-SNAPSHOT.pom
Sending artifact delta relative to Streams Examples » streams-examples #5
Archived 1 artifacts
Archive block size is 32768
Received 0 blocks and 2608 bytes
Compression is 0.0%
Took 69 ms
channel stopped

Mime
View raw message