streams-dev mailing list archives

Site index · List index
Message view « Date » · « Thread »
Top « Date » · « Thread »
From Apache Jenkins Server <jenk...@builds.apache.org>
Subject Build failed in Jenkins: Streams Trunk #107
Date Tue, 02 Dec 2014 19:53:28 GMT
See <https://builds.apache.org/job/Streams%20Trunk/107/>

------------------------------------------
[...truncated 12024 lines...]
Caused by: org.apache.maven.shared.dependency.graph.DependencyGraphBuilderException: Cannot
build project dependency tree
	at org.apache.maven.shared.dependency.graph.internal.Maven2DependencyGraphBuilder.buildDependencyGraph(Maven2DependencyGraphBuilder.java:59)
	at org.apache.maven.plugins.enforcer.AbstractBanDependencies.getDependenciesToCheck(AbstractBanDependencies.java:126)
	... 34 more
Caused by: org.apache.maven.shared.dependency.tree.DependencyTreeBuilderException: Cannot
build project dependency tree
	at org.apache.maven.shared.dependency.tree.DefaultDependencyTreeBuilder.buildDependencyTree(DefaultDependencyTreeBuilder.java:127)
	at org.apache.maven.shared.dependency.tree.DefaultDependencyTreeBuilder.buildDependencyTree(DefaultDependencyTreeBuilder.java:139)
	at org.apache.maven.shared.dependency.graph.internal.Maven2DependencyGraphBuilder.buildDependencyGraph(Maven2DependencyGraphBuilder.java:55)
	... 35 more
Caused by: org.apache.maven.artifact.resolver.ArtifactResolutionException: Unable to get dependency
information: Unable to read the metadata file for artifact 'org.apache.lucene:lucene-test-framework:jar':
Cannot find parent: org.apache.lucene:lucene-parent for project: org.apache.lucene:lucene-test-framework:jar:null
for project org.apache.lucene:lucene-test-framework:jar:null
  org.apache.lucene:lucene-test-framework:jar:4.7.2

from the specified remote repositories:
  apache.snapshots (http://repository.apache.org/snapshots),
  central (http://repo1.maven.org/maven2),
  clojars.org (http://clojars.org/repo),
  cloudera (https://repository.cloudera.com/artifactory/repo)

Path to dependency: 
	1) org.apache.streams:streams-persist-elasticsearch:jar:0.1-SNAPSHOT


	at org.apache.maven.artifact.resolver.DefaultArtifactCollector.recurse(DefaultArtifactCollector.java:430)
	at org.apache.maven.artifact.resolver.DefaultArtifactCollector.collect(DefaultArtifactCollector.java:74)
	at org.apache.maven.shared.dependency.tree.DefaultDependencyTreeBuilder.buildDependencyTree(DefaultDependencyTreeBuilder.java:118)
	... 37 more
Caused by: org.apache.maven.artifact.metadata.ArtifactMetadataRetrievalException: Unable to
read the metadata file for artifact 'org.apache.lucene:lucene-test-framework:jar': Cannot
find parent: org.apache.lucene:lucene-parent for project: org.apache.lucene:lucene-test-framework:jar:null
for project org.apache.lucene:lucene-test-framework:jar:null
	at org.apache.maven.project.artifact.MavenMetadataSource.retrieveRelocatedProject(MavenMetadataSource.java:200)
	at org.apache.maven.project.artifact.MavenMetadataSource.retrieveRelocatedArtifact(MavenMetadataSource.java:94)
	at org.apache.maven.artifact.resolver.DefaultArtifactCollector.recurse(DefaultArtifactCollector.java:387)
	... 39 more
Caused by: org.apache.maven.project.ProjectBuildingException: Cannot find parent: org.apache.lucene:lucene-parent
for project: org.apache.lucene:lucene-test-framework:jar:null for project org.apache.lucene:lucene-test-framework:jar:null
	at org.apache.maven.project.DefaultMavenProjectBuilder.assembleLineage(DefaultMavenProjectBuilder.java:1396)
	at org.apache.maven.project.DefaultMavenProjectBuilder.buildInternal(DefaultMavenProjectBuilder.java:823)
	at org.apache.maven.project.DefaultMavenProjectBuilder.buildFromRepository(DefaultMavenProjectBuilder.java:255)
	at org.apache.maven.project.artifact.MavenMetadataSource.retrieveRelocatedProject(MavenMetadataSource.java:163)
	... 41 more
Caused by: org.apache.maven.project.InvalidProjectModelException: Not a v4.0.0 POM. for project
org.apache.lucene:lucene-parent at /jenkins/maven-repositories/0/org/apache/lucene/lucene-parent/4.7.2/lucene-parent-4.7.2.pom
	at org.apache.maven.project.DefaultMavenProjectBuilder.readModel(DefaultMavenProjectBuilder.java:1599)
	at org.apache.maven.project.DefaultMavenProjectBuilder.readModel(DefaultMavenProjectBuilder.java:1571)
	at org.apache.maven.project.DefaultMavenProjectBuilder.findModelFromRepository(DefaultMavenProjectBuilder.java:562)
	at org.apache.maven.project.DefaultMavenProjectBuilder.assembleLineage(DefaultMavenProjectBuilder.java:1392)
	... 44 more
[INFO] ------------------------------------------------------------------------
[INFO] Total time: 15 minutes 42 seconds
[INFO] Finished at: Tue Dec 02 19:51:59 UTC 2014
[INFO] Final Memory: 263M/873M
[INFO] ------------------------------------------------------------------------
[JENKINS] Archiving <https://builds.apache.org/job/Streams%20Trunk/ws/streams-util/pom.xml>
to org.apache.streams/streams-util/0.1-SNAPSHOT/streams-util-0.1-SNAPSHOT.pom
[JENKINS] Archiving <https://builds.apache.org/job/Streams%20Trunk/ws/streams-util/target/streams-util-0.1-SNAPSHOT.jar>
to org.apache.streams/streams-util/0.1-SNAPSHOT/streams-util-0.1-SNAPSHOT.jar
Sending artifact delta relative to Streams Trunk » streams-util #105
Archived 2 artifacts
Archive block size is 32768
Received 0 blocks and 28358 bytes
Compression is 0.0%
Took 0.29 sec
[JENKINS] Archiving /jenkins/maven-repositories/0/org/apache/streams/build/wrapper-bundle-settings/0.1-SNAPSHOT/wrapper-bundle-settings-0.1-SNAPSHOT.pom
to org.apache.streams.build/wrapper-bundle-settings/0.1-SNAPSHOT/wrapper-bundle-settings-0.1-SNAPSHOT.pom
/jenkins/maven-repositories/0/org/apache/streams/build/wrapper-bundle-settings/0.1-SNAPSHOT/wrapper-bundle-settings-0.1-SNAPSHOT.pom
is not inside <https://builds.apache.org/job/Streams%20Trunk/ws/poms/wrappers/;> will
archive in a separate pass
Sending artifact delta relative to Streams Trunk » apache-streams - wrapper instructions
#105
Archived 1 artifacts
Archive block size is 32768
Received 0 blocks and 2650 bytes
Compression is 0.0%
Took 0.24 sec
[JENKINS] Archiving <https://builds.apache.org/job/Streams%20Trunk/ws/streams-osgi-components/activity-subscriber/pom.xml>
to org.apache.streams.osgi.components/activity-subscriber/0.1-SNAPSHOT/activity-subscriber-0.1-SNAPSHOT.pom
[JENKINS] Archiving <https://builds.apache.org/job/Streams%20Trunk/ws/streams-osgi-components/activity-subscriber/target/activity-subscriber-0.1-SNAPSHOT.jar>
to org.apache.streams.osgi.components/activity-subscriber/0.1-SNAPSHOT/activity-subscriber-0.1-SNAPSHOT.jar
Sending artifact delta relative to Streams Trunk » activity-subscriber-bundle [org.apache.streams.osgi.components.activitysubscriber]
#105
Archived 2 artifacts
Archive block size is 32768
Received 0 blocks and 25477 bytes
Compression is 0.0%
Took 1.8 sec
[JENKINS] Archiving /jenkins/maven-repositories/0/org/apache/streams/build/provision/0.1-SNAPSHOT/provision-0.1-SNAPSHOT.pom
to org.apache.streams.build/provision/0.1-SNAPSHOT/provision-0.1-SNAPSHOT.pom
/jenkins/maven-repositories/0/org/apache/streams/build/provision/0.1-SNAPSHOT/provision-0.1-SNAPSHOT.pom
is not inside <https://builds.apache.org/job/Streams%20Trunk/ws/provision/;> will archive
in a separate pass
Sending artifact delta relative to Streams Trunk » apache-streams - imported bundles #105
Archived 1 artifacts
Archive block size is 32768
Received 0 blocks and 1637 bytes
Compression is 0.0%
Took 0.26 sec
[JENKINS] Archiving /jenkins/maven-repositories/0/org/apache/streams/build/shared-plugin-settings/0.1-SNAPSHOT/shared-plugin-settings-0.1-SNAPSHOT.pom
to org.apache.streams.build/shared-plugin-settings/0.1-SNAPSHOT/shared-plugin-settings-0.1-SNAPSHOT.pom
/jenkins/maven-repositories/0/org/apache/streams/build/shared-plugin-settings/0.1-SNAPSHOT/shared-plugin-settings-0.1-SNAPSHOT.pom
is not inside <https://builds.apache.org/job/Streams%20Trunk/ws/poms/;> will archive
in a separate pass
Sending artifact delta relative to Streams Trunk » apache-streams - plugin configuration
#105
Archived 1 artifacts
Archive block size is 32768
Received 0 blocks and 3177 bytes
Compression is 0.0%
Took 0.24 sec
[JENKINS] Archiving <https://builds.apache.org/job/Streams%20Trunk/ws/streams-runtimes/streams-runtime-webapp/pom.xml>
to org.apache.streams/streams-runtime-webapp/0.1-SNAPSHOT/streams-runtime-webapp-0.1-SNAPSHOT.pom
[JENKINS] Archiving <https://builds.apache.org/job/Streams%20Trunk/ws/streams-runtimes/streams-runtime-webapp/target/streams-runtime-webapp-0.1-SNAPSHOT.jar>
to org.apache.streams/streams-runtime-webapp/0.1-SNAPSHOT/streams-runtime-webapp-0.1-SNAPSHOT.jar
Sending artifact delta relative to Streams Trunk » streams-eip-routes [org.apache.streams]
#105
Archived 2 artifacts
Archive block size is 32768
Received 14 blocks and 801725 bytes
Compression is 36.4%
Took 2.1 sec
[JENKINS] Archiving <https://builds.apache.org/job/Streams%20Trunk/ws/streams-contrib/streams-persist-cassandra/pom.xml>
to org.apache.streams/streams-persist-cassandra/0.1-SNAPSHOT/streams-persist-cassandra-0.1-SNAPSHOT.pom
[JENKINS] Archiving <https://builds.apache.org/job/Streams%20Trunk/ws/streams-contrib/streams-persist-cassandra/target/streams-persist-cassandra-0.1-SNAPSHOT.jar>
to org.apache.streams/streams-persist-cassandra/0.1-SNAPSHOT/streams-persist-cassandra-0.1-SNAPSHOT.jar
Sending artifact delta relative to Streams Trunk » streams-persist-cassandra [org.apache.streams]
#105
Archived 2 artifacts
Archive block size is 32768
Received 0 blocks and 28602 bytes
Compression is 0.0%
Took 0.3 sec
[JENKINS] Archiving <https://builds.apache.org/job/Streams%20Trunk/ws/streams-core/pom.xml>
to org.apache.streams/streams-core/0.1-SNAPSHOT/streams-core-0.1-SNAPSHOT.pom
[JENKINS] Archiving <https://builds.apache.org/job/Streams%20Trunk/ws/streams-core/target/streams-core-0.1-SNAPSHOT.jar>
to org.apache.streams/streams-core/0.1-SNAPSHOT/streams-core-0.1-SNAPSHOT.jar
Sending artifact delta relative to Streams Trunk » streams-core #105
Archived 2 artifacts
Archive block size is 32768
Received 0 blocks and 22810 bytes
Compression is 0.0%
Took 0.31 sec
[JENKINS] Archiving /jenkins/maven-repositories/0/org/apache/streams/osgi/components/streams-osgi-components/0.1-SNAPSHOT/streams-osgi-components-0.1-SNAPSHOT.pom
to org.apache.streams.osgi.components/streams-osgi-components/0.1-SNAPSHOT/streams-osgi-components-0.1-SNAPSHOT.pom
/jenkins/maven-repositories/0/org/apache/streams/osgi/components/streams-osgi-components/0.1-SNAPSHOT/streams-osgi-components-0.1-SNAPSHOT.pom
is not inside <https://builds.apache.org/job/Streams%20Trunk/ws/streams-osgi-components/;>
will archive in a separate pass
Sending artifact delta relative to Streams Trunk » Apache Streams OSGI Components #105
Archived 1 artifacts
Archive block size is 32768
Received 0 blocks and 1722 bytes
Compression is 0.0%
Took 0.3 sec
[JENKINS] Archiving <https://builds.apache.org/job/Streams%20Trunk/ws/streams-config/pom.xml>
to org.apache.streams/streams-config/0.1-SNAPSHOT/streams-config-0.1-SNAPSHOT.pom
[JENKINS] Archiving <https://builds.apache.org/job/Streams%20Trunk/ws/streams-config/target/streams-config-0.1-SNAPSHOT.jar>
to org.apache.streams/streams-config/0.1-SNAPSHOT/streams-config-0.1-SNAPSHOT.jar
Sending artifact delta relative to Streams Trunk » streams-config #105
Archived 2 artifacts
Archive block size is 32768
Received 0 blocks and 19790 bytes
Compression is 0.0%
Took 0.3 sec
[JENKINS] Archiving /jenkins/maven-repositories/0/org/apache/streams/streams-components/0.1-SNAPSHOT/streams-components-0.1-SNAPSHOT.pom
to org.apache.streams/streams-components/0.1-SNAPSHOT/streams-components-0.1-SNAPSHOT.pom
/jenkins/maven-repositories/0/org/apache/streams/streams-components/0.1-SNAPSHOT/streams-components-0.1-SNAPSHOT.pom
is not inside <https://builds.apache.org/job/Streams%20Trunk/ws/streams-components/;>
will archive in a separate pass
Sending artifact delta relative to Streams Trunk » streams-components #105
Archived 1 artifacts
Archive block size is 32768
Received 0 blocks and 2305 bytes
Compression is 0.0%
Took 0.23 sec
[JENKINS] Archiving /jenkins/maven-repositories/0/org/apache/streams/streams-runtimes/0.1-SNAPSHOT/streams-runtimes-0.1-SNAPSHOT.pom
to org.apache.streams/streams-runtimes/0.1-SNAPSHOT/streams-runtimes-0.1-SNAPSHOT.pom
/jenkins/maven-repositories/0/org/apache/streams/streams-runtimes/0.1-SNAPSHOT/streams-runtimes-0.1-SNAPSHOT.pom
is not inside <https://builds.apache.org/job/Streams%20Trunk/ws/streams-runtimes/;>
will archive in a separate pass
Sending artifact delta relative to Streams Trunk » streams-runtimes #105
Archived 1 artifacts
Archive block size is 32768
Received 0 blocks and 1631 bytes
Compression is 0.0%
Took 0.25 sec
[JENKINS] Archiving <https://builds.apache.org/job/Streams%20Trunk/ws/streams-pojo-extensions/pom.xml>
to org.apache.streams/streams-pojo-extensions/0.1-SNAPSHOT/streams-pojo-extensions-0.1-SNAPSHOT.pom
[JENKINS] Archiving <https://builds.apache.org/job/Streams%20Trunk/ws/streams-pojo-extensions/target/streams-pojo-extensions-0.1-SNAPSHOT.jar>
to org.apache.streams/streams-pojo-extensions/0.1-SNAPSHOT/streams-pojo-extensions-0.1-SNAPSHOT.jar
Sending artifact delta relative to Streams Trunk » streams-pojo-extensions #105
Archived 2 artifacts
Archive block size is 32768
Received 0 blocks and 13862 bytes
Compression is 0.0%
Took 2 sec
[JENKINS] Archiving <https://builds.apache.org/job/Streams%20Trunk/ws/streams-components/streams-http/pom.xml>
to org.apache.streams/streams-http/0.1-SNAPSHOT/streams-http-0.1-SNAPSHOT.pom
[JENKINS] Archiving <https://builds.apache.org/job/Streams%20Trunk/ws/streams-components/streams-http/target/streams-http-0.1-SNAPSHOT.jar>
to org.apache.streams/streams-http/0.1-SNAPSHOT/streams-http-0.1-SNAPSHOT.jar
Sending artifact delta relative to Streams Trunk » streams-http #105
Archived 2 artifacts
Archive block size is 32768
Received 0 blocks and 33511 bytes
Compression is 0.0%
Took 0.3 sec
[JENKINS] Archiving <https://builds.apache.org/job/Streams%20Trunk/ws/streams-osgi-components/activity-registration/pom.xml>
to org.apache.streams.osgi.components/activity-registration/0.1-SNAPSHOT/activity-registration-0.1-SNAPSHOT.pom
[JENKINS] Archiving <https://builds.apache.org/job/Streams%20Trunk/ws/streams-osgi-components/activity-registration/target/activity-registration-0.1-SNAPSHOT.jar>
to org.apache.streams.osgi.components/activity-registration/0.1-SNAPSHOT/activity-registration-0.1-SNAPSHOT.jar
Sending artifact delta relative to Streams Trunk » activity-registration-bundle [org.apache.streams.osgi.components]
#105
Archived 2 artifacts
Archive block size is 32768
Received 0 blocks and 23019 bytes
Compression is 0.0%
Took 0.35 sec
[JENKINS] Archiving <https://builds.apache.org/job/Streams%20Trunk/ws/streams-contrib/streams-persist-elasticsearch/pom.xml>
to org.apache.streams/streams-persist-elasticsearch/0.1-SNAPSHOT/streams-persist-elasticsearch-0.1-SNAPSHOT.pom
Sending artifact delta relative to Streams Trunk » streams-persist-elasticsearch #105
Archived 1 artifacts
Archive block size is 32768
Received 0 blocks and 6504 bytes
Compression is 0.0%
Took 0.24 sec
[JENKINS] Archiving <https://builds.apache.org/job/Streams%20Trunk/ws/streams-pojo/pom.xml>
to org.apache.streams/streams-pojo/0.1-SNAPSHOT/streams-pojo-0.1-SNAPSHOT.pom
[JENKINS] Archiving <https://builds.apache.org/job/Streams%20Trunk/ws/streams-pojo/target/streams-pojo-0.1-SNAPSHOT.jar>
to org.apache.streams/streams-pojo/0.1-SNAPSHOT/streams-pojo-0.1-SNAPSHOT.jar
Sending artifact delta relative to Streams Trunk » streams-pojo #105
Archived 2 artifacts
Archive block size is 32768
Received 0 blocks and 111836 bytes
Compression is 0.0%
Took 0.37 sec
[JENKINS] Archiving /jenkins/maven-repositories/0/org/apache/streams/build/compiled-bundle-settings/0.1-SNAPSHOT/compiled-bundle-settings-0.1-SNAPSHOT.pom
to org.apache.streams.build/compiled-bundle-settings/0.1-SNAPSHOT/compiled-bundle-settings-0.1-SNAPSHOT.pom
/jenkins/maven-repositories/0/org/apache/streams/build/compiled-bundle-settings/0.1-SNAPSHOT/compiled-bundle-settings-0.1-SNAPSHOT.pom
is not inside <https://builds.apache.org/job/Streams%20Trunk/ws/poms/compiled/;> will
archive in a separate pass
Sending artifact delta relative to Streams Trunk » apache-streams - bundle instructions #105
Archived 1 artifacts
Archive block size is 32768
Received 0 blocks and 3004 bytes
Compression is 0.0%
Took 0.26 sec
[JENKINS] Archiving <https://builds.apache.org/job/Streams%20Trunk/ws/streams-runtimes/streams-runtime-local/pom.xml>
to org.apache.streams/streams-runtime-local/0.1-SNAPSHOT/streams-runtime-local-0.1-SNAPSHOT.pom
[JENKINS] Archiving <https://builds.apache.org/job/Streams%20Trunk/ws/streams-runtimes/streams-runtime-local/target/streams-runtime-local-0.1-SNAPSHOT.jar>
to org.apache.streams/streams-runtime-local/0.1-SNAPSHOT/streams-runtime-local-0.1-SNAPSHOT.jar
[JENKINS] Archiving <https://builds.apache.org/job/Streams%20Trunk/ws/streams-runtimes/streams-runtime-local/target/streams-runtime-local-0.1-SNAPSHOT-tests.jar>
to org.apache.streams/streams-runtime-local/0.1-SNAPSHOT/streams-runtime-local-0.1-SNAPSHOT-tests.jar
Sending artifact delta relative to Streams Trunk » streams-runtime-local #105
Archived 3 artifacts
Archive block size is 32768
Received 0 blocks and 128875 bytes
Compression is 0.0%
Took 0.45 sec
[JENKINS] Archiving /jenkins/maven-repositories/0/org/apache/streams/streams-contrib/0.1-SNAPSHOT/streams-contrib-0.1-SNAPSHOT.pom
to org.apache.streams/streams-contrib/0.1-SNAPSHOT/streams-contrib-0.1-SNAPSHOT.pom
/jenkins/maven-repositories/0/org/apache/streams/streams-contrib/0.1-SNAPSHOT/streams-contrib-0.1-SNAPSHOT.pom
is not inside <https://builds.apache.org/job/Streams%20Trunk/ws/streams-contrib/;> will
archive in a separate pass
Sending artifact delta relative to Streams Trunk » streams-contrib #105
Archived 1 artifacts
Archive block size is 32768
Received 0 blocks and 3677 bytes
Compression is 0.0%
Took 0.25 sec
[JENKINS] Archiving <https://builds.apache.org/job/Streams%20Trunk/ws/streams-monitoring/pom.xml>
to org.apache.streams/streams-monitoring/0.1-SNAPSHOT/streams-monitoring-0.1-SNAPSHOT.pom
[JENKINS] Archiving <https://builds.apache.org/job/Streams%20Trunk/ws/streams-monitoring/target/streams-monitoring-0.1-SNAPSHOT.jar>
to org.apache.streams/streams-monitoring/0.1-SNAPSHOT/streams-monitoring-0.1-SNAPSHOT.jar
Sending artifact delta relative to Streams Trunk » streams-monitoring #105
Archived 2 artifacts
Archive block size is 32768
Received 0 blocks and 39757 bytes
Compression is 0.0%
Took 1.7 sec
[JENKINS] Archiving /jenkins/maven-repositories/0/org/apache/streams/streams-project/0.1-SNAPSHOT/streams-project-0.1-SNAPSHOT.pom
to org.apache.streams/streams-project/0.1-SNAPSHOT/streams-project-0.1-SNAPSHOT.pom
/jenkins/maven-repositories/0/org/apache/streams/streams-project/0.1-SNAPSHOT/streams-project-0.1-SNAPSHOT.pom
is not inside <https://builds.apache.org/job/Streams%20Trunk/ws/;> will archive in a
separate pass
Sending artifact delta relative to Streams Trunk » Apache Streams Project #105
Archived 1 artifacts
Archive block size is 32768
Received 0 blocks and 18632 bytes
Compression is 0.0%
Took 0.23 sec
[JENKINS] Archiving <https://builds.apache.org/job/Streams%20Trunk/ws/streams-osgi-components/streams-components-all/target/dependency-reduced-pom.xml>
to org.apache.streams.osgi.components/streams-components-all/0.1-SNAPSHOT/streams-components-all-0.1-SNAPSHOT.pom
[JENKINS] Archiving <https://builds.apache.org/job/Streams%20Trunk/ws/streams-osgi-components/streams-components-all/target/streams-components-all-0.1-SNAPSHOT.jar>
to org.apache.streams.osgi.components/streams-components-all/0.1-SNAPSHOT/streams-components-all-0.1-SNAPSHOT.jar
Sending artifact delta relative to Streams Trunk » Apache Streams Components All #105
Archived 2 artifacts
Archive block size is 32768
Received 130 blocks and 57567943 bytes
Compression is 6.9%
Took 31 sec
[JENKINS] Archiving <https://builds.apache.org/job/Streams%20Trunk/ws/streams-contrib/streams-persist-console/pom.xml>
to org.apache.streams/streams-persist-console/0.1-SNAPSHOT/streams-persist-console-0.1-SNAPSHOT.pom
[JENKINS] Archiving <https://builds.apache.org/job/Streams%20Trunk/ws/streams-contrib/streams-persist-console/target/streams-persist-console-0.1-SNAPSHOT.jar>
to org.apache.streams/streams-persist-console/0.1-SNAPSHOT/streams-persist-console-0.1-SNAPSHOT.jar
Sending artifact delta relative to Streams Trunk » streams-persist-console #105
Archived 2 artifacts
Archive block size is 32768
Received 0 blocks and 15281 bytes
Compression is 0.0%
Took 0.23 sec
[JENKINS] Archiving <https://builds.apache.org/job/Streams%20Trunk/ws/streams-osgi-components/activity-consumer/pom.xml>
to org.apache.streams.osgi.components/activity-consumer/0.1-SNAPSHOT/activity-consumer-0.1-SNAPSHOT.pom
[JENKINS] Archiving <https://builds.apache.org/job/Streams%20Trunk/ws/streams-osgi-components/activity-consumer/target/activity-consumer-0.1-SNAPSHOT.jar>
to org.apache.streams.osgi.components/activity-consumer/0.1-SNAPSHOT/activity-consumer-0.1-SNAPSHOT.jar
Sending artifact delta relative to Streams Trunk » activity-consumer-bundle [org.apache.streams.osgi.components.activityconsumer]
#105
Archived 2 artifacts
Archive block size is 32768
Received 0 blocks and 25027 bytes
Compression is 0.0%
Took 0.3 sec
channel stopped

Mime
View raw message