streams-dev mailing list archives

Site index · List index
Message view « Date » · « Thread »
Top « Date » · « Thread »
From Apache Jenkins Server <jenk...@builds.apache.org>
Subject Build failed in Jenkins: Streams Trunk #79
Date Tue, 21 Oct 2014 22:24:34 GMT
See <https://builds.apache.org/job/Streams%20Trunk/79/changes>

Changes:

[rdouglas] STREAMS-200 | Fixed oversight in StreamsProcessorTask that causes us to disregard
any data post processing

------------------------------------------
[...truncated 3618 lines...]

Reason: Cannot find parent: org.apache.lucene:lucene-parent for project: org.apache.lucene:lucene-test-framework:jar:null
for project org.apache.lucene:lucene-test-framework:jar:null


[INFO] ------------------------------------------------------------------------
[INFO] Trace
java.lang.RuntimeException: org.apache.maven.shared.dependency.graph.DependencyGraphBuilderException:
Cannot build project dependency tree
	at org.apache.maven.plugins.enforcer.AbstractBanDependencies.getDependenciesToCheck(AbstractBanDependencies.java:143)
	at org.apache.maven.plugins.enforcer.AbstractBanDependencies.execute(AbstractBanDependencies.java:90)
	at org.apache.maven.plugins.enforcer.RequireReleaseDeps.execute(RequireReleaseDeps.java:114)
	at org.apache.maven.plugins.enforcer.EnforceMojo.execute(EnforceMojo.java:177)
	at org.apache.maven.plugin.DefaultPluginManager.executeMojo(DefaultPluginManager.java:490)
	at hudson.maven.agent.PluginManagerInterceptor.executeMojo(PluginManagerInterceptor.java:182)
	at org.apache.maven.lifecycle.DefaultLifecycleExecutor.executeGoals(DefaultLifecycleExecutor.java:694)
	at org.apache.maven.lifecycle.DefaultLifecycleExecutor.executeGoalWithLifecycle(DefaultLifecycleExecutor.java:556)
	at org.apache.maven.lifecycle.DefaultLifecycleExecutor.executeGoal(DefaultLifecycleExecutor.java:535)
	at org.apache.maven.lifecycle.DefaultLifecycleExecutor.executeGoalAndHandleFailures(DefaultLifecycleExecutor.java:387)
	at org.apache.maven.lifecycle.DefaultLifecycleExecutor.executeTaskSegments(DefaultLifecycleExecutor.java:348)
	at org.apache.maven.lifecycle.DefaultLifecycleExecutor.execute(DefaultLifecycleExecutor.java:180)
	at org.apache.maven.lifecycle.LifecycleExecutorInterceptor.execute(LifecycleExecutorInterceptor.java:65)
	at org.apache.maven.DefaultMaven.doExecute(DefaultMaven.java:328)
	at org.apache.maven.DefaultMaven.execute(DefaultMaven.java:138)
	at org.apache.maven.cli.MavenCli.main(MavenCli.java:362)
	at sun.reflect.NativeMethodAccessorImpl.invoke0(Native Method)
	at sun.reflect.NativeMethodAccessorImpl.invoke(NativeMethodAccessorImpl.java:57)
	at sun.reflect.DelegatingMethodAccessorImpl.invoke(DelegatingMethodAccessorImpl.java:43)
	at java.lang.reflect.Method.invoke(Method.java:606)
	at org.codehaus.classworlds.Launcher.launchEnhanced(Launcher.java:315)
	at org.codehaus.classworlds.Launcher.launch(Launcher.java:255)
	at hudson.maven.agent.Main.launch(Main.java:205)
	at hudson.maven.MavenBuilder.call(MavenBuilder.java:154)
	at hudson.maven.Maven2Builder.call(Maven2Builder.java:79)
	at hudson.maven.Maven2Builder.call(Maven2Builder.java:55)
	at hudson.remoting.UserRequest.perform(UserRequest.java:118)
	at hudson.remoting.UserRequest.perform(UserRequest.java:48)
	at hudson.remoting.Request$2.run(Request.java:328)
	at hudson.remoting.InterceptingExecutorService$1.call(InterceptingExecutorService.java:72)
	at java.util.concurrent.FutureTask.run(FutureTask.java:262)
	at java.util.concurrent.ThreadPoolExecutor.runWorker(ThreadPoolExecutor.java:1145)
	at java.util.concurrent.ThreadPoolExecutor$Worker.run(ThreadPoolExecutor.java:615)
	at java.lang.Thread.run(Thread.java:745)
Caused by: org.apache.maven.shared.dependency.graph.DependencyGraphBuilderException: Cannot
build project dependency tree
	at org.apache.maven.shared.dependency.graph.internal.Maven2DependencyGraphBuilder.buildDependencyGraph(Maven2DependencyGraphBuilder.java:59)
	at org.apache.maven.plugins.enforcer.AbstractBanDependencies.getDependenciesToCheck(AbstractBanDependencies.java:126)
	... 33 more
Caused by: org.apache.maven.shared.dependency.tree.DependencyTreeBuilderException: Cannot
build project dependency tree
	at org.apache.maven.shared.dependency.tree.DefaultDependencyTreeBuilder.buildDependencyTree(DefaultDependencyTreeBuilder.java:127)
	at org.apache.maven.shared.dependency.tree.DefaultDependencyTreeBuilder.buildDependencyTree(DefaultDependencyTreeBuilder.java:139)
	at org.apache.maven.shared.dependency.graph.internal.Maven2DependencyGraphBuilder.buildDependencyGraph(Maven2DependencyGraphBuilder.java:55)
	... 34 more
Caused by: org.apache.maven.artifact.resolver.ArtifactResolutionException: Unable to get dependency
information: Unable to read the metadata file for artifact 'org.apache.lucene:lucene-test-framework:jar':
Cannot find parent: org.apache.lucene:lucene-parent for project: org.apache.lucene:lucene-test-framework:jar:null
for project org.apache.lucene:lucene-test-framework:jar:null
  org.apache.lucene:lucene-test-framework:jar:4.7.2

from the specified remote repositories:
  apache.snapshots (http://repository.apache.org/snapshots),
  central (http://repo1.maven.org/maven2),
  clojars.org (http://clojars.org/repo),
  cloudera (https://repository.cloudera.com/artifactory/repo)

Path to dependency: 
	1) org.apache.streams:streams-persist-elasticsearch:jar:0.1-SNAPSHOT


	at org.apache.maven.artifact.resolver.DefaultArtifactCollector.recurse(DefaultArtifactCollector.java:430)
	at org.apache.maven.artifact.resolver.DefaultArtifactCollector.collect(DefaultArtifactCollector.java:74)
	at org.apache.maven.shared.dependency.tree.DefaultDependencyTreeBuilder.buildDependencyTree(DefaultDependencyTreeBuilder.java:118)
	... 36 more
Caused by: org.apache.maven.artifact.metadata.ArtifactMetadataRetrievalException: Unable to
read the metadata file for artifact 'org.apache.lucene:lucene-test-framework:jar': Cannot
find parent: org.apache.lucene:lucene-parent for project: org.apache.lucene:lucene-test-framework:jar:null
for project org.apache.lucene:lucene-test-framework:jar:null
	at org.apache.maven.project.artifact.MavenMetadataSource.retrieveRelocatedProject(MavenMetadataSource.java:200)
	at org.apache.maven.project.artifact.MavenMetadataSource.retrieveRelocatedArtifact(MavenMetadataSource.java:94)
	at org.apache.maven.artifact.resolver.DefaultArtifactCollector.recurse(DefaultArtifactCollector.java:387)
	... 38 more
Caused by: org.apache.maven.project.ProjectBuildingException: Cannot find parent: org.apache.lucene:lucene-parent
for project: org.apache.lucene:lucene-test-framework:jar:null for project org.apache.lucene:lucene-test-framework:jar:null
	at org.apache.maven.project.DefaultMavenProjectBuilder.assembleLineage(DefaultMavenProjectBuilder.java:1396)
	at org.apache.maven.project.DefaultMavenProjectBuilder.buildInternal(DefaultMavenProjectBuilder.java:823)
	at org.apache.maven.project.DefaultMavenProjectBuilder.buildFromRepository(DefaultMavenProjectBuilder.java:255)
	at org.apache.maven.project.artifact.MavenMetadataSource.retrieveRelocatedProject(MavenMetadataSource.java:163)
	... 40 more
Caused by: org.apache.maven.project.InvalidProjectModelException: Not a v4.0.0 POM. for project
org.apache.lucene:lucene-parent at /home/jenkins/jenkins-slave/maven-repositories/2/org/apache/lucene/lucene-parent/4.7.2/lucene-parent-4.7.2.pom
	at org.apache.maven.project.DefaultMavenProjectBuilder.readModel(DefaultMavenProjectBuilder.java:1599)
	at org.apache.maven.project.DefaultMavenProjectBuilder.readModel(DefaultMavenProjectBuilder.java:1571)
	at org.apache.maven.project.DefaultMavenProjectBuilder.findModelFromRepository(DefaultMavenProjectBuilder.java:562)
	at org.apache.maven.project.DefaultMavenProjectBuilder.assembleLineage(DefaultMavenProjectBuilder.java:1392)
	... 43 more
[INFO] ------------------------------------------------------------------------
[INFO] Total time: 2 minutes 8 seconds
[INFO] Finished at: Tue Oct 21 22:23:43 UTC 2014
[INFO] Final Memory: 218M/3058M
[INFO] ------------------------------------------------------------------------
[JENKINS] Archiving <https://builds.apache.org/job/Streams%20Trunk/ws/streams-core/pom.xml>
to org.apache.streams/streams-core/0.1-SNAPSHOT/streams-core-0.1-SNAPSHOT.pom
[JENKINS] Archiving <https://builds.apache.org/job/Streams%20Trunk/ws/streams-core/target/streams-core-0.1-SNAPSHOT.jar>
to org.apache.streams/streams-core/0.1-SNAPSHOT/streams-core-0.1-SNAPSHOT.jar
Sending artifact delta relative to Streams Trunk » streams-core #77
Archived 2 artifacts
Archive block size is 32768
Received 0 blocks and 22785 bytes
Compression is 0.0%
Took 0.15 sec
[JENKINS] Archiving <https://builds.apache.org/job/Streams%20Trunk/ws/streams-contrib/streams-persist-cassandra/pom.xml>
to org.apache.streams/streams-persist-cassandra/0.1-SNAPSHOT/streams-persist-cassandra-0.1-SNAPSHOT.pom
[JENKINS] Archiving <https://builds.apache.org/job/Streams%20Trunk/ws/streams-contrib/streams-persist-cassandra/target/streams-persist-cassandra-0.1-SNAPSHOT.jar>
to org.apache.streams/streams-persist-cassandra/0.1-SNAPSHOT/streams-persist-cassandra-0.1-SNAPSHOT.jar
Sending artifact delta relative to Streams Trunk » streams-persist-cassandra [org.apache.streams]
#77
Archived 2 artifacts
Archive block size is 32768
Received 0 blocks and 28599 bytes
Compression is 0.0%
Took 0.1 sec
[JENKINS] Archiving /home/jenkins/jenkins-slave/maven-repositories/2/org/apache/streams/osgi/components/streams-osgi-components/0.1-SNAPSHOT/streams-osgi-components-0.1-SNAPSHOT.pom
to org.apache.streams.osgi.components/streams-osgi-components/0.1-SNAPSHOT/streams-osgi-components-0.1-SNAPSHOT.pom
/home/jenkins/jenkins-slave/maven-repositories/2/org/apache/streams/osgi/components/streams-osgi-components/0.1-SNAPSHOT/streams-osgi-components-0.1-SNAPSHOT.pom
is not inside <https://builds.apache.org/job/Streams%20Trunk/ws/streams-osgi-components/;>
will archive in a separate pass
Sending artifact delta relative to Streams Trunk » Apache Streams OSGI Components #78
Archived 1 artifacts
Archive block size is 32768
Received 0 blocks and 1722 bytes
Compression is 0.0%
Took 81 ms
[JENKINS] Archiving <https://builds.apache.org/job/Streams%20Trunk/ws/streams-config/pom.xml>
to org.apache.streams/streams-config/0.1-SNAPSHOT/streams-config-0.1-SNAPSHOT.pom
[JENKINS] Archiving <https://builds.apache.org/job/Streams%20Trunk/ws/streams-config/target/streams-config-0.1-SNAPSHOT.jar>
to org.apache.streams/streams-config/0.1-SNAPSHOT/streams-config-0.1-SNAPSHOT.jar
Sending artifact delta relative to Streams Trunk » streams-config #77
Archived 2 artifacts
Archive block size is 32768
Received 0 blocks and 15760 bytes
Compression is 0.0%
Took 0.13 sec
[JENKINS] Archiving /home/jenkins/jenkins-slave/maven-repositories/2/org/apache/streams/streams-runtimes/0.1-SNAPSHOT/streams-runtimes-0.1-SNAPSHOT.pom
to org.apache.streams/streams-runtimes/0.1-SNAPSHOT/streams-runtimes-0.1-SNAPSHOT.pom
/home/jenkins/jenkins-slave/maven-repositories/2/org/apache/streams/streams-runtimes/0.1-SNAPSHOT/streams-runtimes-0.1-SNAPSHOT.pom
is not inside <https://builds.apache.org/job/Streams%20Trunk/ws/streams-runtimes/;>
will archive in a separate pass
Sending artifact delta relative to Streams Trunk » streams-runtimes #77
Archived 1 artifacts
Archive block size is 32768
Received 0 blocks and 1631 bytes
Compression is 0.0%
Took 0.1 sec
[JENKINS] Archiving <https://builds.apache.org/job/Streams%20Trunk/ws/streams-osgi-components/activity-registration/pom.xml>
to org.apache.streams.osgi.components/activity-registration/0.1-SNAPSHOT/activity-registration-0.1-SNAPSHOT.pom
[JENKINS] Archiving <https://builds.apache.org/job/Streams%20Trunk/ws/streams-osgi-components/activity-registration/target/activity-registration-0.1-SNAPSHOT.jar>
to org.apache.streams.osgi.components/activity-registration/0.1-SNAPSHOT/activity-registration-0.1-SNAPSHOT.jar
Sending artifact delta relative to Streams Trunk » activity-registration-bundle [org.apache.streams.osgi.components]
#77
Archived 2 artifacts
Archive block size is 32768
Received 0 blocks and 23017 bytes
Compression is 0.0%
Took 0.26 sec
[JENKINS] Archiving <https://builds.apache.org/job/Streams%20Trunk/ws/streams-util/pom.xml>
to org.apache.streams/streams-util/0.1-SNAPSHOT/streams-util-0.1-SNAPSHOT.pom
[JENKINS] Archiving <https://builds.apache.org/job/Streams%20Trunk/ws/streams-util/target/streams-util-0.1-SNAPSHOT.jar>
to org.apache.streams/streams-util/0.1-SNAPSHOT/streams-util-0.1-SNAPSHOT.jar
Sending artifact delta relative to Streams Trunk » streams-util #77
Archived 2 artifacts
Archive block size is 32768
Received 0 blocks and 27317 bytes
Compression is 0.0%
Took 0.1 sec
[JENKINS] Archiving <https://builds.apache.org/job/Streams%20Trunk/ws/streams-contrib/streams-persist-elasticsearch/pom.xml>
to org.apache.streams/streams-persist-elasticsearch/0.1-SNAPSHOT/streams-persist-elasticsearch-0.1-SNAPSHOT.pom
Sending artifact delta relative to Streams Trunk » streams-persist-elasticsearch #77
Archived 1 artifacts
Archive block size is 32768
Received 0 blocks and 6300 bytes
Compression is 0.0%
Took 85 ms
[JENKINS] Archiving /home/jenkins/jenkins-slave/maven-repositories/2/org/apache/streams/build/wrapper-bundle-settings/0.1-SNAPSHOT/wrapper-bundle-settings-0.1-SNAPSHOT.pom
to org.apache.streams.build/wrapper-bundle-settings/0.1-SNAPSHOT/wrapper-bundle-settings-0.1-SNAPSHOT.pom
/home/jenkins/jenkins-slave/maven-repositories/2/org/apache/streams/build/wrapper-bundle-settings/0.1-SNAPSHOT/wrapper-bundle-settings-0.1-SNAPSHOT.pom
is not inside <https://builds.apache.org/job/Streams%20Trunk/ws/poms/wrappers/;> will
archive in a separate pass
Sending artifact delta relative to Streams Trunk » apache-streams - wrapper instructions
#78
Archived 1 artifacts
Archive block size is 32768
Received 0 blocks and 2650 bytes
Compression is 0.0%
Took 0.11 sec
[JENKINS] Archiving <https://builds.apache.org/job/Streams%20Trunk/ws/streams-osgi-components/activity-subscriber/pom.xml>
to org.apache.streams.osgi.components/activity-subscriber/0.1-SNAPSHOT/activity-subscriber-0.1-SNAPSHOT.pom
[JENKINS] Archiving <https://builds.apache.org/job/Streams%20Trunk/ws/streams-osgi-components/activity-subscriber/target/activity-subscriber-0.1-SNAPSHOT.jar>
to org.apache.streams.osgi.components/activity-subscriber/0.1-SNAPSHOT/activity-subscriber-0.1-SNAPSHOT.jar
Sending artifact delta relative to Streams Trunk » activity-subscriber-bundle [org.apache.streams.osgi.components.activitysubscriber]
#77
Archived 2 artifacts
Archive block size is 32768
Received 0 blocks and 25475 bytes
Compression is 0.0%
Took 85 ms
[JENKINS] Archiving /home/jenkins/jenkins-slave/maven-repositories/2/org/apache/streams/build/provision/0.1-SNAPSHOT/provision-0.1-SNAPSHOT.pom
to org.apache.streams.build/provision/0.1-SNAPSHOT/provision-0.1-SNAPSHOT.pom
/home/jenkins/jenkins-slave/maven-repositories/2/org/apache/streams/build/provision/0.1-SNAPSHOT/provision-0.1-SNAPSHOT.pom
is not inside <https://builds.apache.org/job/Streams%20Trunk/ws/provision/;> will archive
in a separate pass
Sending artifact delta relative to Streams Trunk » apache-streams - imported bundles #78
Archived 1 artifacts
Archive block size is 32768
Received 0 blocks and 1637 bytes
Compression is 0.0%
Took 0.12 sec
[JENKINS] Archiving <https://builds.apache.org/job/Streams%20Trunk/ws/streams-pojo/pom.xml>
to org.apache.streams/streams-pojo/0.1-SNAPSHOT/streams-pojo-0.1-SNAPSHOT.pom
[JENKINS] Archiving <https://builds.apache.org/job/Streams%20Trunk/ws/streams-pojo/target/streams-pojo-0.1-SNAPSHOT.jar>
to org.apache.streams/streams-pojo/0.1-SNAPSHOT/streams-pojo-0.1-SNAPSHOT.jar
Sending artifact delta relative to Streams Trunk » streams-pojo #77
Archived 2 artifacts
Archive block size is 32768
Received 0 blocks and 110866 bytes
Compression is 0.0%
Took 0.18 sec
[JENKINS] Archiving /home/jenkins/jenkins-slave/maven-repositories/2/org/apache/streams/build/shared-plugin-settings/0.1-SNAPSHOT/shared-plugin-settings-0.1-SNAPSHOT.pom
to org.apache.streams.build/shared-plugin-settings/0.1-SNAPSHOT/shared-plugin-settings-0.1-SNAPSHOT.pom
/home/jenkins/jenkins-slave/maven-repositories/2/org/apache/streams/build/shared-plugin-settings/0.1-SNAPSHOT/shared-plugin-settings-0.1-SNAPSHOT.pom
is not inside <https://builds.apache.org/job/Streams%20Trunk/ws/poms/;> will archive
in a separate pass
Sending artifact delta relative to Streams Trunk » apache-streams - plugin configuration
#78
Archived 1 artifacts
Archive block size is 32768
Received 0 blocks and 3177 bytes
Compression is 0.0%
Took 0.1 sec
[JENKINS] Archiving /home/jenkins/jenkins-slave/maven-repositories/2/org/apache/streams/build/compiled-bundle-settings/0.1-SNAPSHOT/compiled-bundle-settings-0.1-SNAPSHOT.pom
to org.apache.streams.build/compiled-bundle-settings/0.1-SNAPSHOT/compiled-bundle-settings-0.1-SNAPSHOT.pom
/home/jenkins/jenkins-slave/maven-repositories/2/org/apache/streams/build/compiled-bundle-settings/0.1-SNAPSHOT/compiled-bundle-settings-0.1-SNAPSHOT.pom
is not inside <https://builds.apache.org/job/Streams%20Trunk/ws/poms/compiled/;> will
archive in a separate pass
Sending artifact delta relative to Streams Trunk » apache-streams - bundle instructions #78
Archived 1 artifacts
Archive block size is 32768
Received 0 blocks and 3004 bytes
Compression is 0.0%
Took 0.1 sec
[JENKINS] Archiving /home/jenkins/jenkins-slave/maven-repositories/2/org/apache/streams/streams-contrib/0.1-SNAPSHOT/streams-contrib-0.1-SNAPSHOT.pom
to org.apache.streams/streams-contrib/0.1-SNAPSHOT/streams-contrib-0.1-SNAPSHOT.pom
/home/jenkins/jenkins-slave/maven-repositories/2/org/apache/streams/streams-contrib/0.1-SNAPSHOT/streams-contrib-0.1-SNAPSHOT.pom
is not inside <https://builds.apache.org/job/Streams%20Trunk/ws/streams-contrib/;> will
archive in a separate pass
Sending artifact delta relative to Streams Trunk » streams-contrib #77
Archived 1 artifacts
Archive block size is 32768
Received 0 blocks and 3390 bytes
Compression is 0.0%
Took 94 ms
[JENKINS] Archiving /home/jenkins/jenkins-slave/maven-repositories/2/org/apache/streams/streams-project/0.1-SNAPSHOT/streams-project-0.1-SNAPSHOT.pom
to org.apache.streams/streams-project/0.1-SNAPSHOT/streams-project-0.1-SNAPSHOT.pom
/home/jenkins/jenkins-slave/maven-repositories/2/org/apache/streams/streams-project/0.1-SNAPSHOT/streams-project-0.1-SNAPSHOT.pom
is not inside <https://builds.apache.org/job/Streams%20Trunk/ws/;> will archive in a
separate pass
Sending artifact delta relative to Streams Trunk » Apache Streams Project #78
Archived 1 artifacts
Archive block size is 32768
Received 0 blocks and 15462 bytes
Compression is 0.0%
Took 86 ms
[JENKINS] Archiving <https://builds.apache.org/job/Streams%20Trunk/ws/streams-osgi-components/streams-components-all/target/dependency-reduced-pom.xml>
to org.apache.streams.osgi.components/streams-components-all/0.1-SNAPSHOT/streams-components-all-0.1-SNAPSHOT.pom
[JENKINS] Archiving <https://builds.apache.org/job/Streams%20Trunk/ws/streams-osgi-components/streams-components-all/target/streams-components-all-0.1-SNAPSHOT.jar>
to org.apache.streams.osgi.components/streams-components-all/0.1-SNAPSHOT/streams-components-all-0.1-SNAPSHOT.jar
Sending artifact delta relative to Streams Trunk » Apache Streams Components All #77
Archived 2 artifacts
Archive block size is 32768
Received 130 blocks and 57567994 bytes
Compression is 6.9%
Took 28 sec
[JENKINS] Archiving <https://builds.apache.org/job/Streams%20Trunk/ws/streams-contrib/streams-persist-console/pom.xml>
to org.apache.streams/streams-persist-console/0.1-SNAPSHOT/streams-persist-console-0.1-SNAPSHOT.pom
[JENKINS] Archiving <https://builds.apache.org/job/Streams%20Trunk/ws/streams-contrib/streams-persist-console/target/streams-persist-console-0.1-SNAPSHOT.jar>
to org.apache.streams/streams-persist-console/0.1-SNAPSHOT/streams-persist-console-0.1-SNAPSHOT.jar
Sending artifact delta relative to Streams Trunk » streams-persist-console #77
Archived 2 artifacts
Archive block size is 32768
Received 0 blocks and 14229 bytes
Compression is 0.0%
Took 0.14 sec
[JENKINS] Archiving <https://builds.apache.org/job/Streams%20Trunk/ws/streams-osgi-components/activity-consumer/pom.xml>
to org.apache.streams.osgi.components/activity-consumer/0.1-SNAPSHOT/activity-consumer-0.1-SNAPSHOT.pom
[JENKINS] Archiving <https://builds.apache.org/job/Streams%20Trunk/ws/streams-osgi-components/activity-consumer/target/activity-consumer-0.1-SNAPSHOT.jar>
to org.apache.streams.osgi.components/activity-consumer/0.1-SNAPSHOT/activity-consumer-0.1-SNAPSHOT.jar
Sending artifact delta relative to Streams Trunk » activity-consumer-bundle [org.apache.streams.osgi.components.activityconsumer]
#77
Archived 2 artifacts
Archive block size is 32768
Received 0 blocks and 25025 bytes
Compression is 0.0%
Took 0.19 sec
[JENKINS] Archiving <https://builds.apache.org/job/Streams%20Trunk/ws/streams-runtimes/streams-runtime-webapp/pom.xml>
to org.apache.streams/streams-runtime-webapp/0.1-SNAPSHOT/streams-runtime-webapp-0.1-SNAPSHOT.pom
[JENKINS] Archiving <https://builds.apache.org/job/Streams%20Trunk/ws/streams-runtimes/streams-runtime-webapp/target/streams-runtime-webapp-0.1-SNAPSHOT.jar>
to org.apache.streams/streams-runtime-webapp/0.1-SNAPSHOT/streams-runtime-webapp-0.1-SNAPSHOT.jar
Sending artifact delta relative to Streams Trunk » streams-eip-routes [org.apache.streams]
#77
Archived 2 artifacts
Archive block size is 32768
Received 14 blocks and 801726 bytes
Compression is 36.4%
Took 0.35 sec
channel stopped

Mime
View raw message