streams-commits mailing list archives

Site index · List index
Message view « Date » · « Thread »
Top « Date » · « Thread »
From Apache Jenkins Server <jenk...@builds.apache.org>
Subject Build failed in Jenkins: streams-examples #264
Date Mon, 02 Apr 2018 23:24:51 GMT
See <https://builds.apache.org/job/streams-examples/264/display/redirect>

------------------------------------------
Started by upstream project "streams-project" build number 441
originally caused by:
 Started by GitHub push by steveblackmon
[EnvInject] - Loading node environment variables.
Building remotely on H25 (ubuntu xenial) in workspace <https://builds.apache.org/job/streams-examples/ws/>
Cloning the remote Git repository
Cloning repository http://github.com/apache/streams-examples/
 > git init <https://builds.apache.org/job/streams-examples/ws/> # timeout=10
Fetching upstream changes from http://github.com/apache/streams-examples/
 > git --version # timeout=10
 > git fetch --tags --progress http://github.com/apache/streams-examples/ +refs/heads/*:refs/remotes/origin/*
 > git config remote.origin.url http://github.com/apache/streams-examples/ # timeout=10
 > git config --add remote.origin.fetch +refs/heads/*:refs/remotes/origin/* # timeout=10
 > git config remote.origin.url http://github.com/apache/streams-examples/ # timeout=10
Fetching upstream changes from http://github.com/apache/streams-examples/
 > git fetch --tags --progress http://github.com/apache/streams-examples/ +refs/heads/*:refs/remotes/origin/*
 > git rev-parse origin/master^{commit} # timeout=10
Checking out Revision cf1d64f31631563591de245acd1b82f6f79fda5d (origin/master)
 > git config core.sparsecheckout # timeout=10
 > git checkout -f cf1d64f31631563591de245acd1b82f6f79fda5d
Commit message: "Update README.md"
 > git rev-list --no-walk cf1d64f31631563591de245acd1b82f6f79fda5d # timeout=10
Parsing POMs
using settings config with name simple-deploy-settings-no-mirror
Replacing all maven server entries not found in credentials list is true
Failed to transfer Could not find metadata org.apache.streams:apache-streams:0.5.1-SNAPSHOT/maven-metadata.xml
in apache-snapshots (https://repository.apache.org/content/repositories/snapshots)
Failed to transfer Could not find metadata org.apache.streams:apache-streams:0.5.1-SNAPSHOT/maven-metadata.xml
in apache.snapshots (https://repository.apache.org/snapshots)
Modules changed, recalculating dependency graph
Established TCP socket on 38078
maven35-agent.jar already up to date
maven35-interceptor.jar already up to date
maven3-interceptor-commons.jar already up to date
[streams-examples] $ /home/jenkins/tools/java/latest1.8/bin/java -Xmx2g -Xms256m -XX:MaxPermSize=512m
-Dfile.encoding=ISO-8859-1 -cp /home/jenkins/jenkins-slave/maven35-agent.jar:/home/jenkins/tools/maven/apache-maven-3.5.0/boot/plexus-classworlds-2.5.2.jar:/home/jenkins/tools/maven/apache-maven-3.5.0/conf/logging
jenkins.maven3.agent.Maven35Main /home/jenkins/tools/maven/apache-maven-3.5.0 /home/jenkins/jenkins-slave/slave.jar
/home/jenkins/jenkins-slave/maven35-interceptor.jar /home/jenkins/jenkins-slave/maven3-interceptor-commons.jar
38078
Java HotSpot(TM) 64-Bit Server VM warning: ignoring option MaxPermSize=512m; support was removed
in 8.0
<===[JENKINS REMOTING CAPACITY]===>   channel started
using settings config with name simple-deploy-settings-no-mirror
Replacing all maven server entries not found in credentials list is true
Executing Maven:  -B -f <https://builds.apache.org/job/streams-examples/ws/pom.xml>
-Dmaven.repo.local=/home/jenkins/jenkins-slave/maven-repositories/1 -s /tmp/settings4487295209513758028.xml
-q clean install
[WARNING] The project org.apache.streams:apache-streams-examples:pom:0.5.1-SNAPSHOT uses prerequisites
which is only intended for maven-plugin projects but not for non maven-plugin projects. For
such purposes you should use the maven-enforcer-plugin. See https://maven.apache.org/enforcer/enforcer-rules/requireMavenVersion.html
Waiting for Jenkins to finish collecting data
[ERROR] Failed to execute goal org.apache.maven.plugins:maven-checkstyle-plugin:2.17:check
(validate) on project apache-streams-examples: Failed during checkstyle execution: Unable
to find configuration file at location: http://streams.apache.org/site/latest/streams-project/streams-java-checkstyle.xml:
Could not find resource 'http://streams.apache.org/site/latest/streams-project/streams-java-checkstyle.xml'.
-> [Help 1]
[ERROR] 
[ERROR] To see the full stack trace of the errors, re-run Maven with the -e switch.
[ERROR] Re-run Maven using the -X switch to enable full debug logging.
[ERROR] 
[ERROR] For more information about the errors and possible solutions, please read the following
articles:
[ERROR] [Help 1] http://cwiki.apache.org/confluence/display/MAVEN/MojoExecutionException
[JENKINS] Archiving <https://builds.apache.org/job/streams-examples/ws/local/pom.xml>
to org.apache.streams/streams-examples-local/0.5.1-SNAPSHOT/streams-examples-local-0.5.1-SNAPSHOT.pom
[JENKINS] Archiving <https://builds.apache.org/job/streams-examples/ws/local/mongo-elasticsearch-sync/pom.xml>
to org.apache.streams/streams-mongo-elasticsearch-sync/0.5.1-SNAPSHOT/streams-mongo-elasticsearch-sync-0.5.1-SNAPSHOT.pom
[JENKINS] Archiving <https://builds.apache.org/job/streams-examples/ws/local/elasticsearch-hdfs/pom.xml>
to org.apache.streams/streams-elasticsearch-hdfs/0.5.1-SNAPSHOT/streams-elasticsearch-hdfs-0.5.1-SNAPSHOT.pom
[JENKINS] Archiving <https://builds.apache.org/job/streams-examples/ws/local/twitter-userstream-elasticsearch/pom.xml>
to org.apache.streams/twitter-userstream-elasticsearch/0.5.1-SNAPSHOT/twitter-userstream-elasticsearch-0.5.1-SNAPSHOT.pom
[JENKINS] Archiving <https://builds.apache.org/job/streams-examples/ws/flink/pom.xml>
to org.apache.streams/streams-examples-flink/0.5.1-SNAPSHOT/streams-examples-flink-0.5.1-SNAPSHOT.pom
[JENKINS] Archiving <https://builds.apache.org/job/streams-examples/ws/local/twitter-history-elasticsearch/pom.xml>
to org.apache.streams/streams-twitter-history-elasticsearch/0.5.1-SNAPSHOT/streams-twitter-history-elasticsearch-0.5.1-SNAPSHOT.pom
[JENKINS] Archiving <https://builds.apache.org/job/streams-examples/ws/flink/flink-twitter-collection/pom.xml>
to org.apache.streams/streams-flink-twitter-collection/0.5.1-SNAPSHOT/streams-flink-twitter-collection-0.5.1-SNAPSHOT.pom
[JENKINS] Archiving <https://builds.apache.org/job/streams-examples/ws/local/twitter-follow-neo4j/pom.xml>
to org.apache.streams/streams-twitter-follow-neo4j/0.5.1-SNAPSHOT/streams-twitter-follow-neo4j-0.5.1-SNAPSHOT.pom
[JENKINS] Archiving <https://builds.apache.org/job/streams-examples/ws/local/elasticsearch-reindex/pom.xml>
to org.apache.streams/streams-elasticsearch-reindex/0.5.1-SNAPSHOT/streams-elasticsearch-reindex-0.5.1-SNAPSHOT.pom
[JENKINS] Archiving <https://builds.apache.org/job/streams-examples/ws/pom.xml> to org.apache.streams/apache-streams-examples/0.5.1-SNAPSHOT/apache-streams-examples-0.5.1-SNAPSHOT.pom
channel stopped
Not sending mail to unregistered user github@alasdairhodge.co.uk

Mime
View raw message