streams-commits mailing list archives

Site index · List index
Message view « Date » · « Thread »
Top « Date » · « Thread »
From Apache Jenkins Server <jenk...@builds.apache.org>
Subject Build failed in Jenkins: streams-project-site #226
Date Fri, 27 Oct 2017 22:26:24 GMT
See <https://builds.apache.org/job/streams-project-site/226/display/redirect>

------------------------------------------
[...truncated 46.37 KB...]
Finished in 1 ms
Saving to outputFile=<https://builds.apache.org/job/streams-project-site/ws/streams-contrib/streams-provider-moreover/target/scalastyle-output.xml>
Processed 0 file(s)
Found 0 errors
Found 0 warnings
Found 0 infos
Finished in 1 ms
Using java.util.ServiceLoader
[WARNING] Failed to getClass for org.apache.streams.plugins.StreamsPojoSourceGeneratorMojo
Using java.util.ServiceLoader
[ERROR] Error fetching link: <https://builds.apache.org/job/streams-project-site/ws/streams-core/target/site/testapidocs/package-list.>
Ignored it.
[JENKINS] Archiving site from <https://builds.apache.org/job/streams-project-site/ws/streams-contrib/streams-provider-moreover/target/site>
to /x1/jenkins/jenkins-home/jobs/streams-project-site/site/streams-contrib/streams-provider-moreover
Saving to outputFile=<https://builds.apache.org/job/streams-project-site/ws/streams-contrib/streams-provider-twitter/target/scalastyle-output.xml>
Processed 0 file(s)
Found 0 errors
Found 0 warnings
Found 0 infos
Finished in 2 ms
Saving to outputFile=<https://builds.apache.org/job/streams-project-site/ws/streams-contrib/streams-provider-twitter/target/scalastyle-output.xml>
Processed 0 file(s)
Found 0 errors
Found 0 warnings
Found 0 infos
Finished in 1 ms
[WARNING] Failed to getClass for org.apache.streams.plugins.StreamsPojoSourceGeneratorMojo
[ERROR] Error fetching link: <https://builds.apache.org/job/streams-project-site/ws/streams-core/target/site/testapidocs/package-list.>
Ignored it.
[JENKINS] Archiving site from <https://builds.apache.org/job/streams-project-site/ws/streams-contrib/streams-provider-twitter/target/site>
to /x1/jenkins/jenkins-home/jobs/streams-project-site/site/streams-contrib/streams-provider-twitter
Saving to outputFile=<https://builds.apache.org/job/streams-project-site/ws/streams-contrib/streams-provider-sysomos/target/scalastyle-output.xml>
Processed 0 file(s)
Found 0 errors
Found 0 warnings
Found 0 infos
Finished in 1 ms
Saving to outputFile=<https://builds.apache.org/job/streams-project-site/ws/streams-contrib/streams-provider-sysomos/target/scalastyle-output.xml>
Processed 0 file(s)
Found 0 errors
Found 0 warnings
Found 0 infos
Finished in 1 ms
Using java.util.ServiceLoader
[WARNING] Failed to getClass for org.apache.streams.plugins.StreamsPojoSourceGeneratorMojo
Using java.util.ServiceLoader
[ERROR] Error fetching link: <https://builds.apache.org/job/streams-project-site/ws/streams-core/target/site/testapidocs/package-list.>
Ignored it.
[JENKINS] Archiving site from <https://builds.apache.org/job/streams-project-site/ws/streams-contrib/streams-provider-sysomos/target/site>
to /x1/jenkins/jenkins-home/jobs/streams-project-site/site/streams-contrib/streams-provider-sysomos
Saving to outputFile=<https://builds.apache.org/job/streams-project-site/ws/streams-contrib/streams-provider-rss/target/scalastyle-output.xml>
Processed 0 file(s)
Found 0 errors
Found 0 warnings
Found 0 infos
Finished in 1 ms
Saving to outputFile=<https://builds.apache.org/job/streams-project-site/ws/streams-contrib/streams-provider-rss/target/scalastyle-output.xml>
Processed 0 file(s)
Found 0 errors
Found 0 warnings
Found 0 infos
Finished in 1 ms
[WARNING] Failed to getClass for org.apache.streams.plugins.StreamsPojoSourceGeneratorMojo
[ERROR] Error fetching link: <https://builds.apache.org/job/streams-project-site/ws/streams-core/target/site/testapidocs/package-list.>
Ignored it.
[ERROR] Error fetching link: <https://builds.apache.org/job/streams-project-site/ws/streams-contrib/streams-persist-console/target/site/testapidocs/package-list.>
Ignored it.
[JENKINS] Archiving site from <https://builds.apache.org/job/streams-project-site/ws/streams-contrib/streams-provider-rss/target/site>
to /x1/jenkins/jenkins-home/jobs/streams-project-site/site/streams-contrib/streams-provider-rss
Saving to outputFile=<https://builds.apache.org/job/streams-project-site/ws/streams-contrib/streams-processor-regex/target/scalastyle-output.xml>
Processed 0 file(s)
Found 0 errors
Found 0 warnings
Found 0 infos
Finished in 1 ms
[ERROR] Error fetching link: <https://builds.apache.org/job/streams-project-site/ws/streams-core/target/site/testapidocs/package-list.>
Ignored it.
[JENKINS] Archiving site from <https://builds.apache.org/job/streams-project-site/ws/streams-contrib/streams-processor-regex/target/site>
to /x1/jenkins/jenkins-home/jobs/streams-project-site/site/streams-contrib/streams-processor-regex
Saving to outputFile=<https://builds.apache.org/job/streams-project-site/ws/streams-contrib/streams-provider-youtube/target/scalastyle-output.xml>
Processed 0 file(s)
Found 0 errors
Found 0 warnings
Found 0 infos
Finished in 1 ms
Saving to outputFile=<https://builds.apache.org/job/streams-project-site/ws/streams-contrib/streams-provider-youtube/target/scalastyle-output.xml>
Processed 0 file(s)
Found 0 errors
Found 0 warnings
Found 0 infos
Finished in 1 ms
[WARNING] Failed to getClass for org.apache.streams.plugins.StreamsPojoSourceGeneratorMojo
[ERROR] Error fetching link: <https://builds.apache.org/job/streams-project-site/ws/streams-core/target/site/testapidocs/package-list.>
Ignored it.
[JENKINS] Archiving site from <https://builds.apache.org/job/streams-project-site/ws/streams-contrib/streams-provider-youtube/target/site>
to /x1/jenkins/jenkins-home/jobs/streams-project-site/site/streams-contrib/streams-provider-youtube
Saving to outputFile=<https://builds.apache.org/job/streams-project-site/ws/streams-verbs/target/scalastyle-output.xml>
Processed 0 file(s)
Found 0 errors
Found 0 warnings
Found 0 infos
Finished in 1 ms
Saving to outputFile=<https://builds.apache.org/job/streams-project-site/ws/streams-verbs/target/scalastyle-output.xml>
Processed 0 file(s)
Found 0 errors
Found 0 warnings
Found 0 infos
Finished in 0 ms
[WARNING] Failed to getClass for org.apache.streams.plugins.StreamsPojoSourceGeneratorMojo
[JENKINS] Archiving site from <https://builds.apache.org/job/streams-project-site/ws/streams-verbs/target/site>
to /x1/jenkins/jenkins-home/jobs/streams-project-site/site/streams-verbs
Saving to outputFile=<https://builds.apache.org/job/streams-project-site/ws/streams-components/streams-filters/target/scalastyle-output.xml>
Processed 0 file(s)
Found 0 errors
Found 0 warnings
Found 0 infos
Finished in 1 ms
[ERROR] Error fetching link: <https://builds.apache.org/job/streams-project-site/ws/streams-core/target/site/testapidocs/package-list.>
Ignored it.
[JENKINS] Archiving site from <https://builds.apache.org/job/streams-project-site/ws/streams-components/streams-filters/target/site>
to /x1/jenkins/jenkins-home/jobs/streams-project-site/site/streams-components/streams-filters
Saving to outputFile=<https://builds.apache.org/job/streams-project-site/ws/streams-plugins/streams-plugin-cassandra/target/scalastyle-output.xml>
Processed 0 file(s)
Found 0 errors
Found 0 warnings
Found 0 infos
Finished in 0 ms
[ERROR] Error fetching link: <https://builds.apache.org/job/streams-project-site/ws/streams-schemas/streams-schema-activitystreams/target/site/apidocs/package-list.>
Ignored it.
[ERROR] Error fetching link: <https://builds.apache.org/job/streams-project-site/ws/streams-core/target/site/testapidocs/package-list.>
Ignored it.
[JENKINS] Archiving site from <https://builds.apache.org/job/streams-project-site/ws/streams-plugins/streams-plugin-cassandra/target/site>
to /x1/jenkins/jenkins-home/jobs/streams-project-site/site/streams-plugins/streams-plugin-cassandra
Saving to outputFile=<https://builds.apache.org/job/streams-project-site/ws/streams-plugins/streams-plugin-elasticsearch/target/scalastyle-output.xml>
Processed 0 file(s)
Found 0 errors
Found 0 warnings
Found 0 infos
Finished in 1 ms
[ERROR] Error fetching link: <https://builds.apache.org/job/streams-project-site/ws/streams-schemas/streams-schema-activitystreams/target/site/apidocs/package-list.>
Ignored it.
[ERROR] Error fetching link: <https://builds.apache.org/job/streams-project-site/ws/streams-core/target/site/testapidocs/package-list.>
Ignored it.
[JENKINS] Archiving site from <https://builds.apache.org/job/streams-project-site/ws/streams-plugins/streams-plugin-elasticsearch/target/site>
to /x1/jenkins/jenkins-home/jobs/streams-project-site/site/streams-plugins/streams-plugin-elasticsearch
Saving to outputFile=<https://builds.apache.org/job/streams-project-site/ws/streams-plugins/streams-plugin-hbase/target/scalastyle-output.xml>
Processed 0 file(s)
Found 0 errors
Found 0 warnings
Found 0 infos
Finished in 1 ms
[ERROR] Error fetching link: <https://builds.apache.org/job/streams-project-site/ws/streams-schemas/streams-schema-activitystreams/target/site/apidocs/package-list.>
Ignored it.
[ERROR] Error fetching link: <https://builds.apache.org/job/streams-project-site/ws/streams-core/target/site/testapidocs/package-list.>
Ignored it.
[JENKINS] Archiving site from <https://builds.apache.org/job/streams-project-site/ws/streams-plugins/streams-plugin-hbase/target/site>
to /x1/jenkins/jenkins-home/jobs/streams-project-site/site/streams-plugins/streams-plugin-hbase
Saving to outputFile=<https://builds.apache.org/job/streams-project-site/ws/streams-plugins/streams-plugin-hive/target/scalastyle-output.xml>
Processed 0 file(s)
Found 0 errors
Found 0 warnings
Found 0 infos
Finished in 0 ms
[ERROR] Error fetching link: <https://builds.apache.org/job/streams-project-site/ws/streams-schemas/streams-schema-activitystreams/target/site/apidocs/package-list.>
Ignored it.
[ERROR] Error fetching link: <https://builds.apache.org/job/streams-project-site/ws/streams-core/target/site/testapidocs/package-list.>
Ignored it.
[JENKINS] Archiving site from <https://builds.apache.org/job/streams-project-site/ws/streams-plugins/streams-plugin-hive/target/site>
to /x1/jenkins/jenkins-home/jobs/streams-project-site/site/streams-plugins/streams-plugin-hive
Saving to outputFile=<https://builds.apache.org/job/streams-project-site/ws/streams-plugins/streams-plugin-pig/target/scalastyle-output.xml>
Processed 0 file(s)
Found 0 errors
Found 0 warnings
Found 0 infos
Finished in 2 ms
[ERROR] Error fetching link: <https://builds.apache.org/job/streams-project-site/ws/streams-schemas/streams-schema-activitystreams/target/site/apidocs/package-list.>
Ignored it.
[ERROR] Error fetching link: <https://builds.apache.org/job/streams-project-site/ws/streams-core/target/site/testapidocs/package-list.>
Ignored it.
[JENKINS] Archiving site from <https://builds.apache.org/job/streams-project-site/ws/streams-plugins/streams-plugin-pig/target/site>
to /x1/jenkins/jenkins-home/jobs/streams-project-site/site/streams-plugins/streams-plugin-pig
Saving to outputFile=<https://builds.apache.org/job/streams-project-site/ws/streams-plugins/streams-plugin-scala/target/scalastyle-output.xml>
Processed 0 file(s)
Found 0 errors
Found 0 warnings
Found 0 infos
Finished in 1 ms
[ERROR] Error fetching link: <https://builds.apache.org/job/streams-project-site/ws/streams-core/target/site/testapidocs/package-list.>
Ignored it.
[JENKINS] Archiving site from <https://builds.apache.org/job/streams-project-site/ws/streams-plugins/streams-plugin-scala/target/site>
to /x1/jenkins/jenkins-home/jobs/streams-project-site/site/streams-plugins/streams-plugin-scala
Saving to outputFile=<https://builds.apache.org/job/streams-project-site/ws/streams-runtimes/streams-runtime-dropwizard/target/scalastyle-output.xml>
Processed 0 file(s)
Found 0 errors
Found 0 warnings
Found 0 infos
Finished in 1 ms
Saving to outputFile=<https://builds.apache.org/job/streams-project-site/ws/streams-runtimes/streams-runtime-dropwizard/target/scalastyle-output.xml>
Processed 0 file(s)
Found 0 errors
Found 0 warnings
Found 0 infos
Finished in 2 ms
[WARNING] Failed to getClass for org.apache.streams.plugins.StreamsPojoSourceGeneratorMojo
[ERROR] Error fetching link: <https://builds.apache.org/job/streams-project-site/ws/streams-core/target/site/testapidocs/package-list.>
Ignored it.
[JENKINS] Archiving site from <https://builds.apache.org/job/streams-project-site/ws/streams-runtimes/streams-runtime-dropwizard/target/site>
to /x1/jenkins/jenkins-home/jobs/streams-project-site/site/streams-runtimes/streams-runtime-dropwizard
Saving to outputFile=<https://builds.apache.org/job/streams-project-site/ws/streams-schemas/streams-schema-activitystreams2/target/scalastyle-output.xml>
Processed 0 file(s)
Found 0 errors
Found 0 warnings
Found 0 infos
Finished in 1 ms
[JENKINS] Archiving site from <https://builds.apache.org/job/streams-project-site/ws/streams-schemas/streams-schema-activitystreams2/target/site>
to /x1/jenkins/jenkins-home/jobs/streams-project-site/site/streams-schemas/streams-schema-activitystreams2
[ERROR] Failed to check-in files to SCM: The git-push command failed. fatal: could not read
Username for 'https://github.com': No such device or address

Waiting for Jenkins to finish collecting data
[ERROR] Failed to execute goal org.apache.maven.plugins:maven-scm-publish-plugin:1.1:publish-scm
(default-cli) on project apache-streams: Failed to check-in files to SCM: The git-push command
failed. fatal: could not read Username for 'https://github.com': No such device or address
-> [Help 1]
[ERROR] 
[ERROR] To see the full stack trace of the errors, re-run Maven with the -e switch.
[ERROR] Re-run Maven using the -X switch to enable full debug logging.
[ERROR] 
[ERROR] For more information about the errors and possible solutions, please read the following
articles:
[ERROR] [Help 1] http://cwiki.apache.org/confluence/display/MAVEN/MojoExecutionException
[JENKINS] Archiving <https://builds.apache.org/job/streams-project-site/ws/streams-components/streams-filters/pom.xml>
to org.apache.streams/streams-filters/0.5.1-SNAPSHOT/streams-filters-0.5.1-SNAPSHOT.pom
[JENKINS] Archiving <https://builds.apache.org/job/streams-project-site/ws/streams-schemas/streams-schema-activitystreams2/pom.xml>
to org.apache.streams/streams-schema-activitystreams2/0.5.1-SNAPSHOT/streams-schema-activitystreams2-0.5.1-SNAPSHOT.pom
[JENKINS] Archiving <https://builds.apache.org/job/streams-project-site/ws/streams-core/pom.xml>
to org.apache.streams/streams-core/0.5.1-SNAPSHOT/streams-core-0.5.1-SNAPSHOT.pom
[JENKINS] Archiving <https://builds.apache.org/job/streams-project-site/ws/streams-contrib/streams-processor-regex/pom.xml>
to org.apache.streams/streams-processor-regex/0.5.1-SNAPSHOT/streams-processor-regex-0.5.1-SNAPSHOT.pom
[JENKINS] Archiving <https://builds.apache.org/job/streams-project-site/ws/streams-runtimes/pom.xml>
to org.apache.streams/streams-runtimes/0.5.1-SNAPSHOT/streams-runtimes-0.5.1-SNAPSHOT.pom
[JENKINS] Archiving <https://builds.apache.org/job/streams-project-site/ws/streams-contrib/streams-persist-filebuffer/pom.xml>
to org.apache.streams/streams-persist-filebuffer/0.5.1-SNAPSHOT/streams-persist-filebuffer-0.5.1-SNAPSHOT.pom
[JENKINS] Archiving <https://builds.apache.org/job/streams-project-site/ws/streams-plugins/streams-plugin-hive/pom.xml>
to org.apache.streams.plugins/streams-plugin-hive/0.5.1-SNAPSHOT/streams-plugin-hive-0.5.1-SNAPSHOT.pom
[JENKINS] Archiving <https://builds.apache.org/job/streams-project-site/ws/streams-components/streams-converters/pom.xml>
to org.apache.streams/streams-converters/0.5.1-SNAPSHOT/streams-converters-0.5.1-SNAPSHOT.pom
[JENKINS] Archiving <https://builds.apache.org/job/streams-project-site/ws/streams-contrib/streams-persist-console/pom.xml>
to org.apache.streams/streams-persist-console/0.5.1-SNAPSHOT/streams-persist-console-0.5.1-SNAPSHOT.pom
[JENKINS] Archiving <https://builds.apache.org/job/streams-project-site/ws/streams-contrib/pom.xml>
to org.apache.streams/streams-contrib/0.5.1-SNAPSHOT/streams-contrib-0.5.1-SNAPSHOT.pom
[JENKINS] Archiving <https://builds.apache.org/job/streams-project-site/ws/streams-contrib/streams-amazon-aws/pom.xml>
to org.apache.streams/streams-amazon-aws/0.5.1-SNAPSHOT/streams-amazon-aws-0.5.1-SNAPSHOT.pom
[JENKINS] Archiving <https://builds.apache.org/job/streams-project-site/ws/streams-contrib/streams-processor-json/pom.xml>
to org.apache.streams/streams-processor-json/0.5.1-SNAPSHOT/streams-processor-json-0.5.1-SNAPSHOT.pom
[JENKINS] Archiving <https://builds.apache.org/job/streams-project-site/ws/streams-plugins/streams-plugin-pig/pom.xml>
to org.apache.streams.plugins/streams-plugin-pig/0.5.1-SNAPSHOT/streams-plugin-pig-0.5.1-SNAPSHOT.pom
[JENKINS] Archiving <https://builds.apache.org/job/streams-project-site/ws/streams-contrib/streams-persist-neo4j/pom.xml>
to org.apache.streams/streams-persist-neo4j/0.5.1-SNAPSHOT/streams-persist-neo4j-0.5.1-SNAPSHOT.pom
[JENKINS] Archiving <https://builds.apache.org/job/streams-project-site/ws/streams-contrib/streams-processor-peoplepattern/pom.xml>
to org.apache.streams/streams-processor-peoplepattern/0.5.1-SNAPSHOT/streams-processor-peoplepattern-0.5.1-SNAPSHOT.pom
[JENKINS] Archiving <https://builds.apache.org/job/streams-project-site/ws/streams-contrib/streams-provider-rss/pom.xml>
to org.apache.streams/streams-provider-rss/0.5.1-SNAPSHOT/streams-provider-rss-0.5.1-SNAPSHOT.pom
[JENKINS] Archiving <https://builds.apache.org/job/streams-project-site/ws/streams-plugins/streams-plugin-hbase/pom.xml>
to org.apache.streams.plugins/streams-plugin-hbase/0.5.1-SNAPSHOT/streams-plugin-hbase-0.5.1-SNAPSHOT.pom
[JENKINS] Archiving <https://builds.apache.org/job/streams-project-site/ws/streams-components/streams-http/pom.xml>
to org.apache.streams/streams-http/0.5.1-SNAPSHOT/streams-http-0.5.1-SNAPSHOT.pom
[JENKINS] Archiving <https://builds.apache.org/job/streams-project-site/ws/streams-plugins/streams-plugin-pojo/pom.xml>
to org.apache.streams.plugins/streams-plugin-pojo/0.5.1-SNAPSHOT/streams-plugin-pojo-0.5.1-SNAPSHOT.pom
[JENKINS] Archiving <https://builds.apache.org/job/streams-project-site/ws/streams-pojo/pom.xml>
to org.apache.streams/streams-pojo/0.5.1-SNAPSHOT/streams-pojo-0.5.1-SNAPSHOT.pom
[JENKINS] Archiving <https://builds.apache.org/job/streams-project-site/ws/streams-contrib/streams-amazon-aws/streams-persist-kinesis/pom.xml>
to org.apache.streams/streams-persist-kinesis/0.5.1-SNAPSHOT/streams-persist-kinesis-0.5.1-SNAPSHOT.pom
[JENKINS] Archiving <https://builds.apache.org/job/streams-project-site/ws/streams-plugins/streams-plugin-scala/pom.xml>
to org.apache.streams.plugins/streams-plugin-scala/0.5.1-SNAPSHOT/streams-plugin-scala-0.5.1-SNAPSHOT.pom
[JENKINS] Archiving <https://builds.apache.org/job/streams-project-site/ws/streams-contrib/streams-processor-urls/pom.xml>
to org.apache.streams/streams-processor-urls/0.5.1-SNAPSHOT/streams-processor-urls-0.5.1-SNAPSHOT.pom
[JENKINS] Archiving <https://builds.apache.org/job/streams-project-site/ws/streams-contrib/streams-provider-google/google-gmail/pom.xml>
to org.apache.streams/streams-provider-google-gmail/0.5.1-SNAPSHOT/streams-provider-google-gmail-0.5.1-SNAPSHOT.pom
[JENKINS] Archiving <https://builds.apache.org/job/streams-project-site/ws/streams-plugins/streams-plugin-elasticsearch/pom.xml>
to org.apache.streams.plugins/streams-plugin-elasticsearch/0.5.1-SNAPSHOT/streams-plugin-elasticsearch-0.5.1-SNAPSHOT.pom
[JENKINS] Archiving <https://builds.apache.org/job/streams-project-site/ws/streams-runtimes/streams-runtime-dropwizard/pom.xml>
to org.apache.streams/streams-runtime-dropwizard/0.5.1-SNAPSHOT/streams-runtime-dropwizard-0.5.1-SNAPSHOT.pom
[JENKINS] Archiving <https://builds.apache.org/job/streams-project-site/ws/streams-contrib/streams-provider-google/pom.xml>
to org.apache.streams/streams-provider-google/0.5.1-SNAPSHOT/streams-provider-google-0.5.1-SNAPSHOT.pom
[JENKINS] Archiving <https://builds.apache.org/job/streams-project-site/ws/streams-pojo-extensions/pom.xml>
to org.apache.streams/streams-pojo-extensions/0.5.1-SNAPSHOT/streams-pojo-extensions-0.5.1-SNAPSHOT.pom
[JENKINS] Archiving <https://builds.apache.org/job/streams-project-site/ws/streams-contrib/streams-processor-jackson/pom.xml>
to org.apache.streams/streams-processor-jackson/0.5.1-SNAPSHOT/streams-processor-jackson-0.5.1-SNAPSHOT.pom
[JENKINS] Archiving <https://builds.apache.org/job/streams-project-site/ws/streams-components/pom.xml>
to org.apache.streams/streams-components/0.5.1-SNAPSHOT/streams-components-0.5.1-SNAPSHOT.pom
[JENKINS] Archiving <https://builds.apache.org/job/streams-project-site/ws/streams-schemas/streams-schema-activitystreams/pom.xml>
to org.apache.streams/streams-schema-activitystreams/0.5.1-SNAPSHOT/streams-schema-activitystreams-0.5.1-SNAPSHOT.pom
[JENKINS] Archiving <https://builds.apache.org/job/streams-project-site/ws/streams-contrib/streams-provider-sysomos/pom.xml>
to org.apache.streams/streams-provider-sysomos/0.5.1-SNAPSHOT/streams-provider-sysomos-0.5.1-SNAPSHOT.pom
[JENKINS] Archiving <https://builds.apache.org/job/streams-project-site/ws/streams-contrib/streams-provider-youtube/pom.xml>
to org.apache.streams/streams-provider-youtube/0.5.1-SNAPSHOT/streams-provider-youtube-0.5.1-SNAPSHOT.pom
[JENKINS] Archiving <https://builds.apache.org/job/streams-project-site/ws/streams-schemas/pom.xml>
to org.apache.streams/streams-schemas/0.5.1-SNAPSHOT/streams-schemas-0.5.1-SNAPSHOT.pom
[JENKINS] Archiving <https://builds.apache.org/job/streams-project-site/ws/pom.xml>
to org.apache.streams/apache-streams/0.5.1-SNAPSHOT/apache-streams-0.5.1-SNAPSHOT.pom
[Fast Archiver] Compressed 64.03 KB of artifacts by 99.9% relative to #225
[JENKINS] Archiving <https://builds.apache.org/job/streams-project-site/ws/streams-contrib/streams-provider-facebook/pom.xml>
to org.apache.streams/streams-provider-facebook/0.5.1-SNAPSHOT/streams-provider-facebook-0.5.1-SNAPSHOT.pom
[JENKINS] Archiving <https://builds.apache.org/job/streams-project-site/ws/streams-contrib/streams-persist-cassandra/pom.xml>
to org.apache.streams/streams-persist-cassandra/0.5.1-SNAPSHOT/streams-persist-cassandra-0.5.1-SNAPSHOT.pom
[JENKINS] Archiving <https://builds.apache.org/job/streams-project-site/ws/streams-contrib/streams-persist-elasticsearch/pom.xml>
to org.apache.streams/streams-persist-elasticsearch/0.5.1-SNAPSHOT/streams-persist-elasticsearch-0.5.1-SNAPSHOT.pom
[JENKINS] Archiving <https://builds.apache.org/job/streams-project-site/ws/streams-contrib/streams-provider-google/google-gplus/pom.xml>
to org.apache.streams/streams-provider-google-gplus/0.5.1-SNAPSHOT/streams-provider-google-gplus-0.5.1-SNAPSHOT.pom
[JENKINS] Archiving <https://builds.apache.org/job/streams-project-site/ws/streams-config/pom.xml>
to org.apache.streams/streams-config/0.5.1-SNAPSHOT/streams-config-0.5.1-SNAPSHOT.pom
[JENKINS] Archiving <https://builds.apache.org/job/streams-project-site/ws/streams-util/pom.xml>
to org.apache.streams/streams-util/0.5.1-SNAPSHOT/streams-util-0.5.1-SNAPSHOT.pom
[JENKINS] Archiving <https://builds.apache.org/job/streams-project-site/ws/streams-contrib/streams-persist-hdfs/pom.xml>
to org.apache.streams/streams-persist-hdfs/0.5.1-SNAPSHOT/streams-persist-hdfs-0.5.1-SNAPSHOT.pom
[JENKINS] Archiving <https://builds.apache.org/job/streams-project-site/ws/streams-plugins/pom.xml>
to org.apache.streams.plugins/streams-plugins/0.5.1-SNAPSHOT/streams-plugins-0.5.1-SNAPSHOT.pom
[JENKINS] Archiving <https://builds.apache.org/job/streams-project-site/ws/streams-contrib/streams-provider-twitter/pom.xml>
to org.apache.streams/streams-provider-twitter/0.5.1-SNAPSHOT/streams-provider-twitter-0.5.1-SNAPSHOT.pom
[JENKINS] Archiving <https://builds.apache.org/job/streams-project-site/ws/streams-contrib/streams-amazon-aws/streams-persist-s3/pom.xml>
to org.apache.streams/streams-persist-s3/0.5.1-SNAPSHOT/streams-persist-s3-0.5.1-SNAPSHOT.pom
[JENKINS] Archiving <https://builds.apache.org/job/streams-project-site/ws/streams-verbs/pom.xml>
to org.apache.streams/streams-verbs/0.5.1-SNAPSHOT/streams-verbs-0.5.1-SNAPSHOT.pom
[JENKINS] Archiving <https://builds.apache.org/job/streams-project-site/ws/streams-contrib/streams-provider-instagram/pom.xml>
to org.apache.streams/streams-provider-instagram/0.5.1-SNAPSHOT/streams-provider-instagram-0.5.1-SNAPSHOT.pom
[JENKINS] Archiving <https://builds.apache.org/job/streams-project-site/ws/streams-contrib/streams-persist-kafka/pom.xml>
to org.apache.streams/streams-persist-kafka/0.5.1-SNAPSHOT/streams-persist-kafka-0.5.1-SNAPSHOT.pom
[JENKINS] Archiving <https://builds.apache.org/job/streams-project-site/ws/streams-contrib/streams-provider-moreover/pom.xml>
to org.apache.streams/streams-provider-moreover/0.5.1-SNAPSHOT/streams-provider-moreover-0.5.1-SNAPSHOT.pom
[JENKINS] Archiving <https://builds.apache.org/job/streams-project-site/ws/streams-monitoring/pom.xml>
to org.apache.streams/streams-monitoring/0.5.1-SNAPSHOT/streams-monitoring-0.5.1-SNAPSHOT.pom
[JENKINS] Archiving <https://builds.apache.org/job/streams-project-site/ws/streams-contrib/streams-persist-graph/pom.xml>
to org.apache.streams/streams-persist-graph/0.5.1-SNAPSHOT/streams-persist-graph-0.5.1-SNAPSHOT.pom
[JENKINS] Archiving <https://builds.apache.org/job/streams-project-site/ws/streams-contrib/streams-persist-riak/pom.xml>
to org.apache.streams/streams-persist-riak/0.5.1-SNAPSHOT/streams-persist-riak-0.5.1-SNAPSHOT.pom
[JENKINS] Archiving <https://builds.apache.org/job/streams-project-site/ws/streams-testing/pom.xml>
to org.apache.streams/streams-testing/0.5.1-SNAPSHOT/streams-testing-0.5.1-SNAPSHOT.pom
[JENKINS] Archiving <https://builds.apache.org/job/streams-project-site/ws/streams-contrib/streams-persist-hbase/pom.xml>
to org.apache.streams/streams-persist-hbase/0.5.1-SNAPSHOT/streams-persist-hbase-0.5.1-SNAPSHOT.pom
[JENKINS] Archiving <https://builds.apache.org/job/streams-project-site/ws/streams-contrib/streams-persist-mongo/pom.xml>
to org.apache.streams/streams-persist-mongo/0.5.1-SNAPSHOT/streams-persist-mongo-0.5.1-SNAPSHOT.pom
[JENKINS] Archiving <https://builds.apache.org/job/streams-project-site/ws/streams-plugins/streams-plugin-cassandra/pom.xml>
to org.apache.streams.plugins/streams-plugin-cassandra/0.5.1-SNAPSHOT/streams-plugin-cassandra-0.5.1-SNAPSHOT.pom
[JENKINS] Archiving <https://builds.apache.org/job/streams-project-site/ws/streams-runtimes/streams-runtime-local/pom.xml>
to org.apache.streams/streams-runtime-local/0.5.1-SNAPSHOT/streams-runtime-local-0.5.1-SNAPSHOT.pom
channel stopped

Mime
View raw message