streams-commits mailing list archives

Site index · List index
Message view « Date » · « Thread »
Top « Date » · « Thread »
From Apache Jenkins Server <jenk...@builds.apache.org>
Subject Build failed in Jenkins: streams-project #376
Date Wed, 21 Jun 2017 03:43:32 GMT
See <https://builds.apache.org/job/streams-project/376/display/redirect?page=changes>

Changes:

[sblackmon] resolves STREAMS-516

------------------------------------------
[...truncated 246.57 KB...]
SLF4J: Defaulting to no-operation (NOP) logger implementation
SLF4J: See http://www.slf4j.org/codes.html#StaticLoggerBinder for further details.
Running org.apache.streams.plugins.test.StreamsPojoSourceGeneratorTest
Tests run: 1, Failures: 0, Errors: 0, Skipped: 0, Time elapsed: 1.184 sec - in org.apache.streams.plugins.test.StreamsPojoSourceGeneratorTest
testStreamsPojoSourceGenerator(org.apache.streams.plugins.test.StreamsPojoSourceGeneratorTest)
 Time elapsed: 1.183 sec

Results :

Tests run: 2, Failures: 0, Errors: 0, Skipped: 0

[JENKINS] Recording test results
[JENKINS] Recording test results
[INFO] Installing <https://builds.apache.org/job/streams-project/ws/streams-plugins/streams-plugin-pojo/target/streams-plugin-pojo-0.5.1-incubating-SNAPSHOT.jar>
to /home/jenkins/jenkins-slave/maven-repositories/0/org/apache/streams/plugins/streams-plugin-pojo/0.5.1-incubating-SNAPSHOT/streams-plugin-pojo-0.5.1-incubating-SNAPSHOT.jar
[INFO] Installing <https://builds.apache.org/job/streams-project/ws/streams-plugins/streams-plugin-pojo/pom.xml>
to /home/jenkins/jenkins-slave/maven-repositories/0/org/apache/streams/plugins/streams-plugin-pojo/0.5.1-incubating-SNAPSHOT/streams-plugin-pojo-0.5.1-incubating-SNAPSHOT.pom
Saving to outputFile=<https://builds.apache.org/job/streams-project/ws/streams-config/target/scalastyle-output.xml>
Processed 0 file(s)
Found 0 errors
Found 0 warnings
Found 0 infos
Finished in 1 ms
Saving to outputFile=<https://builds.apache.org/job/streams-project/ws/streams-config/target/scalastyle-output.xml>
Processed 0 file(s)
Found 0 errors
Found 0 warnings
Found 0 infos
Finished in 0 ms
[WARNING] Failed to getClass for org.apache.streams.plugins.StreamsPojoSourceGeneratorMojo

-------------------------------------------------------
 T E S T S
-------------------------------------------------------
Running org.apache.streams.config.test.ComponentConfiguratorTest
SLF4J: Failed to load class "org.slf4j.impl.StaticLoggerBinder".
SLF4J: Defaulting to no-operation (NOP) logger implementation
SLF4J: See http://www.slf4j.org/codes.html#StaticLoggerBinder for further details.
Tests run: 4, Failures: 0, Errors: 0, Skipped: 0, Time elapsed: 0.449 sec - in org.apache.streams.config.test.ComponentConfiguratorTest
testDetectConfigurationConfig(org.apache.streams.config.test.ComponentConfiguratorTest)  Time
elapsed: 0.295 sec
testDetectDefaults(org.apache.streams.config.test.ComponentConfiguratorTest)  Time elapsed:
0.004 sec
testDetectConfigurationString(org.apache.streams.config.test.ComponentConfiguratorTest)  Time
elapsed: 0.142 sec
testDetectConfigurationConfigString(org.apache.streams.config.test.ComponentConfiguratorTest)
 Time elapsed: 0.004 sec
Running org.apache.streams.config.test.StreamsConfiguratorTest
SLF4J: Failed to load class "org.slf4j.impl.StaticLoggerBinder".
SLF4J: Defaulting to no-operation (NOP) logger implementation
SLF4J: See http://www.slf4j.org/codes.html#StaticLoggerBinder for further details.
Tests run: 1, Failures: 0, Errors: 0, Skipped: 0, Time elapsed: 0.324 sec - in org.apache.streams.config.test.StreamsConfiguratorTest
testDetectConfiguration(org.apache.streams.config.test.StreamsConfiguratorTest)  Time elapsed:
0.324 sec

Results :

Tests run: 5, Failures: 0, Errors: 0, Skipped: 0

[JENKINS] Recording test results
[JENKINS] Recording test results
[INFO] Installing <https://builds.apache.org/job/streams-project/ws/streams-config/target/streams-config-0.5.1-incubating-SNAPSHOT.jar>
to /home/jenkins/jenkins-slave/maven-repositories/0/org/apache/streams/streams-config/0.5.1-incubating-SNAPSHOT/streams-config-0.5.1-incubating-SNAPSHOT.jar
[INFO] Installing <https://builds.apache.org/job/streams-project/ws/streams-config/pom.xml>
to /home/jenkins/jenkins-slave/maven-repositories/0/org/apache/streams/streams-config/0.5.1-incubating-SNAPSHOT/streams-config-0.5.1-incubating-SNAPSHOT.pom
Saving to outputFile=<https://builds.apache.org/job/streams-project/ws/streams-util/target/scalastyle-output.xml>
Processed 0 file(s)
Found 0 errors
Found 0 warnings
Found 0 infos
Finished in 1 ms

-------------------------------------------------------
 T E S T S
-------------------------------------------------------
Running org.apache.streams.util.schema.test.SchemaStoreTest
SLF4J: Failed to load class "org.slf4j.impl.StaticLoggerBinder".
SLF4J: Defaulting to no-operation (NOP) logger implementation
SLF4J: See http://www.slf4j.org/codes.html#StaticLoggerBinder for further details.
Tests run: 4, Failures: 0, Errors: 0, Skipped: 0, Time elapsed: 1.584 sec - in org.apache.streams.util.schema.test.SchemaStoreTest
indexApprove(org.apache.streams.util.schema.test.SchemaStoreTest)  Time elapsed: 0.234 sec
indexCollection(org.apache.streams.util.schema.test.SchemaStoreTest)  Time elapsed: 1.346
sec
indexUpdate(org.apache.streams.util.schema.test.SchemaStoreTest)  Time elapsed: 0.003 sec
indexMediaLink(org.apache.streams.util.schema.test.SchemaStoreTest)  Time elapsed: 0 sec
Running org.apache.streams.util.schema.test.SchemaOrderingTest
SLF4J: Failed to load class "org.slf4j.impl.StaticLoggerBinder".
SLF4J: Defaulting to no-operation (NOP) logger implementation
SLF4J: See http://www.slf4j.org/codes.html#StaticLoggerBinder for further details.
Tests run: 6, Failures: 0, Errors: 0, Skipped: 0, Time elapsed: 0.261 sec - in org.apache.streams.util.schema.test.SchemaOrderingTest
compareObjectTypeFieldRef(org.apache.streams.util.schema.test.SchemaOrderingTest)  Time elapsed:
0.237 sec
compareVerbAncestorIndirect(org.apache.streams.util.schema.test.SchemaOrderingTest)  Time
elapsed: 0.007 sec
compareObjectTypeParent(org.apache.streams.util.schema.test.SchemaOrderingTest)  Time elapsed:
0.004 sec
compareVerbFieldRef(org.apache.streams.util.schema.test.SchemaOrderingTest)  Time elapsed:
0.004 sec
compareVerbParent(org.apache.streams.util.schema.test.SchemaOrderingTest)  Time elapsed: 0.004
sec
compareUnrelated(org.apache.streams.util.schema.test.SchemaOrderingTest)  Time elapsed: 0.003
sec
Running org.apache.streams.util.api.requests.backoff.ConstantTimeBackOffStrategyTest
Tests run: 1, Failures: 0, Errors: 0, Skipped: 0, Time elapsed: 0.011 sec - in org.apache.streams.util.api.requests.backoff.ConstantTimeBackOffStrategyTest
constantTimeBackOffStategy(org.apache.streams.util.api.requests.backoff.ConstantTimeBackOffStrategyTest)
 Time elapsed: 0.007 sec
Running org.apache.streams.util.api.requests.backoff.ExponentialBackOffStrategyTest
Tests run: 1, Failures: 0, Errors: 0, Skipped: 0, Time elapsed: 0.003 sec - in org.apache.streams.util.api.requests.backoff.ExponentialBackOffStrategyTest
exponentialTimeBackOffStrategyTest(org.apache.streams.util.api.requests.backoff.ExponentialBackOffStrategyTest)
 Time elapsed: 0.002 sec
Running org.apache.streams.util.api.requests.backoff.BackOffStrategyTest
Tests run: 3, Failures: 0, Errors: 0, Skipped: 0, Time elapsed: 2.118 sec - in org.apache.streams.util.api.requests.backoff.BackOffStrategyTest
testBackOffSleep(org.apache.streams.util.api.requests.backoff.BackOffStrategyTest)  Time elapsed:
2.002 sec
testUnlimitedBackOff(org.apache.streams.util.api.requests.backoff.BackOffStrategyTest)  Time
elapsed: 0.113 sec
testLimitedUseBackOff(org.apache.streams.util.api.requests.backoff.BackOffStrategyTest)  Time
elapsed: 0.002 sec
Running org.apache.streams.util.api.requests.backoff.LinearTimeBackOffStrategyTest
Tests run: 1, Failures: 0, Errors: 0, Skipped: 0, Time elapsed: 0.002 sec - in org.apache.streams.util.api.requests.backoff.LinearTimeBackOffStrategyTest
linearTimeBackOffStrategyTest(org.apache.streams.util.api.requests.backoff.LinearTimeBackOffStrategyTest)
 Time elapsed: 0.002 sec

Results :

Tests run: 16, Failures: 0, Errors: 0, Skipped: 0

[JENKINS] Recording test results
[JENKINS] Recording test results
[INFO] Installing <https://builds.apache.org/job/streams-project/ws/streams-util/target/streams-util-0.5.1-incubating-SNAPSHOT.jar>
to /home/jenkins/jenkins-slave/maven-repositories/0/org/apache/streams/streams-util/0.5.1-incubating-SNAPSHOT/streams-util-0.5.1-incubating-SNAPSHOT.jar
[INFO] Installing <https://builds.apache.org/job/streams-project/ws/streams-util/pom.xml>
to /home/jenkins/jenkins-slave/maven-repositories/0/org/apache/streams/streams-util/0.5.1-incubating-SNAPSHOT/streams-util-0.5.1-incubating-SNAPSHOT.pom
[INFO] Installing <https://builds.apache.org/job/streams-project/ws/streams-util/target/streams-util-0.5.1-incubating-SNAPSHOT-tests.jar>
to /home/jenkins/jenkins-slave/maven-repositories/0/org/apache/streams/streams-util/0.5.1-incubating-SNAPSHOT/streams-util-0.5.1-incubating-SNAPSHOT-tests.jar
Saving to outputFile=<https://builds.apache.org/job/streams-project/ws/streams-pojo/target/scalastyle-output.xml>
Processed 0 file(s)
Found 0 errors
Found 0 warnings
Found 0 infos
Finished in 2 ms
Saving to outputFile=<https://builds.apache.org/job/streams-project/ws/streams-pojo/target/scalastyle-output.xml>
Processed 0 file(s)
Found 0 errors
Found 0 warnings
Found 0 infos
Finished in 1 ms
[WARNING] Failed to getClass for org.apache.streams.plugins.StreamsPojoSourceGeneratorMojo

-------------------------------------------------------
 T E S T S
-------------------------------------------------------
Running org.apache.streams.pojo.test.DateTimeSerDeTest
Tests run: 3, Failures: 0, Errors: 0, Skipped: 1, Time elapsed: 0.41 sec - in org.apache.streams.pojo.test.DateTimeSerDeTest
testActivityStringSer(org.apache.streams.pojo.test.DateTimeSerDeTest) skipped
testMillisDeser(org.apache.streams.pojo.test.DateTimeSerDeTest)  Time elapsed: 0.066 sec
testActivityStringDeser(org.apache.streams.pojo.test.DateTimeSerDeTest)  Time elapsed: 0.006
sec
Running org.apache.streams.pojo.test.RFC3339UtilsTest
Tests run: 16, Failures: 0, Errors: 0, Skipped: 0, Time elapsed: 0.13 sec - in org.apache.streams.pojo.test.RFC3339UtilsTest
validFormat(org.apache.streams.pojo.test.RFC3339UtilsTest)  Time elapsed: 0.088 sec
validESTSubSecondMultiDigit(org.apache.streams.pojo.test.RFC3339UtilsTest)  Time elapsed:
0.003 sec
validUTCSubSecondMultiDigit(org.apache.streams.pojo.test.RFC3339UtilsTest)  Time elapsed:
0.001 sec
validCET(org.apache.streams.pojo.test.RFC3339UtilsTest)  Time elapsed: 0 sec
validEST(org.apache.streams.pojo.test.RFC3339UtilsTest)  Time elapsed: 0.001 sec
validUTC(org.apache.streams.pojo.test.RFC3339UtilsTest)  Time elapsed: 0 sec
validESTSubSecondNoSeparator(org.apache.streams.pojo.test.RFC3339UtilsTest)  Time elapsed:
0.001 sec
validLong(org.apache.streams.pojo.test.RFC3339UtilsTest)  Time elapsed: 0.009 sec
validCETSubSecondMultidigit(org.apache.streams.pojo.test.RFC3339UtilsTest)  Time elapsed:
0 sec
validESTNoSeparator(org.apache.streams.pojo.test.RFC3339UtilsTest)  Time elapsed: 0 sec
validCETSubSecond(org.apache.streams.pojo.test.RFC3339UtilsTest)  Time elapsed: 0 sec
testParseVariousDateFormats(org.apache.streams.pojo.test.RFC3339UtilsTest)  Time elapsed:
0.022 sec
validUTCSubSecond(org.apache.streams.pojo.test.RFC3339UtilsTest)  Time elapsed: 0.001 sec
validFormatUTC(org.apache.streams.pojo.test.RFC3339UtilsTest)  Time elapsed: 0 sec
validESTSubSecond(org.apache.streams.pojo.test.RFC3339UtilsTest)  Time elapsed: 0 sec
validESTSubSecondMultiDigitNoSeparator(org.apache.streams.pojo.test.RFC3339UtilsTest)  Time
elapsed: 0 sec
Running org.apache.streams.pojo.test.CustomDateTimeFormatTest
Tests run: 2, Failures: 0, Errors: 0, Skipped: 0, Time elapsed: 0.594 sec - in org.apache.streams.pojo.test.CustomDateTimeFormatTest
testCustomDateTimeFormatExplicit(org.apache.streams.pojo.test.CustomDateTimeFormatTest)  Time
elapsed: 0.571 sec
testCustomDateTimeFormatReflection(org.apache.streams.pojo.test.CustomDateTimeFormatTest)
 Time elapsed: 0.023 sec
Running org.apache.streams.pojo.test.ActivitySerDeTest
Tests run: 2, Failures: 0, Errors: 0, Skipped: 0, Time elapsed: 0.913 sec - in org.apache.streams.pojo.test.ActivitySerDeTest
testVerbSerDe(org.apache.streams.pojo.test.ActivitySerDeTest)  Time elapsed: 0.837 sec
testActivitySerDe(org.apache.streams.pojo.test.ActivitySerDeTest)  Time elapsed: 0.076 sec

Results :

Tests run: 23, Failures: 0, Errors: 0, Skipped: 1

[JENKINS] Recording test results
[JENKINS] Recording test results
[INFO] Installing <https://builds.apache.org/job/streams-project/ws/streams-pojo/target/streams-pojo-0.5.1-incubating-SNAPSHOT.jar>
to /home/jenkins/jenkins-slave/maven-repositories/0/org/apache/streams/streams-pojo/0.5.1-incubating-SNAPSHOT/streams-pojo-0.5.1-incubating-SNAPSHOT.jar
[INFO] Installing <https://builds.apache.org/job/streams-project/ws/streams-pojo/pom.xml>
to /home/jenkins/jenkins-slave/maven-repositories/0/org/apache/streams/streams-pojo/0.5.1-incubating-SNAPSHOT/streams-pojo-0.5.1-incubating-SNAPSHOT.pom
[INFO] Installing <https://builds.apache.org/job/streams-project/ws/streams-pojo/target/streams-pojo-0.5.1-incubating-SNAPSHOT-tests.jar>
to /home/jenkins/jenkins-slave/maven-repositories/0/org/apache/streams/streams-pojo/0.5.1-incubating-SNAPSHOT/streams-pojo-0.5.1-incubating-SNAPSHOT-tests.jar
[WARNING] The POM for org.apache.juneau:juneau-core:jar:6.3.0-incubating is missing, no dependency
information available
Waiting for Jenkins to finish collecting data
[ERROR] Failed to execute goal on project streams-core: Could not resolve dependencies for
project org.apache.streams:streams-core:jar:0.5.1-incubating-SNAPSHOT: Could not find artifact
org.apache.juneau:juneau-core:jar:6.3.0-incubating in central-repo (http://repo.maven.apache.org/maven2)
-> [Help 1]
[ERROR] 
[ERROR] To see the full stack trace of the errors, re-run Maven with the -e switch.
[ERROR] Re-run Maven using the -X switch to enable full debug logging.
[ERROR] 
[ERROR] For more information about the errors and possible solutions, please read the following
articles:
[ERROR] [Help 1] http://cwiki.apache.org/confluence/display/MAVEN/DependencyResolutionException
[ERROR] 
[ERROR] After correcting the problems, you can resume the build with the command
[ERROR]   mvn <goals> -rf :streams-core
[JENKINS] Archiving <https://builds.apache.org/job/streams-project/ws/streams-components/streams-filters/pom.xml>
to org.apache.streams/streams-filters/0.5.1-incubating-SNAPSHOT/streams-filters-0.5.1-incubating-SNAPSHOT.pom
[JENKINS] Archiving <https://builds.apache.org/job/streams-project/ws/streams-schemas/streams-schema-activitystreams2/pom.xml>
to org.apache.streams/streams-schema-activitystreams2/0.5.1-incubating-SNAPSHOT/streams-schema-activitystreams2-0.5.1-incubating-SNAPSHOT.pom
[JENKINS] Archiving <https://builds.apache.org/job/streams-project/ws/streams-core/pom.xml>
to org.apache.streams/streams-core/0.5.1-incubating-SNAPSHOT/streams-core-0.5.1-incubating-SNAPSHOT.pom
[JENKINS] Archiving <https://builds.apache.org/job/streams-project/ws/streams-contrib/streams-processor-regex/pom.xml>
to org.apache.streams/streams-processor-regex/0.5.1-incubating-SNAPSHOT/streams-processor-regex-0.5.1-incubating-SNAPSHOT.pom
[JENKINS] Archiving <https://builds.apache.org/job/streams-project/ws/streams-runtimes/pom.xml>
to org.apache.streams/streams-runtimes/0.5.1-incubating-SNAPSHOT/streams-runtimes-0.5.1-incubating-SNAPSHOT.pom
[JENKINS] Archiving <https://builds.apache.org/job/streams-project/ws/streams-contrib/streams-persist-filebuffer/pom.xml>
to org.apache.streams/streams-persist-filebuffer/0.5.1-incubating-SNAPSHOT/streams-persist-filebuffer-0.5.1-incubating-SNAPSHOT.pom
[JENKINS] Archiving <https://builds.apache.org/job/streams-project/ws/streams-plugins/streams-plugin-hive/pom.xml>
to org.apache.streams.plugins/streams-plugin-hive/0.5.1-incubating-SNAPSHOT/streams-plugin-hive-0.5.1-incubating-SNAPSHOT.pom
[JENKINS] Archiving <https://builds.apache.org/job/streams-project/ws/streams-components/streams-converters/pom.xml>
to org.apache.streams/streams-converters/0.5.1-incubating-SNAPSHOT/streams-converters-0.5.1-incubating-SNAPSHOT.pom
[JENKINS] Archiving <https://builds.apache.org/job/streams-project/ws/streams-contrib/streams-persist-console/pom.xml>
to org.apache.streams/streams-persist-console/0.5.1-incubating-SNAPSHOT/streams-persist-console-0.5.1-incubating-SNAPSHOT.pom
[JENKINS] Archiving <https://builds.apache.org/job/streams-project/ws/streams-contrib/pom.xml>
to org.apache.streams/streams-contrib/0.5.1-incubating-SNAPSHOT/streams-contrib-0.5.1-incubating-SNAPSHOT.pom
[JENKINS] Archiving <https://builds.apache.org/job/streams-project/ws/streams-contrib/streams-amazon-aws/pom.xml>
to org.apache.streams/streams-amazon-aws/0.5.1-incubating-SNAPSHOT/streams-amazon-aws-0.5.1-incubating-SNAPSHOT.pom
[JENKINS] Archiving <https://builds.apache.org/job/streams-project/ws/streams-contrib/streams-processor-json/pom.xml>
to org.apache.streams/streams-processor-json/0.5.1-incubating-SNAPSHOT/streams-processor-json-0.5.1-incubating-SNAPSHOT.pom
[JENKINS] Archiving <https://builds.apache.org/job/streams-project/ws/streams-plugins/streams-plugin-pig/pom.xml>
to org.apache.streams.plugins/streams-plugin-pig/0.5.1-incubating-SNAPSHOT/streams-plugin-pig-0.5.1-incubating-SNAPSHOT.pom
[JENKINS] Archiving <https://builds.apache.org/job/streams-project/ws/streams-contrib/streams-persist-neo4j/pom.xml>
to org.apache.streams/streams-persist-neo4j/0.5.1-incubating-SNAPSHOT/streams-persist-neo4j-0.5.1-incubating-SNAPSHOT.pom
[JENKINS] Archiving <https://builds.apache.org/job/streams-project/ws/streams-contrib/streams-processor-peoplepattern/pom.xml>
to org.apache.streams/streams-processor-peoplepattern/0.5.1-incubating-SNAPSHOT/streams-processor-peoplepattern-0.5.1-incubating-SNAPSHOT.pom
[JENKINS] Archiving <https://builds.apache.org/job/streams-project/ws/streams-contrib/streams-provider-rss/pom.xml>
to org.apache.streams/streams-provider-rss/0.5.1-incubating-SNAPSHOT/streams-provider-rss-0.5.1-incubating-SNAPSHOT.pom
[JENKINS] Archiving <https://builds.apache.org/job/streams-project/ws/streams-plugins/streams-plugin-hbase/pom.xml>
to org.apache.streams.plugins/streams-plugin-hbase/0.5.1-incubating-SNAPSHOT/streams-plugin-hbase-0.5.1-incubating-SNAPSHOT.pom
[JENKINS] Archiving <https://builds.apache.org/job/streams-project/ws/streams-components/streams-http/pom.xml>
to org.apache.streams/streams-http/0.5.1-incubating-SNAPSHOT/streams-http-0.5.1-incubating-SNAPSHOT.pom
[JENKINS] Archiving <https://builds.apache.org/job/streams-project/ws/streams-plugins/streams-plugin-pojo/pom.xml>
to org.apache.streams.plugins/streams-plugin-pojo/0.5.1-incubating-SNAPSHOT/streams-plugin-pojo-0.5.1-incubating-SNAPSHOT.pom
[JENKINS] Archiving <https://builds.apache.org/job/streams-project/ws/streams-plugins/streams-plugin-pojo/target/streams-plugin-pojo-0.5.1-incubating-SNAPSHOT.jar>
to org.apache.streams.plugins/streams-plugin-pojo/0.5.1-incubating-SNAPSHOT/streams-plugin-pojo-0.5.1-incubating-SNAPSHOT.jar
[JENKINS] Archiving <https://builds.apache.org/job/streams-project/ws/streams-pojo/pom.xml>
to org.apache.streams/streams-pojo/0.5.1-incubating-SNAPSHOT/streams-pojo-0.5.1-incubating-SNAPSHOT.pom
[JENKINS] Archiving <https://builds.apache.org/job/streams-project/ws/streams-pojo/target/streams-pojo-0.5.1-incubating-SNAPSHOT.jar>
to org.apache.streams/streams-pojo/0.5.1-incubating-SNAPSHOT/streams-pojo-0.5.1-incubating-SNAPSHOT.jar
[JENKINS] Archiving <https://builds.apache.org/job/streams-project/ws/streams-pojo/target/streams-pojo-0.5.1-incubating-SNAPSHOT-tests.jar>
to org.apache.streams/streams-pojo/0.5.1-incubating-SNAPSHOT/streams-pojo-0.5.1-incubating-SNAPSHOT-tests.jar
[JENKINS] Archiving <https://builds.apache.org/job/streams-project/ws/streams-contrib/streams-amazon-aws/streams-persist-kinesis/pom.xml>
to org.apache.streams/streams-persist-kinesis/0.5.1-incubating-SNAPSHOT/streams-persist-kinesis-0.5.1-incubating-SNAPSHOT.pom
[JENKINS] Archiving <https://builds.apache.org/job/streams-project/ws/streams-plugins/streams-plugin-scala/pom.xml>
to org.apache.streams.plugins/streams-plugin-scala/0.5.1-incubating-SNAPSHOT/streams-plugin-scala-0.5.1-incubating-SNAPSHOT.pom
[JENKINS] Archiving <https://builds.apache.org/job/streams-project/ws/streams-contrib/streams-processor-urls/pom.xml>
to org.apache.streams/streams-processor-urls/0.5.1-incubating-SNAPSHOT/streams-processor-urls-0.5.1-incubating-SNAPSHOT.pom
[JENKINS] Archiving <https://builds.apache.org/job/streams-project/ws/streams-contrib/streams-provider-google/google-gmail/pom.xml>
to org.apache.streams/streams-provider-google-gmail/0.5.1-incubating-SNAPSHOT/streams-provider-google-gmail-0.5.1-incubating-SNAPSHOT.pom
[JENKINS] Archiving <https://builds.apache.org/job/streams-project/ws/streams-plugins/streams-plugin-elasticsearch/pom.xml>
to org.apache.streams.plugins/streams-plugin-elasticsearch/0.5.1-incubating-SNAPSHOT/streams-plugin-elasticsearch-0.5.1-incubating-SNAPSHOT.pom
[JENKINS] Archiving <https://builds.apache.org/job/streams-project/ws/streams-runtimes/streams-runtime-dropwizard/pom.xml>
to org.apache.streams/streams-runtime-dropwizard/0.5.1-incubating-SNAPSHOT/streams-runtime-dropwizard-0.5.1-incubating-SNAPSHOT.pom
[JENKINS] Archiving <https://builds.apache.org/job/streams-project/ws/streams-contrib/streams-provider-google/pom.xml>
to org.apache.streams/streams-provider-google/0.5.1-incubating-SNAPSHOT/streams-provider-google-0.5.1-incubating-SNAPSHOT.pom
[JENKINS] Archiving <https://builds.apache.org/job/streams-project/ws/streams-pojo-extensions/pom.xml>
to org.apache.streams/streams-pojo-extensions/0.5.1-incubating-SNAPSHOT/streams-pojo-extensions-0.5.1-incubating-SNAPSHOT.pom
[JENKINS] Archiving <https://builds.apache.org/job/streams-project/ws/streams-contrib/streams-processor-jackson/pom.xml>
to org.apache.streams/streams-processor-jackson/0.5.1-incubating-SNAPSHOT/streams-processor-jackson-0.5.1-incubating-SNAPSHOT.pom
[JENKINS] Archiving <https://builds.apache.org/job/streams-project/ws/streams-components/pom.xml>
to org.apache.streams/streams-components/0.5.1-incubating-SNAPSHOT/streams-components-0.5.1-incubating-SNAPSHOT.pom
[JENKINS] Archiving <https://builds.apache.org/job/streams-project/ws/streams-schemas/streams-schema-activitystreams/pom.xml>
to org.apache.streams/streams-schema-activitystreams/0.5.1-incubating-SNAPSHOT/streams-schema-activitystreams-0.5.1-incubating-SNAPSHOT.pom
[JENKINS] Archiving <https://builds.apache.org/job/streams-project/ws/streams-schemas/streams-schema-activitystreams/target/streams-schema-activitystreams-0.5.1-incubating-SNAPSHOT.jar>
to org.apache.streams/streams-schema-activitystreams/0.5.1-incubating-SNAPSHOT/streams-schema-activitystreams-0.5.1-incubating-SNAPSHOT.jar
[JENKINS] Archiving <https://builds.apache.org/job/streams-project/ws/streams-schemas/streams-schema-activitystreams/target/streams-schema-activitystreams-0.5.1-incubating-SNAPSHOT-tests.jar>
to org.apache.streams/streams-schema-activitystreams/0.5.1-incubating-SNAPSHOT/streams-schema-activitystreams-0.5.1-incubating-SNAPSHOT-tests.jar
[JENKINS] Archiving <https://builds.apache.org/job/streams-project/ws/streams-contrib/streams-provider-sysomos/pom.xml>
to org.apache.streams/streams-provider-sysomos/0.5.1-incubating-SNAPSHOT/streams-provider-sysomos-0.5.1-incubating-SNAPSHOT.pom
[JENKINS] Archiving <https://builds.apache.org/job/streams-project/ws/streams-contrib/streams-provider-youtube/pom.xml>
to org.apache.streams/streams-provider-youtube/0.5.1-incubating-SNAPSHOT/streams-provider-youtube-0.5.1-incubating-SNAPSHOT.pom
[JENKINS] Archiving <https://builds.apache.org/job/streams-project/ws/streams-schemas/pom.xml>
to org.apache.streams/streams-schemas/0.5.1-incubating-SNAPSHOT/streams-schemas-0.5.1-incubating-SNAPSHOT.pom
[JENKINS] Archiving <https://builds.apache.org/job/streams-project/ws/streams-contrib/streams-provider-facebook/pom.xml>
to org.apache.streams/streams-provider-facebook/0.5.1-incubating-SNAPSHOT/streams-provider-facebook-0.5.1-incubating-SNAPSHOT.pom
[JENKINS] Archiving <https://builds.apache.org/job/streams-project/ws/streams-contrib/streams-persist-cassandra/pom.xml>
to org.apache.streams/streams-persist-cassandra/0.5.1-incubating-SNAPSHOT/streams-persist-cassandra-0.5.1-incubating-SNAPSHOT.pom
[JENKINS] Archiving <https://builds.apache.org/job/streams-project/ws/streams-contrib/streams-persist-elasticsearch/pom.xml>
to org.apache.streams/streams-persist-elasticsearch/0.5.1-incubating-SNAPSHOT/streams-persist-elasticsearch-0.5.1-incubating-SNAPSHOT.pom
[JENKINS] Archiving <https://builds.apache.org/job/streams-project/ws/streams-contrib/streams-provider-google/google-gplus/pom.xml>
to org.apache.streams/streams-provider-google-gplus/0.5.1-incubating-SNAPSHOT/streams-provider-google-gplus-0.5.1-incubating-SNAPSHOT.pom
[JENKINS] Archiving <https://builds.apache.org/job/streams-project/ws/streams-config/pom.xml>
to org.apache.streams/streams-config/0.5.1-incubating-SNAPSHOT/streams-config-0.5.1-incubating-SNAPSHOT.pom
[JENKINS] Archiving <https://builds.apache.org/job/streams-project/ws/streams-config/target/streams-config-0.5.1-incubating-SNAPSHOT.jar>
to org.apache.streams/streams-config/0.5.1-incubating-SNAPSHOT/streams-config-0.5.1-incubating-SNAPSHOT.jar
[JENKINS] Archiving <https://builds.apache.org/job/streams-project/ws/streams-util/pom.xml>
to org.apache.streams/streams-util/0.5.1-incubating-SNAPSHOT/streams-util-0.5.1-incubating-SNAPSHOT.pom
[JENKINS] Archiving <https://builds.apache.org/job/streams-project/ws/streams-util/target/streams-util-0.5.1-incubating-SNAPSHOT.jar>
to org.apache.streams/streams-util/0.5.1-incubating-SNAPSHOT/streams-util-0.5.1-incubating-SNAPSHOT.jar
[JENKINS] Archiving <https://builds.apache.org/job/streams-project/ws/streams-util/target/streams-util-0.5.1-incubating-SNAPSHOT-tests.jar>
to org.apache.streams/streams-util/0.5.1-incubating-SNAPSHOT/streams-util-0.5.1-incubating-SNAPSHOT-tests.jar
[JENKINS] Archiving <https://builds.apache.org/job/streams-project/ws/streams-contrib/streams-persist-hdfs/pom.xml>
to org.apache.streams/streams-persist-hdfs/0.5.1-incubating-SNAPSHOT/streams-persist-hdfs-0.5.1-incubating-SNAPSHOT.pom
[JENKINS] Archiving <https://builds.apache.org/job/streams-project/ws/streams-plugins/pom.xml>
to org.apache.streams.plugins/streams-plugins/0.5.1-incubating-SNAPSHOT/streams-plugins-0.5.1-incubating-SNAPSHOT.pom
[JENKINS] Archiving <https://builds.apache.org/job/streams-project/ws/pom.xml> to org.apache.streams/streams-project/0.5.1-incubating-SNAPSHOT/streams-project-0.5.1-incubating-SNAPSHOT.pom
[JENKINS] Archiving <https://builds.apache.org/job/streams-project/ws/target/streams-project-0.5.1-incubating-SNAPSHOT-site.xml>
to org.apache.streams/streams-project/0.5.1-incubating-SNAPSHOT/streams-project-0.5.1-incubating-SNAPSHOT-site.xml
Compressed 67.86 KB of artifacts by 94.3% relative to #375
[JENKINS] Archiving <https://builds.apache.org/job/streams-project/ws/streams-contrib/streams-provider-twitter/pom.xml>
to org.apache.streams/streams-provider-twitter/0.5.1-incubating-SNAPSHOT/streams-provider-twitter-0.5.1-incubating-SNAPSHOT.pom
[JENKINS] Archiving <https://builds.apache.org/job/streams-project/ws/streams-contrib/streams-amazon-aws/streams-persist-s3/pom.xml>
to org.apache.streams/streams-persist-s3/0.5.1-incubating-SNAPSHOT/streams-persist-s3-0.5.1-incubating-SNAPSHOT.pom
[JENKINS] Archiving <https://builds.apache.org/job/streams-project/ws/streams-verbs/pom.xml>
to org.apache.streams/streams-verbs/0.5.1-incubating-SNAPSHOT/streams-verbs-0.5.1-incubating-SNAPSHOT.pom
[JENKINS] Archiving <https://builds.apache.org/job/streams-project/ws/streams-contrib/streams-provider-instagram/pom.xml>
to org.apache.streams/streams-provider-instagram/0.5.1-incubating-SNAPSHOT/streams-provider-instagram-0.5.1-incubating-SNAPSHOT.pom
[JENKINS] Archiving <https://builds.apache.org/job/streams-project/ws/streams-contrib/streams-persist-kafka/pom.xml>
to org.apache.streams/streams-persist-kafka/0.5.1-incubating-SNAPSHOT/streams-persist-kafka-0.5.1-incubating-SNAPSHOT.pom
[JENKINS] Archiving <https://builds.apache.org/job/streams-project/ws/streams-contrib/streams-provider-moreover/pom.xml>
to org.apache.streams/streams-provider-moreover/0.5.1-incubating-SNAPSHOT/streams-provider-moreover-0.5.1-incubating-SNAPSHOT.pom
[JENKINS] Archiving <https://builds.apache.org/job/streams-project/ws/streams-monitoring/pom.xml>
to org.apache.streams/streams-monitoring/0.5.1-incubating-SNAPSHOT/streams-monitoring-0.5.1-incubating-SNAPSHOT.pom
[JENKINS] Archiving <https://builds.apache.org/job/streams-project/ws/streams-contrib/streams-persist-graph/pom.xml>
to org.apache.streams/streams-persist-graph/0.5.1-incubating-SNAPSHOT/streams-persist-graph-0.5.1-incubating-SNAPSHOT.pom
[JENKINS] Archiving <https://builds.apache.org/job/streams-project/ws/streams-contrib/streams-persist-riak/pom.xml>
to org.apache.streams/streams-persist-riak/0.5.1-incubating-SNAPSHOT/streams-persist-riak-0.5.1-incubating-SNAPSHOT.pom
[JENKINS] Archiving <https://builds.apache.org/job/streams-project/ws/streams-testing/pom.xml>
to org.apache.streams/streams-testing/0.5.1-incubating-SNAPSHOT/streams-testing-0.5.1-incubating-SNAPSHOT.pom
[JENKINS] Archiving <https://builds.apache.org/job/streams-project/ws/streams-testing/target/streams-testing-0.5.1-incubating-SNAPSHOT.jar>
to org.apache.streams/streams-testing/0.5.1-incubating-SNAPSHOT/streams-testing-0.5.1-incubating-SNAPSHOT.jar
[JENKINS] Archiving <https://builds.apache.org/job/streams-project/ws/streams-testing/target/streams-testing-0.5.1-incubating-SNAPSHOT-tests.jar>
to org.apache.streams/streams-testing/0.5.1-incubating-SNAPSHOT/streams-testing-0.5.1-incubating-SNAPSHOT-tests.jar
[JENKINS] Archiving <https://builds.apache.org/job/streams-project/ws/streams-contrib/streams-persist-hbase/pom.xml>
to org.apache.streams/streams-persist-hbase/0.5.1-incubating-SNAPSHOT/streams-persist-hbase-0.5.1-incubating-SNAPSHOT.pom
[JENKINS] Archiving <https://builds.apache.org/job/streams-project/ws/streams-contrib/streams-persist-mongo/pom.xml>
to org.apache.streams/streams-persist-mongo/0.5.1-incubating-SNAPSHOT/streams-persist-mongo-0.5.1-incubating-SNAPSHOT.pom
[JENKINS] Archiving <https://builds.apache.org/job/streams-project/ws/streams-plugins/streams-plugin-cassandra/pom.xml>
to org.apache.streams.plugins/streams-plugin-cassandra/0.5.1-incubating-SNAPSHOT/streams-plugin-cassandra-0.5.1-incubating-SNAPSHOT.pom
[JENKINS] Archiving <https://builds.apache.org/job/streams-project/ws/streams-runtimes/streams-runtime-local/pom.xml>
to org.apache.streams/streams-runtime-local/0.5.1-incubating-SNAPSHOT/streams-runtime-local-0.5.1-incubating-SNAPSHOT.pom
channel stopped

Mime
View raw message